Build #3

Build: #3 failed

Job: Default Job failed

Stages & jobs

  1. Default Stage

Build log

The build generated 91 lines of output. Download or view full build log

19-Jul-2018 17:45:22 Build CDAP Navigator - Deploy Artifacts - release-0.8 - Default Job #3 (NAV-DA33-JOB1-3) started building on agent bamboo-agent16.prod.continuuity.net
19-Jul-2018 17:45:23 Remote Agent
19-Jul-2018 17:45:23 Build working directory is /var/bamboo/xml-data/build-dir/NAV-DA33-JOB1
19-Jul-2018 17:45:23 Executing build CDAP Navigator - Deploy Artifacts - release-0.8 - Default Job #3 (NAV-DA33-JOB1-3)
19-Jul-2018 17:45:23 Starting task 'Checkout Default Repository' of type 'com.atlassian.bamboo.plugins.vcs:task.vcs.checkout'
19-Jul-2018 17:45:23 Build always requires a clean checkout
19-Jul-2018 17:45:23 Cleaning build directory '/var/bamboo/xml-data/build-dir/NAV-DA33-JOB1'
19-Jul-2018 17:45:23 Checking out into /var/bamboo/xml-data/build-dir/NAV-DA33-JOB1
19-Jul-2018 17:45:23 Updating source code to revision: e2670474aba856293cb6837bf3d77dd86ea5e105
19-Jul-2018 17:45:23 Creating local git repository in '/var/bamboo/xml-data/build-dir/_git-repositories-cache/9f48b719048b7683dfef655940fb3b61e978324a/.git'.
19-Jul-2018 17:45:23 Initialized empty Git repository in /var/bamboo/xml-data/build-dir/_git-repositories-cache/9f48b719048b7683dfef655940fb3b61e978324a/.git/
19-Jul-2018 17:45:23 Fetching 'refs/heads/release/0.8' from 'https://github.com/caskdata/cdap-navigator.git'.
19-Jul-2018 17:45:24 From https://github.com/caskdata/cdap-navigator
19-Jul-2018 17:45:24 * [new branch]      release/0.8 -> release/0.8
19-Jul-2018 17:45:24 * [new tag]         v0.2       -> v0.2
19-Jul-2018 17:45:24 * [new tag]         v0.4       -> v0.4
19-Jul-2018 17:45:24 Checking out revision e2670474aba856293cb6837bf3d77dd86ea5e105.
19-Jul-2018 17:45:24 Creating local git repository in '/var/bamboo/xml-data/build-dir/NAV-DA33-JOB1/.git'.
19-Jul-2018 17:45:24 Cloning into '/var/bamboo/xml-data/build-dir/NAV-DA33-JOB1'...
19-Jul-2018 17:45:24 done.
19-Jul-2018 17:45:24 Switched to a new branch 'release/0.8'
19-Jul-2018 17:45:24 Branch release/0.8 set up to track remote branch release/0.8 from origin.
19-Jul-2018 17:45:24 Updated source code to revision: e2670474aba856293cb6837bf3d77dd86ea5e105
19-Jul-2018 17:45:24 Finished task 'Checkout Default Repository' with result: Success
19-Jul-2018 17:45:24 Running pre-build action: VCS Version Collector
19-Jul-2018 17:45:24
Substituting password variable: ${bamboo.gpg.password}
19-Jul-2018 17:45:24 Starting task 'Deploy artifacts' of type 'com.atlassian.bamboo.plugins.maven:task.builder.mvn3'
19-Jul-2018 17:45:24
Beginning to execute external process for build 'CDAP Navigator - Deploy Artifacts - release-0.8 - Default Job #3 (NAV-DA33-JOB1-3)'
... running command line:
/opt/maven/bin/mvn --batch-mode -Djava.io.tmpdir=/tmp/NAV-DA33-JOB1 --gs /home/bamboo/.m2/settings.xml deploy -DskipTests -Dcask.packages.snapshot.repo=https://repository.continuuity.com/content/repositories/snapshots-oss -Dcask.packages.release.repo=https://repository.continuuity.com/service/local/staging/deploy/maven2 -P release -Dgpg.passphrase=******** -Dgpg.useagent=false
... in: /var/bamboo/xml-data/build-dir/NAV-DA33-JOB1
... using extra environment variables:
bamboo_planRepository_1_branch=release/0.8
bamboo_planRepository_1_branchDisplayName=release/0.8
bamboo_repository_revision_number=e2670474aba856293cb6837bf3d77dd86ea5e105
MAVEN2_HOME=/opt/maven
bamboo_repository_77005326_branch_name=release/0.8
bamboo_capability_system_builder_command_s3cmd=/usr/bin/s3cmd
bamboo_docs_s3_bucket=docs.cask.co
bamboo_buildKey=NAV-DA33-JOB1
bamboo_gpg_password=********
bamboo_ops_gpg_password=********
bamboo_shortJobName=Default Job
bamboo_buildResultsUrl=http://builds.cask.co/browse/NAV-DA33-JOB1-3
bamboo_capability_system_builder_mvn3_Maven_3_1=/opt/maven
bamboo_planRepository_repositoryUrl=https://github.com/caskdata/cdap-navigator.git
bamboo_repository_s3_bucket=repository.cask.co
bamboo_repository_77005326_previous_revision_number=654c9e010674d2e6afd7f5f116fbe98cc1542ad6
bamboo_aws_secret_access_key_password=********
bamboo_agentId=32243724
bamboo_capability_Swapfile=true
bamboo_planRepository_revision=e2670474aba856293cb6837bf3d77dd86ea5e105
bamboo_planRepository_previousRevision=654c9e010674d2e6afd7f5f116fbe98cc1542ad6
bamboo_capability_RHEL=rhel
bamboo_capability_freight=true
bamboo_repository_branch_name=release/0.8
bamboo_kdc_address_password=********
bamboo_capability_GPG=GPG
bamboo_capability_system_jdk_Oracle_JDK_8=/usr/lib/jvm/jdk8
JAVA_HOME=/usr/lib/jvm/jdk1.7.0_75
bamboo_capability_system_jdk_Oracle_JDK_7=/usr/lib/jvm/jdk7
bamboo_downloads_s3_bucket=downloads.cask.co
bamboo_planRepository_branch=release/0.8
bamboo_market_s3_access_key_password=********
bamboo_planRepository_1_type=gitv2
bamboo_planRepository_branchName=release/0.8
bamboo_capability_SPHINX=Sphinx
bamboo_capability_rsync=true
bamboo_market_cloudfront_secret_key_password=********
bamboo_capability_system_jdk_JDK=/usr/lib/jvm/jdk1.7.0_75
bamboo_hg_cache_directory=/var/bamboo/xml-data/build-dir/_hg-repositories-cache
bamboo_planRepository_1_username=
bamboo_planRepository_type=gitv2
bamboo_capability_expect=true
bamboo_git_cache_directory=/var/bamboo/xml-data/build-dir/_git-repositories-cache
bamboo_capability_RSYNC=rsync
useMavenReturnCode=false
bamboo_capability_system_builder_node_Node_js=/usr/bin/node
bamboo_capability_system_builder_mvn3_Maven_3=/opt/maven
bamboo_tmp_directory=/var/bamboo/temp
bamboo_planKey=NAV-DA33
bamboo_hide_jdk_mirror_password=********
bamboo_planRepository_username=
bamboo_capability_s3cmd=true
bamboo_planRepository_1_branchName=release/0.8
bamboo_repository_77005326_git_branch=release/0.8
bamboo_resultsUrl=http://builds.cask.co/browse/NAV-DA33-JOB1-3
bamboo_capability_Sphinx=true
bamboo_build_working_directory=/var/bamboo/xml-data/build-dir/NAV-DA33-JOB1
bamboo_planRepository_1_name=caskdata/cdap-navigator
bamboo_shortPlanName=release-0.8
bamboo_planRepository_name=caskdata/cdap-navigator
bamboo_capability_git_lfs=true
bamboo_buildNumber=3
bamboo_repository_77005326_revision_number=e2670474aba856293cb6837bf3d77dd86ea5e105
bamboo_planName=CDAP Navigator - Deploy Artifacts - release-0.8
bamboo_shortPlanKey=DA33
bamboo_shortJobKey=JOB1
bamboo_buildTimeStamp=2018-07-19T17:45:22.836Z
bamboo_repository_previous_revision_number=654c9e010674d2e6afd7f5f116fbe98cc1542ad6
bamboo_repository_77005326_git_username=
M2_HOME=/opt/maven
bamboo_s3_bucket=repository.cask.co
bamboo_capability_system_builder_command_Docker=/usr/bin/docker
bamboo_repository_git_branch=release/0.8
bamboo_buildResultKey=NAV-DA33-JOB1-3
bamboo_market_s3_secret_key_password=********
bamboo_buildPlanName=CDAP Navigator - Deploy Artifacts - release-0.8 - Default Job
bamboo_capability_system_jdk_JDK_1_8_0_101=/usr/lib/jvm/jdk1.8.0_101
bamboo_capability_system_builder_command_fpm=/opt/rbenv/shims/fpm
bamboo_capability_Platform=rhel
bamboo_planRepository_1_revision=e2670474aba856293cb6837bf3d77dd86ea5e105
bamboo_repository_name=caskdata/cdap-navigator
bamboo_buildFailed=false
bamboo_repository_77005326_name=caskdata/cdap-navigator
bamboo_capability_system_docker_executable=/usr/bin/docker
bamboo_agentWorkingDirectory=/var/bamboo/xml-data/build-dir
bamboo_capability_system_git_executable=/usr/local/bin/git
bamboo_repository_git_username=
bamboo_planRepository_1_previousRevision=654c9e010674d2e6afd7f5f116fbe98cc1542ad6
bamboo_capability_system_builder_command_Ruby=/opt/rbenv/shims/ruby
bamboo_planRepository_branchDisplayName=release/0.8
bamboo_aws_access_key_password=********
bamboo_capability_system_builder_mvn3_Maven_3_x=/opt/maven
bamboo_plan_storageTag=plan-76808875
bamboo_repository_git_repositoryUrl=https://github.com/caskdata/cdap-navigator.git
bamboo_market_cloudfront_access_key_password=********
bamboo_working_directory=/var/bamboo/xml-data/build-dir/NAV-DA33-JOB1
bamboo_planRepository_1_repositoryUrl=https://github.com/caskdata/cdap-navigator.git
bamboo_capability_createrepo=true
bamboo_capability_system_jdk_JDK_1_8=/usr/lib/jvm/jdk1.8.0_101
bamboo_repository_77005326_git_repositoryUrl=https://github.com/caskdata/cdap-navigator.git
bamboo_capability_rpm_build=true
bamboo_capability_system_jdk_JDK_1_7=/usr/lib/jvm/jdk1.7.0_75
PATH=/usr/lib/jvm/jdk1.7.0_75/bin:/usr/lib/jvm/java/bin:/opt/rbenv/shims:/opt/rbenv/bin:/opt/rbenv/plugins/ruby_build/bin:/usr/local/maven-3.1.1/bin:/usr/local/bin:/bin:/usr/bin:/usr/local/sbin:/usr/sbin:/sbin:/home/bamboo/bin
19-Jul-2018 17:45:28 [INFO] Scanning for projects...
19-Jul-2018 17:45:34 [INFO] Inspecting build with total of 1 modules...
19-Jul-2018 17:45:34 [INFO] Installing Nexus Staging features:
19-Jul-2018 17:45:34 [INFO]   ... total of 1 executions of maven-deploy-plugin replaced with nexus-staging-maven-plugin
19-Jul-2018 17:45:34 [INFO]                                                                         
19-Jul-2018 17:45:34 [INFO] ------------------------------------------------------------------------
19-Jul-2018 17:45:34 [INFO] Building Navigator Metadata Application 0.8.0-SNAPSHOT
19-Jul-2018 17:45:34 [INFO] ------------------------------------------------------------------------
19-Jul-2018 17:45:45 [INFO]
19-Jul-2018 17:45:45 [INFO] --- apache-rat-plugin:0.10:check (rat-check) @ navigator ---
19-Jul-2018 17:45:47 [INFO] 51 implicit excludes (use -debug for more details).
19-Jul-2018 17:45:47 [INFO] Exclude: build-number.txt
19-Jul-2018 17:45:47 [INFO] Exclude: LICENSE*.txt
19-Jul-2018 17:45:47 [INFO] Exclude: *.rst
19-Jul-2018 17:45:47 [INFO] Exclude: *.md
19-Jul-2018 17:45:47 [INFO] Exclude: **/*.md
19-Jul-2018 17:45:47 [INFO] Exclude: **/resources/**/*.properties
19-Jul-2018 17:45:47 [INFO] Exclude: **/*.json.template
19-Jul-2018 17:45:47 [INFO] Exclude: **/MANIFEST.MF
19-Jul-2018 17:45:47 [INFO] 22 resources included (use -debug for more details)
19-Jul-2018 17:45:48 [INFO] Rat check: Summary of files. Unapproved: 0 unknown: 0 generated: 0 approved: 22 licence.
19-Jul-2018 17:45:48 [INFO]
19-Jul-2018 17:45:48 [INFO] --- maven-resources-plugin:2.6:resources (default-resources) @ navigator ---
19-Jul-2018 17:45:48 [INFO] Using 'UTF-8' encoding to copy filtered resources.
19-Jul-2018 17:45:48 [INFO] skip non existing resourceDirectory /var/bamboo/xml-data/build-dir/NAV-DA33-JOB1/src/main/resources
19-Jul-2018 17:45:48 [INFO]
19-Jul-2018 17:45:48 [INFO] --- maven-compiler-plugin:3.1:compile (default-compile) @ navigator ---
19-Jul-2018 17:45:49 [INFO] Changes detected - recompiling the module!
19-Jul-2018 17:45:49 [INFO] Compiling 18 source files to /var/bamboo/xml-data/build-dir/NAV-DA33-JOB1/target/classes
19-Jul-2018 17:45:49 [INFO] ------------------------------------------------------------------------
19-Jul-2018 17:45:49 [INFO] BUILD FAILURE
19-Jul-2018 17:45:49 [INFO] ------------------------------------------------------------------------
19-Jul-2018 17:45:49 [INFO] Total time: 21.513s
19-Jul-2018 17:45:49 [INFO] Finished at: Thu Jul 19 17:45:49 UTC 2018
19-Jul-2018 17:45:49 [INFO] Final Memory: 29M/224M
19-Jul-2018 17:45:49 [INFO] ------------------------------------------------------------------------
19-Jul-2018 17:45:49 [ERROR] Failed to execute goal org.apache.maven.plugins:maven-compiler-plugin:3.1:compile (default-compile) on project navigator: Fatal error compiling: invalid target release: 1.8 -> [Help 1]
19-Jul-2018 17:45:49 [ERROR]
19-Jul-2018 17:45:49 [ERROR] To see the full stack trace of the errors, re-run Maven with the -e switch.
19-Jul-2018 17:45:49 [ERROR] Re-run Maven using the -X switch to enable full debug logging.
19-Jul-2018 17:45:49 [ERROR]
19-Jul-2018 17:45:49 [ERROR] For more information about the errors and possible solutions, please read the following articles:
19-Jul-2018 17:45:49 [ERROR] [Help 1] http://cwiki.apache.org/confluence/display/MAVEN/MojoExecutionException
19-Jul-2018 17:45:49 Failing task since return code of [/opt/maven/bin/mvn --batch-mode -Djava.io.tmpdir=/tmp/NAV-DA33-JOB1 --gs /home/bamboo/.m2/settings.xml deploy -DskipTests -Dcask.packages.snapshot.repo=https://repository.continuuity.com/content/repositories/snapshots-oss -Dcask.packages.release.repo=https://repository.continuuity.com/service/local/staging/deploy/maven2 -P release -Dgpg.passphrase=******** -Dgpg.useagent=false] was 1 while expected 0
19-Jul-2018 17:45:49 Finished task 'Deploy artifacts' with result: Failed
19-Jul-2018 17:45:49 Running post build plugin 'Docker Container Cleanup'
19-Jul-2018 17:45:49 Running post build plugin 'NCover Results Collector'
19-Jul-2018 17:45:49 Running post build plugin 'Clover Results Collector'
19-Jul-2018 17:45:49 Running post build plugin 'npm Cache Cleanup'
19-Jul-2018 17:45:49 Running post build plugin 'Artifact Copier'
19-Jul-2018 17:45:49 Finalising the build...
19-Jul-2018 17:45:49 Stopping timer.
19-Jul-2018 17:45:49 Build NAV-DA33-JOB1-3 completed.
19-Jul-2018 17:45:49 Running on server: post build plugin 'NCover Results Collector'
19-Jul-2018 17:45:49 Running on server: post build plugin 'Build Hanging Detection Configuration'
19-Jul-2018 17:45:49 Running on server: post build plugin 'Clover Delta Calculator'
19-Jul-2018 17:45:49 Running on server: post build plugin 'Maven Dependencies Postprocessor'
19-Jul-2018 17:45:49 All post build plugins have finished
19-Jul-2018 17:45:49 Generating build results summary...
19-Jul-2018 17:45:49 Saving build results to disk...
19-Jul-2018 17:45:50 Logging substituted variables...
19-Jul-2018 17:45:50 Indexing build results...
19-Jul-2018 17:45:50 Finished building NAV-DA33-JOB1-3.