Build #14

Deploy Microservice Artifacts

Build: #14 failed Changes by Gokul Gunasekaran

Logs

The following logs have been generated by the jobs in this plan.
  • Expand all
  • Collapse all
Job Logs
Collapse Default Job Default Stage Download or View
12-Sep-2017 03:10:58 [INFO] Building Microservice Prebuilts 1.2.0-SNAPSHOT
12-Sep-2017 03:10:58 [INFO] ------------------------------------------------------------------------
12-Sep-2017 03:10:58 [WARNING] The POM for co.cask:cdap-maven-plugin:jar:1.0-SNAPSHOT is missing, no dependency information available
12-Sep-2017 03:10:58 [INFO] ------------------------------------------------------------------------
12-Sep-2017 03:10:58 [INFO] Reactor Summary:
12-Sep-2017 03:10:58 [INFO]
12-Sep-2017 03:10:58 [INFO] Microservice Framework built over CDAP ............ SUCCESS [5.303s]
12-Sep-2017 03:10:58 [INFO] Microservice APIs ................................. SUCCESS [9.700s]
12-Sep-2017 03:10:58 [INFO] Microservice Core ................................. SUCCESS [37.601s]
12-Sep-2017 03:10:58 [INFO] Microservice Prebuilts ............................ FAILURE [0.016s]
12-Sep-2017 03:10:58 [INFO] Microservice Service .............................. SKIPPED
12-Sep-2017 03:10:58 [INFO] ------------------------------------------------------------------------
12-Sep-2017 03:10:58 [INFO] BUILD FAILURE
12-Sep-2017 03:10:58 [INFO] ------------------------------------------------------------------------
12-Sep-2017 03:10:58 [INFO] Total time: 56.058s
12-Sep-2017 03:10:58 [INFO] Finished at: Tue Sep 12 03:10:58 UTC 2017
12-Sep-2017 03:10:58 [INFO] Final Memory: 89M/1095M
12-Sep-2017 03:10:58 [INFO] ------------------------------------------------------------------------
12-Sep-2017 03:10:58 [ERROR] Plugin co.cask:cdap-maven-plugin:1.0-SNAPSHOT or one of its dependencies could not be resolved: Could not find artifact co.cask:cdap-maven-plugin:jar:1.0-SNAPSHOT -> [Help 1]
12-Sep-2017 03:10:58 [ERROR]
12-Sep-2017 03:10:58 [ERROR] To see the full stack trace of the errors, re-run Maven with the -e switch.
12-Sep-2017 03:10:58 [ERROR] Re-run Maven using the -X switch to enable full debug logging.
12-Sep-2017 03:10:58 [ERROR]
12-Sep-2017 03:10:58 [ERROR] For more information about the errors and possible solutions, please read the following articles:
12-Sep-2017 03:10:58 [ERROR] [Help 1] http://cwiki.apache.org/confluence/display/MAVEN/PluginResolutionException