Build #2

Build Microservices Repo and run Unit Tests

Build: #2 was successful

Job: Default Job was successful

Stages & jobs

  1. Default Stage

Build log

The build generated 809 lines of output. Download or view full build log

15-Aug-2017 23:55:35 Build Microservices - Build And Test - feature-websocket-channel - Default Job #2 (MS-BT4-JOB1-2) started building on agent bamboo-agent15.prod.continuuity.net
15-Aug-2017 23:55:35 Remote Agent
15-Aug-2017 23:55:35 Build working directory is /var/bamboo/xml-data/build-dir/MS-BT4-JOB1
15-Aug-2017 23:55:35 Executing build Microservices - Build And Test - feature-websocket-channel - Default Job #2 (MS-BT4-JOB1-2)
15-Aug-2017 23:55:35 Starting task 'Checkout Default Repository' of type 'com.atlassian.bamboo.plugins.vcs:task.vcs.checkout'
15-Aug-2017 23:55:35 Build always requires a clean checkout
15-Aug-2017 23:55:35 Cleaning build directory '/var/bamboo/xml-data/build-dir/MS-BT4-JOB1'
15-Aug-2017 23:55:35 Updating source code to revision: 25500e096a920bcba72ae2246131d6cfa6991582
15-Aug-2017 23:55:35 Creating local git repository in '/var/bamboo/xml-data/build-dir/MS-BT4-JOB1/.git'.
15-Aug-2017 23:55:35 Initialized empty Git repository in /var/bamboo/xml-data/build-dir/MS-BT4-JOB1/.git/
15-Aug-2017 23:55:36 Fetching 'refs/heads/feature/websocket-channel' from 'https://github.com/cask-solutions/microservice.git'. Will try to do a shallow fetch.
15-Aug-2017 23:55:36 From https://github.com/cask-solutions/microservice
15-Aug-2017 23:55:36 * [new branch]      feature/websocket-channel -> feature/websocket-channel
15-Aug-2017 23:55:36 Checking out revision 25500e096a920bcba72ae2246131d6cfa6991582.
15-Aug-2017 23:55:36 Switched to branch 'feature/websocket-channel'
15-Aug-2017 23:55:36 Updated source code to revision: 25500e096a920bcba72ae2246131d6cfa6991582
15-Aug-2017 23:55:36 Finished task 'Checkout Default Repository' with result: Success
15-Aug-2017 23:55:36 Running pre-build action: VCS Version Collector
15-Aug-2017 23:55:36 Running pre-build action: Hung Build Killer PreBuildAction
15-Aug-2017 23:55:36 Starting task 'build and unit test' of type 'com.atlassian.bamboo.plugins.maven:task.builder.mvn3'
15-Aug-2017 23:55:36
Beginning to execute external process for build 'Microservices - Build And Test - feature-websocket-channel - Default Job #2 (MS-BT4-JOB1-2)'
... running command line:
/opt/maven/bin/mvn --batch-mode -Djava.io.tmpdir=/tmp/MS-BT4-JOB1 clean test -U
... in: /var/bamboo/xml-data/build-dir/MS-BT4-JOB1
... using extra environment variables:
bamboo_planRepository_1_branch=feature/websocket-channel
bamboo_planRepository_1_branchDisplayName=feature/websocket-channel
bamboo_repository_revision_number=25500e096a920bcba72ae2246131d6cfa6991582
MAVEN2_HOME=/opt/maven
bamboo_docs_s3_bucket=docs.cask.co
bamboo_capability_system_builder_command_s3cmd=/usr/bin/s3cmd
bamboo_buildKey=MS-BT4-JOB1
bamboo_gpg_password=********
bamboo_ops_gpg_password=********
bamboo_shortJobName=Default Job
bamboo_buildResultsUrl=http://builds.cask.co/browse/MS-BT4-JOB1-2
bamboo_repository_s3_bucket=repository.cask.co
bamboo_planRepository_repositoryUrl=https://github.com/cask-solutions/microservice.git
bamboo_capability_system_builder_mvn3_Maven_3_1=/opt/maven
bamboo_aws_secret_access_key_password=********
bamboo_agentId=32243725
bamboo_capability_Swapfile=true
bamboo_planRepository_revision=25500e096a920bcba72ae2246131d6cfa6991582
bamboo_planRepository_previousRevision=ee4ac8d5bb0110e0385e174722850cec07a313da
bamboo_capability_RHEL=rhel
bamboo_capability_freight=true
bamboo_repository_branch_name=feature/websocket-channel
bamboo_kdc_address_password=********
bamboo_capability_GPG=GPG
bamboo_capability_system_jdk_Oracle_JDK_8=/usr/lib/jvm/jdk8
JAVA_HOME=/usr/lib/jvm/jdk1.7.0_75
bamboo_capability_system_jdk_Oracle_JDK_7=/usr/lib/jvm/jdk7
bamboo_dependenciesDisabled=false
bamboo_downloads_s3_bucket=downloads.cask.co
bamboo_planRepository_branch=feature/websocket-channel
bamboo_repository_68716264_name=Cask Microservices
bamboo_market_s3_access_key_password=********
bamboo_planRepository_1_type=gitv2
bamboo_planRepository_branchName=feature/websocket-channel
bamboo_capability_SPHINX=Sphinx
bamboo_capability_rsync=true
bamboo_market_cloudfront_secret_key_password=********
bamboo_repository_68716264_git_branch=feature/websocket-channel
bamboo_capability_system_jdk_JDK=/usr/lib/jvm/jdk1.7.0_75
bamboo_planRepository_type=gitv2
bamboo_planRepository_1_username=caskdata-readonly
bamboo_ManualBuildTriggerReason_userName=gokul
bamboo_capability_expect=true
bamboo_capability_RSYNC=rsync
useMavenReturnCode=false
bamboo_capability_system_builder_node_Node_js=/usr/bin/node
bamboo_capability_system_builder_mvn3_Maven_3=/opt/maven
bamboo_planKey=MS-BT4
bamboo_repository_68716264_previous_revision_number=ee4ac8d5bb0110e0385e174722850cec07a313da
bamboo_hide_jdk_mirror_password=********
bamboo_planRepository_username=caskdata-readonly
bamboo_repository_68716264_revision_number=25500e096a920bcba72ae2246131d6cfa6991582
bamboo_planRepository_1_branchName=feature/websocket-channel
bamboo_capability_s3cmd=true
bamboo_resultsUrl=http://builds.cask.co/browse/MS-BT4-JOB1-2
bamboo_capability_Sphinx=true
bamboo_planRepository_1_name=Cask Microservices
bamboo_build_working_directory=/var/bamboo/xml-data/build-dir/MS-BT4-JOB1
bamboo_shortPlanName=feature-websocket-channel
bamboo_planRepository_name=Cask Microservices
bamboo_capability_git_lfs=true
bamboo_repository_68716264_branch_name=feature/websocket-channel
bamboo_buildNumber=2
bamboo_planName=Microservices - Build And Test - feature-websocket-channel
bamboo_shortPlanKey=BT4
bamboo_shortJobKey=JOB1
bamboo_repository_previous_revision_number=ee4ac8d5bb0110e0385e174722850cec07a313da
bamboo_buildTimeStamp=2017-08-15T23:55:34.885Z
M2_HOME=/opt/maven
bamboo_s3_bucket=repository.cask.co
bamboo_buildResultKey=MS-BT4-JOB1-2
bamboo_capability_system_builder_command_Docker=/usr/bin/docker
bamboo_repository_git_branch=feature/websocket-channel
bamboo_market_s3_secret_key_password=********
bamboo_buildPlanName=Microservices - Build And Test - feature-websocket-channel - Default Job
bamboo_capability_system_builder_command_fpm=/opt/rbenv/shims/fpm
bamboo_capability_system_jdk_JDK_1_8_0_101=/usr/lib/jvm/jdk1.8.0_101
bamboo_planRepository_1_revision=25500e096a920bcba72ae2246131d6cfa6991582
bamboo_capability_Platform=rhel
bamboo_repository_name=Cask Microservices
bamboo_capability_system_docker_executable=/usr/bin/docker
bamboo_agentWorkingDirectory=/var/bamboo/xml-data/build-dir
bamboo_capability_system_git_executable=/usr/local/bin/git
bamboo_planRepository_1_previousRevision=ee4ac8d5bb0110e0385e174722850cec07a313da
bamboo_repository_git_username=caskdata-readonly
bamboo_capability_system_builder_command_Ruby=/opt/rbenv/shims/ruby
bamboo_planRepository_branchDisplayName=feature/websocket-channel
bamboo_aws_access_key_password=********
bamboo_capability_system_builder_mvn3_Maven_3_x=/opt/maven
bamboo_plan_storageTag=plan-68521836
bamboo_repository_git_repositoryUrl=https://github.com/cask-solutions/microservice.git
bamboo_market_cloudfront_access_key_password=********
bamboo_repository_68716264_git_username=caskdata-readonly
bamboo_working_directory=/var/bamboo/xml-data/build-dir/MS-BT4-JOB1
bamboo_planRepository_1_repositoryUrl=https://github.com/cask-solutions/microservice.git
bamboo_repository_68716264_git_repositoryUrl=https://github.com/cask-solutions/microservice.git
bamboo_capability_createrepo=true
bamboo_capability_system_jdk_JDK_1_8=/usr/lib/jvm/jdk1.8.0_101
bamboo_capability_rpm_build=true
bamboo_capability_system_jdk_JDK_1_7=/usr/lib/jvm/jdk1.7.0_75
PATH=/usr/lib/jvm/jdk1.7.0_75/bin:/usr/lib/jvm/java/bin:/opt/rbenv/shims:/opt/rbenv/bin:/opt/rbenv/plugins/ruby_build/bin:/usr/local/maven-3.1.1/bin:/usr/local/bin:/bin:/usr/bin:/usr/local/sbin:/usr/sbin:/sbin:/home/bamboo/bin
15-Aug-2017 23:55:40 [INFO] Scanning for projects...
15-Aug-2017 23:55:40 [INFO] Downloading: http://repo.maven.apache.org/maven2/org/apache/felix/maven-bundle-plugin/2.4.0/maven-bundle-plugin-2.4.0.pom
15-Aug-2017 23:55:41 [INFO] Downloaded: http://repo.maven.apache.org/maven2/org/apache/felix/maven-bundle-plugin/2.4.0/maven-bundle-plugin-2.4.0.pom (4 KB at 13.5 KB/sec)
15-Aug-2017 23:55:41 [INFO] Downloading: http://repo.maven.apache.org/maven2/biz/aQute/bnd/bndlib/2.1.0/bndlib-2.1.0.pom
15-Aug-2017 23:55:41 [INFO] Downloaded: http://repo.maven.apache.org/maven2/biz/aQute/bnd/bndlib/2.1.0/bndlib-2.1.0.pom (2 KB at 9.6 KB/sec)
15-Aug-2017 23:55:41 [INFO] Downloading: http://repo.maven.apache.org/maven2/biz/aQute/bnd/parent/2.1.0/parent-2.1.0.pom
15-Aug-2017 23:55:41 [INFO] Downloaded: http://repo.maven.apache.org/maven2/biz/aQute/bnd/parent/2.1.0/parent-2.1.0.pom (3 KB at 95.4 KB/sec)
15-Aug-2017 23:55:41 [INFO] Downloading: http://repo.maven.apache.org/maven2/org/osgi/org.osgi.core/4.2.0/org.osgi.core-4.2.0.pom
15-Aug-2017 23:55:41 [INFO] Downloaded: http://repo.maven.apache.org/maven2/org/osgi/org.osgi.core/4.2.0/org.osgi.core-4.2.0.pom (457 B at 3.8 KB/sec)
15-Aug-2017 23:55:42 [INFO] Downloading: http://repo.maven.apache.org/maven2/org/apache/felix/maven-bundle-plugin/2.4.0/maven-bundle-plugin-2.4.0.jar
15-Aug-2017 23:55:42 [INFO] Downloading: http://repo.maven.apache.org/maven2/org/osgi/org.osgi.core/4.2.0/org.osgi.core-4.2.0.jar
15-Aug-2017 23:55:43 [INFO] Downloading: http://repo.maven.apache.org/maven2/biz/aQute/bnd/bndlib/2.1.0/bndlib-2.1.0.jar
15-Aug-2017 23:55:43 [INFO] Downloaded: http://repo.maven.apache.org/maven2/org/apache/felix/maven-bundle-plugin/2.4.0/maven-bundle-plugin-2.4.0.jar (124 KB at 1666.1 KB/sec)
15-Aug-2017 23:55:43 [INFO] Downloaded: http://repo.maven.apache.org/maven2/org/osgi/org.osgi.core/4.2.0/org.osgi.core-4.2.0.jar (242 KB at 2296.5 KB/sec)
15-Aug-2017 23:55:43 [INFO] Downloaded: http://repo.maven.apache.org/maven2/biz/aQute/bnd/bndlib/2.1.0/bndlib-2.1.0.jar (1356 KB at 7099.4 KB/sec)
15-Aug-2017 23:55:43 [INFO] ------------------------------------------------------------------------
15-Aug-2017 23:55:43 [INFO] Reactor Build Order:
15-Aug-2017 23:55:43 [INFO]
15-Aug-2017 23:55:43 [INFO] Microservice Framework built over CDAP
15-Aug-2017 23:55:43 [INFO] Microservice APIs
15-Aug-2017 23:55:43 [INFO] Microservice Application
15-Aug-2017 23:55:43 [INFO]                                                                         
15-Aug-2017 23:55:43 [INFO] ------------------------------------------------------------------------
15-Aug-2017 23:55:43 [INFO] Building Microservice Framework built over CDAP 1.0
15-Aug-2017 23:55:43 [INFO] ------------------------------------------------------------------------
15-Aug-2017 23:55:43 [INFO]
15-Aug-2017 23:55:43 [INFO] --- maven-clean-plugin:2.5:clean (default-clean) @ microservice ---
15-Aug-2017 23:55:43 [INFO]
15-Aug-2017 23:55:43 [INFO] --- apache-rat-plugin:0.10:check (rat-check) @ microservice ---
15-Aug-2017 23:55:45 [INFO] 53 implicit excludes (use -debug for more details).
15-Aug-2017 23:55:45 [INFO] Exclude: build-number.txt
15-Aug-2017 23:55:45 [INFO] Exclude: LICENSE*.txt
15-Aug-2017 23:55:45 [INFO] Exclude: *.rst
15-Aug-2017 23:55:45 [INFO] Exclude: *.md
15-Aug-2017 23:55:45 [INFO] Exclude: **/*.md
15-Aug-2017 23:55:45 [INFO] 3 resources included (use -debug for more details)
15-Aug-2017 23:55:45 [INFO] Rat check: Summary of files. Unapproved: 0 unknown: 0 generated: 0 approved: 3 licence.
15-Aug-2017 23:55:45 [INFO]
15-Aug-2017 23:55:45 [INFO] --- maven-checkstyle-plugin:2.17:check (validate) @ microservice ---
15-Aug-2017 23:55:48 [INFO] Starting audit...
15-Aug-2017 23:55:48 Audit done.
15-Aug-2017 23:55:48 [INFO]                                                                         
15-Aug-2017 23:55:48 [INFO] ------------------------------------------------------------------------
15-Aug-2017 23:55:48 [INFO] Building Microservice APIs 1.0
15-Aug-2017 23:55:48 [INFO] ------------------------------------------------------------------------
15-Aug-2017 23:55:49 [INFO]
15-Aug-2017 23:55:49 [INFO] --- maven-clean-plugin:2.5:clean (default-clean) @ microservice-api ---
15-Aug-2017 23:55:49 [INFO]
15-Aug-2017 23:55:49 [INFO] --- apache-rat-plugin:0.10:check (rat-check) @ microservice-api ---
15-Aug-2017 23:55:49 [INFO] 51 implicit excludes (use -debug for more details).
15-Aug-2017 23:55:49 [INFO] Exclude: build-number.txt
15-Aug-2017 23:55:49 [INFO] Exclude: LICENSE*.txt
15-Aug-2017 23:55:49 [INFO] Exclude: *.rst
15-Aug-2017 23:55:49 [INFO] Exclude: *.md
15-Aug-2017 23:55:49 [INFO] Exclude: **/*.md
15-Aug-2017 23:55:49 [INFO] 17 resources included (use -debug for more details)
15-Aug-2017 23:55:49 [INFO] Rat check: Summary of files. Unapproved: 0 unknown: 0 generated: 0 approved: 17 licence.
15-Aug-2017 23:55:49 [INFO]
15-Aug-2017 23:55:49 [INFO] --- maven-resources-plugin:2.6:resources (default-resources) @ microservice-api ---
15-Aug-2017 23:55:49 [INFO] Using 'UTF-8' encoding to copy filtered resources.
15-Aug-2017 23:55:49 [INFO] skip non existing resourceDirectory /var/bamboo/xml-data/build-dir/MS-BT4-JOB1/microservice-api/src/main/resources
15-Aug-2017 23:55:49 [INFO]
15-Aug-2017 23:55:49 [INFO] --- maven-compiler-plugin:3.1:compile (default-compile) @ microservice-api ---
15-Aug-2017 23:55:50 [INFO] Changes detected - recompiling the module!
15-Aug-2017 23:55:50 [INFO] Compiling 16 source files to /var/bamboo/xml-data/build-dir/MS-BT4-JOB1/microservice-api/target/classes
15-Aug-2017 23:55:51 [INFO]
15-Aug-2017 23:55:51 [INFO] --- maven-resources-plugin:2.6:testResources (default-testResources) @ microservice-api ---
15-Aug-2017 23:55:51 [INFO] Using 'UTF-8' encoding to copy filtered resources.
15-Aug-2017 23:55:51 [INFO] skip non existing resourceDirectory /var/bamboo/xml-data/build-dir/MS-BT4-JOB1/microservice-api/src/test/resources
15-Aug-2017 23:55:51 [INFO]
15-Aug-2017 23:55:51 [INFO] --- maven-compiler-plugin:3.1:testCompile (default-testCompile) @ microservice-api ---
15-Aug-2017 23:55:51 [INFO] No sources to compile
15-Aug-2017 23:55:51 [INFO]
15-Aug-2017 23:55:51 [INFO] --- maven-checkstyle-plugin:2.17:check (validate) @ microservice-api ---
15-Aug-2017 23:55:51 [INFO] Starting audit...
15-Aug-2017 23:55:51 Audit done.
15-Aug-2017 23:55:51 [INFO]
15-Aug-2017 23:55:51 [INFO] --- maven-surefire-plugin:2.12.4:test (default-test) @ microservice-api ---
15-Aug-2017 23:55:52 [INFO] No tests to run.
15-Aug-2017 23:55:52 [INFO]                                                                         
15-Aug-2017 23:55:52 [INFO] ------------------------------------------------------------------------
15-Aug-2017 23:55:52 [INFO] Building Microservice Application 1.0
15-Aug-2017 23:55:52 [INFO] ------------------------------------------------------------------------
15-Aug-2017 23:55:52 [INFO] Downloading: https://oss.sonatype.org/content/repositories/snapshots/com/amazonaws/aws-java-sdk-sqs/1.11.163/aws-java-sdk-sqs-1.11.163.pom
15-Aug-2017 23:55:52 [INFO] Downloading: https://repository.apache.org/content/repositories/snapshots/com/amazonaws/aws-java-sdk-sqs/1.11.163/aws-java-sdk-sqs-1.11.163.pom
15-Aug-2017 23:55:52 [INFO] Downloading: http://repo.maven.apache.org/maven2/com/amazonaws/aws-java-sdk-sqs/1.11.163/aws-java-sdk-sqs-1.11.163.pom
15-Aug-2017 23:55:52 [INFO] Downloaded: http://repo.maven.apache.org/maven2/com/amazonaws/aws-java-sdk-sqs/1.11.163/aws-java-sdk-sqs-1.11.163.pom (4 KB at 119.5 KB/sec)
15-Aug-2017 23:55:52 [INFO] Downloading: https://oss.sonatype.org/content/repositories/snapshots/com/amazonaws/aws-java-sdk-pom/1.11.163/aws-java-sdk-pom-1.11.163.pom
15-Aug-2017 23:55:53 [INFO] Downloading: https://repository.apache.org/content/repositories/snapshots/com/amazonaws/aws-java-sdk-pom/1.11.163/aws-java-sdk-pom-1.11.163.pom
15-Aug-2017 23:55:53 [INFO] Downloading: http://repo.maven.apache.org/maven2/com/amazonaws/aws-java-sdk-pom/1.11.163/aws-java-sdk-pom-1.11.163.pom
15-Aug-2017 23:55:53 [INFO] Downloaded: http://repo.maven.apache.org/maven2/com/amazonaws/aws-java-sdk-pom/1.11.163/aws-java-sdk-pom-1.11.163.pom (11 KB at 392.6 KB/sec)
15-Aug-2017 23:55:53 [INFO] Downloading: https://oss.sonatype.org/content/repositories/snapshots/com/amazonaws/aws-java-sdk-core/1.11.163/aws-java-sdk-core-1.11.163.pom
15-Aug-2017 23:55:53 [INFO] Downloading: https://repository.apache.org/content/repositories/snapshots/com/amazonaws/aws-java-sdk-core/1.11.163/aws-java-sdk-core-1.11.163.pom
15-Aug-2017 23:55:53 [INFO] Downloading: http://repo.maven.apache.org/maven2/com/amazonaws/aws-java-sdk-core/1.11.163/aws-java-sdk-core-1.11.163.pom
15-Aug-2017 23:55:53 [INFO] Downloaded: http://repo.maven.apache.org/maven2/com/amazonaws/aws-java-sdk-core/1.11.163/aws-java-sdk-core-1.11.163.pom (5 KB at 151.1 KB/sec)
15-Aug-2017 23:55:53 [INFO] Downloading: https://oss.sonatype.org/content/repositories/snapshots/com/fasterxml/jackson/core/jackson-databind/2.6.7.1/jackson-databind-2.6.7.1.pom
15-Aug-2017 23:55:53 [INFO] Downloading: https://repository.apache.org/content/repositories/snapshots/com/fasterxml/jackson/core/jackson-databind/2.6.7.1/jackson-databind-2.6.7.1.pom
15-Aug-2017 23:55:54 [INFO] Downloading: http://repo.maven.apache.org/maven2/com/fasterxml/jackson/core/jackson-databind/2.6.7.1/jackson-databind-2.6.7.1.pom
15-Aug-2017 23:55:54 [INFO] Downloaded: http://repo.maven.apache.org/maven2/com/fasterxml/jackson/core/jackson-databind/2.6.7.1/jackson-databind-2.6.7.1.pom (6 KB at 219.5 KB/sec)
15-Aug-2017 23:55:54 [INFO] Downloading: https://oss.sonatype.org/content/repositories/snapshots/com/fasterxml/jackson/core/jackson-core/2.6.7/jackson-core-2.6.7.pom
15-Aug-2017 23:55:54 [INFO] Downloading: https://repository.apache.org/content/repositories/snapshots/com/fasterxml/jackson/core/jackson-core/2.6.7/jackson-core-2.6.7.pom
15-Aug-2017 23:55:54 [INFO] Downloading: http://repo.maven.apache.org/maven2/com/fasterxml/jackson/core/jackson-core/2.6.7/jackson-core-2.6.7.pom
15-Aug-2017 23:55:54 [INFO] Downloaded: http://repo.maven.apache.org/maven2/com/fasterxml/jackson/core/jackson-core/2.6.7/jackson-core-2.6.7.pom (5 KB at 176.0 KB/sec)
15-Aug-2017 23:55:54 [INFO] Downloading: https://oss.sonatype.org/content/repositories/snapshots/com/fasterxml/jackson/dataformat/jackson-dataformat-cbor/2.6.7/jackson-dataformat-cbor-2.6.7.pom
15-Aug-2017 23:55:54 [INFO] Downloading: https://repository.apache.org/content/repositories/snapshots/com/fasterxml/jackson/dataformat/jackson-dataformat-cbor/2.6.7/jackson-dataformat-cbor-2.6.7.pom
15-Aug-2017 23:55:54 [INFO] Downloading: http://repo.maven.apache.org/maven2/com/fasterxml/jackson/dataformat/jackson-dataformat-cbor/2.6.7/jackson-dataformat-cbor-2.6.7.pom
15-Aug-2017 23:55:54 [INFO] Downloaded: http://repo.maven.apache.org/maven2/com/fasterxml/jackson/dataformat/jackson-dataformat-cbor/2.6.7/jackson-dataformat-cbor-2.6.7.pom (3 KB at 102.4 KB/sec)
15-Aug-2017 23:55:54 [INFO] Downloading: https://oss.sonatype.org/content/repositories/snapshots/com/amazonaws/jmespath-java/1.11.163/jmespath-java-1.11.163.pom
15-Aug-2017 23:55:55 [INFO] Downloading: https://repository.apache.org/content/repositories/snapshots/com/amazonaws/jmespath-java/1.11.163/jmespath-java-1.11.163.pom
15-Aug-2017 23:55:55 [INFO] Downloading: http://repo.maven.apache.org/maven2/com/amazonaws/jmespath-java/1.11.163/jmespath-java-1.11.163.pom
15-Aug-2017 23:55:55 [INFO] Downloaded: http://repo.maven.apache.org/maven2/com/amazonaws/jmespath-java/1.11.163/jmespath-java-1.11.163.pom (4 KB at 56.5 KB/sec)
15-Aug-2017 23:55:55 [INFO] Downloading: https://oss.sonatype.org/content/repositories/snapshots/org/eclipse/jetty/websocket/websocket-api/9.2.17.v20160517/websocket-api-9.2.17.v20160517.pom
15-Aug-2017 23:55:55 [INFO] Downloading: https://repository.apache.org/content/repositories/snapshots/org/eclipse/jetty/websocket/websocket-api/9.2.17.v20160517/websocket-api-9.2.17.v20160517.pom
15-Aug-2017 23:55:55 [INFO] Downloading: http://repo.maven.apache.org/maven2/org/eclipse/jetty/websocket/websocket-api/9.2.17.v20160517/websocket-api-9.2.17.v20160517.pom
15-Aug-2017 23:55:55 [INFO] Downloaded: http://repo.maven.apache.org/maven2/org/eclipse/jetty/websocket/websocket-api/9.2.17.v20160517/websocket-api-9.2.17.v20160517.pom (3 KB at 76.7 KB/sec)
15-Aug-2017 23:55:55 [INFO] Downloading: https://oss.sonatype.org/content/repositories/snapshots/org/eclipse/jetty/websocket/websocket-parent/9.2.17.v20160517/websocket-parent-9.2.17.v20160517.pom
15-Aug-2017 23:55:55 [INFO] Downloading: https://repository.apache.org/content/repositories/snapshots/org/eclipse/jetty/websocket/websocket-parent/9.2.17.v20160517/websocket-parent-9.2.17.v20160517.pom
15-Aug-2017 23:55:55 [INFO] Downloading: http://repo.maven.apache.org/maven2/org/eclipse/jetty/websocket/websocket-parent/9.2.17.v20160517/websocket-parent-9.2.17.v20160517.pom
15-Aug-2017 23:55:55 [INFO] Downloaded: http://repo.maven.apache.org/maven2/org/eclipse/jetty/websocket/websocket-parent/9.2.17.v20160517/websocket-parent-9.2.17.v20160517.pom (4 KB at 117.7 KB/sec)
15-Aug-2017 23:55:55 [INFO] Downloading: https://oss.sonatype.org/content/repositories/snapshots/org/eclipse/jetty/jetty-project/9.2.17.v20160517/jetty-project-9.2.17.v20160517.pom
15-Aug-2017 23:55:56 [INFO] Downloading: https://repository.apache.org/content/repositories/snapshots/org/eclipse/jetty/jetty-project/9.2.17.v20160517/jetty-project-9.2.17.v20160517.pom
15-Aug-2017 23:55:56 [INFO] Downloading: http://repo.maven.apache.org/maven2/org/eclipse/jetty/jetty-project/9.2.17.v20160517/jetty-project-9.2.17.v20160517.pom
15-Aug-2017 23:55:56 [INFO] Downloaded: http://repo.maven.apache.org/maven2/org/eclipse/jetty/jetty-project/9.2.17.v20160517/jetty-project-9.2.17.v20160517.pom (39 KB at 1337.2 KB/sec)
15-Aug-2017 23:55:56 [INFO] Downloading: https://oss.sonatype.org/content/repositories/snapshots/org/eclipse/jetty/jetty-parent/23/jetty-parent-23.pom
15-Aug-2017 23:55:56 [INFO] Downloading: https://repository.apache.org/content/repositories/snapshots/org/eclipse/jetty/jetty-parent/23/jetty-parent-23.pom
15-Aug-2017 23:55:56 [INFO] Downloading: http://repo.maven.apache.org/maven2/org/eclipse/jetty/jetty-parent/23/jetty-parent-23.pom
15-Aug-2017 23:55:56 [INFO] Downloaded: http://repo.maven.apache.org/maven2/org/eclipse/jetty/jetty-parent/23/jetty-parent-23.pom (22 KB at 764.3 KB/sec)
15-Aug-2017 23:55:56 [INFO] Downloading: https://oss.sonatype.org/content/groups/jetty/org/eclipse/jetty/jetty-parent/23/jetty-parent-23.pom
15-Aug-2017 23:55:56 [INFO] Downloaded: https://oss.sonatype.org/content/groups/jetty/org/eclipse/jetty/jetty-parent/23/jetty-parent-23.pom (22 KB at 102.9 KB/sec)
15-Aug-2017 23:55:56 [INFO] Downloading: https://oss.sonatype.org/content/repositories/snapshots/org/eclipse/jetty/websocket/websocket-client/9.2.17.v20160517/websocket-client-9.2.17.v20160517.pom
15-Aug-2017 23:55:56 [INFO] Downloading: https://repository.apache.org/content/repositories/snapshots/org/eclipse/jetty/websocket/websocket-client/9.2.17.v20160517/websocket-client-9.2.17.v20160517.pom
15-Aug-2017 23:55:56 [INFO] Downloading: http://repo.maven.apache.org/maven2/org/eclipse/jetty/websocket/websocket-client/9.2.17.v20160517/websocket-client-9.2.17.v20160517.pom
15-Aug-2017 23:55:56 [INFO] Downloaded: http://repo.maven.apache.org/maven2/org/eclipse/jetty/websocket/websocket-client/9.2.17.v20160517/websocket-client-9.2.17.v20160517.pom (5 KB at 146.8 KB/sec)
15-Aug-2017 23:55:56 [INFO] Downloading: https://oss.sonatype.org/content/repositories/snapshots/org/eclipse/jetty/jetty-util/9.2.17.v20160517/jetty-util-9.2.17.v20160517.pom
15-Aug-2017 23:55:57 [INFO] Downloading: https://repository.apache.org/content/repositories/snapshots/org/eclipse/jetty/jetty-util/9.2.17.v20160517/jetty-util-9.2.17.v20160517.pom
15-Aug-2017 23:55:57 [INFO] Downloading: http://repo.maven.apache.org/maven2/org/eclipse/jetty/jetty-util/9.2.17.v20160517/jetty-util-9.2.17.v20160517.pom
15-Aug-2017 23:55:57 [INFO] Downloaded: http://repo.maven.apache.org/maven2/org/eclipse/jetty/jetty-util/9.2.17.v20160517/jetty-util-9.2.17.v20160517.pom (4 KB at 125.5 KB/sec)
15-Aug-2017 23:55:57 [INFO] Downloading: https://oss.sonatype.org/content/groups/jetty/org/eclipse/jetty/jetty-util/9.2.17.v20160517/jetty-util-9.2.17.v20160517.pom
15-Aug-2017 23:55:57 [INFO] Downloaded: https://oss.sonatype.org/content/groups/jetty/org/eclipse/jetty/jetty-util/9.2.17.v20160517/jetty-util-9.2.17.v20160517.pom (4 KB at 18.3 KB/sec)
15-Aug-2017 23:55:57 [INFO] Downloading: https://oss.sonatype.org/content/repositories/snapshots/org/eclipse/jetty/jetty-io/9.2.17.v20160517/jetty-io-9.2.17.v20160517.pom
15-Aug-2017 23:55:57 [INFO] Downloading: https://repository.apache.org/content/repositories/snapshots/org/eclipse/jetty/jetty-io/9.2.17.v20160517/jetty-io-9.2.17.v20160517.pom
15-Aug-2017 23:55:57 [INFO] Downloading: http://repo.maven.apache.org/maven2/org/eclipse/jetty/jetty-io/9.2.17.v20160517/jetty-io-9.2.17.v20160517.pom
15-Aug-2017 23:55:57 [INFO] Downloaded: http://repo.maven.apache.org/maven2/org/eclipse/jetty/jetty-io/9.2.17.v20160517/jetty-io-9.2.17.v20160517.pom (3 KB at 79.8 KB/sec)
15-Aug-2017 23:55:57 [INFO] Downloading: https://oss.sonatype.org/content/groups/jetty/org/eclipse/jetty/jetty-io/9.2.17.v20160517/jetty-io-9.2.17.v20160517.pom
15-Aug-2017 23:55:57 [INFO] Downloaded: https://oss.sonatype.org/content/groups/jetty/org/eclipse/jetty/jetty-io/9.2.17.v20160517/jetty-io-9.2.17.v20160517.pom (3 KB at 12.8 KB/sec)
15-Aug-2017 23:55:57 [INFO] Downloading: https://oss.sonatype.org/content/repositories/snapshots/org/eclipse/jetty/websocket/websocket-common/9.2.17.v20160517/websocket-common-9.2.17.v20160517.pom
15-Aug-2017 23:55:57 [INFO] Downloading: https://repository.apache.org/content/repositories/snapshots/org/eclipse/jetty/websocket/websocket-common/9.2.17.v20160517/websocket-common-9.2.17.v20160517.pom
15-Aug-2017 23:55:57 [INFO] Downloading: http://repo.maven.apache.org/maven2/org/eclipse/jetty/websocket/websocket-common/9.2.17.v20160517/websocket-common-9.2.17.v20160517.pom
15-Aug-2017 23:55:58 [INFO] Downloaded: http://repo.maven.apache.org/maven2/org/eclipse/jetty/websocket/websocket-common/9.2.17.v20160517/websocket-common-9.2.17.v20160517.pom (3 KB at 92.4 KB/sec)
15-Aug-2017 23:55:58 [INFO] Downloading: https://oss.sonatype.org/content/groups/jetty/org/eclipse/jetty/websocket/websocket-common/9.2.17.v20160517/websocket-common-9.2.17.v20160517.pom
15-Aug-2017 23:55:58 [INFO] Downloaded: https://oss.sonatype.org/content/groups/jetty/org/eclipse/jetty/websocket/websocket-common/9.2.17.v20160517/websocket-common-9.2.17.v20160517.pom (3 KB at 13.6 KB/sec)
15-Aug-2017 23:55:58 [INFO] Downloading: https://oss.sonatype.org/content/repositories/snapshots/org/eclipse/jetty/websocket/websocket-server/9.2.17.v20160517/websocket-server-9.2.17.v20160517.pom
15-Aug-2017 23:55:58 [INFO] Downloading: https://repository.apache.org/content/repositories/snapshots/org/eclipse/jetty/websocket/websocket-server/9.2.17.v20160517/websocket-server-9.2.17.v20160517.pom
15-Aug-2017 23:55:58 [INFO] Downloading: http://repo.maven.apache.org/maven2/org/eclipse/jetty/websocket/websocket-server/9.2.17.v20160517/websocket-server-9.2.17.v20160517.pom
15-Aug-2017 23:55:58 [INFO] Downloaded: http://repo.maven.apache.org/maven2/org/eclipse/jetty/websocket/websocket-server/9.2.17.v20160517/websocket-server-9.2.17.v20160517.pom (4 KB at 137.8 KB/sec)
15-Aug-2017 23:55:58 [INFO] Downloading: https://oss.sonatype.org/content/repositories/snapshots/org/eclipse/jetty/websocket/websocket-servlet/9.2.17.v20160517/websocket-servlet-9.2.17.v20160517.pom
15-Aug-2017 23:55:58 [INFO] Downloading: https://repository.apache.org/content/repositories/snapshots/org/eclipse/jetty/websocket/websocket-servlet/9.2.17.v20160517/websocket-servlet-9.2.17.v20160517.pom
15-Aug-2017 23:55:58 [INFO] Downloading: http://repo.maven.apache.org/maven2/org/eclipse/jetty/websocket/websocket-servlet/9.2.17.v20160517/websocket-servlet-9.2.17.v20160517.pom
15-Aug-2017 23:55:58 [INFO] Downloaded: http://repo.maven.apache.org/maven2/org/eclipse/jetty/websocket/websocket-servlet/9.2.17.v20160517/websocket-servlet-9.2.17.v20160517.pom (3 KB at 106.6 KB/sec)
15-Aug-2017 23:55:58 [INFO] Downloading: https://oss.sonatype.org/content/groups/jetty/org/eclipse/jetty/websocket/websocket-servlet/9.2.17.v20160517/websocket-servlet-9.2.17.v20160517.pom
15-Aug-2017 23:55:58 [INFO] Downloaded: https://oss.sonatype.org/content/groups/jetty/org/eclipse/jetty/websocket/websocket-servlet/9.2.17.v20160517/websocket-servlet-9.2.17.v20160517.pom (3 KB at 17.2 KB/sec)
15-Aug-2017 23:55:58 [INFO] Downloading: https://oss.sonatype.org/content/repositories/snapshots/javax/servlet/javax.servlet-api/3.1.0/javax.servlet-api-3.1.0.pom
15-Aug-2017 23:55:58 [INFO] Downloading: https://repository.apache.org/content/repositories/snapshots/javax/servlet/javax.servlet-api/3.1.0/javax.servlet-api-3.1.0.pom
15-Aug-2017 23:55:59 [INFO] Downloading: http://repo.maven.apache.org/maven2/javax/servlet/javax.servlet-api/3.1.0/javax.servlet-api-3.1.0.pom
15-Aug-2017 23:55:59 [INFO] Downloaded: http://repo.maven.apache.org/maven2/javax/servlet/javax.servlet-api/3.1.0/javax.servlet-api-3.1.0.pom (14 KB at 489.3 KB/sec)
15-Aug-2017 23:55:59 [INFO] Downloading: https://oss.sonatype.org/content/groups/jetty/javax/servlet/javax.servlet-api/3.1.0/javax.servlet-api-3.1.0.pom
15-Aug-2017 23:55:59 [INFO] Downloading: https://oss.sonatype.org/content/repositories/snapshots/org/eclipse/jetty/jetty-servlet/9.2.17.v20160517/jetty-servlet-9.2.17.v20160517.pom
15-Aug-2017 23:55:59 [INFO] Downloading: https://repository.apache.org/content/repositories/snapshots/org/eclipse/jetty/jetty-servlet/9.2.17.v20160517/jetty-servlet-9.2.17.v20160517.pom
15-Aug-2017 23:55:59 [INFO] Downloading: http://repo.maven.apache.org/maven2/org/eclipse/jetty/jetty-servlet/9.2.17.v20160517/jetty-servlet-9.2.17.v20160517.pom
15-Aug-2017 23:55:59 [INFO] Downloaded: http://repo.maven.apache.org/maven2/org/eclipse/jetty/jetty-servlet/9.2.17.v20160517/jetty-servlet-9.2.17.v20160517.pom (4 KB at 114.5 KB/sec)
15-Aug-2017 23:55:59 [INFO] Downloading: https://oss.sonatype.org/content/groups/jetty/org/eclipse/jetty/jetty-servlet/9.2.17.v20160517/jetty-servlet-9.2.17.v20160517.pom
15-Aug-2017 23:55:59 [INFO] Downloaded: https://oss.sonatype.org/content/groups/jetty/org/eclipse/jetty/jetty-servlet/9.2.17.v20160517/jetty-servlet-9.2.17.v20160517.pom (4 KB at 19.0 KB/sec)
15-Aug-2017 23:55:59 [INFO] Downloading: https://oss.sonatype.org/content/repositories/snapshots/org/eclipse/jetty/jetty-security/9.2.17.v20160517/jetty-security-9.2.17.v20160517.pom
15-Aug-2017 23:55:59 [INFO] Downloading: https://repository.apache.org/content/repositories/snapshots/org/eclipse/jetty/jetty-security/9.2.17.v20160517/jetty-security-9.2.17.v20160517.pom
15-Aug-2017 23:55:59 [INFO] Downloading: http://repo.maven.apache.org/maven2/org/eclipse/jetty/jetty-security/9.2.17.v20160517/jetty-security-9.2.17.v20160517.pom
15-Aug-2017 23:55:59 [INFO] Downloaded: http://repo.maven.apache.org/maven2/org/eclipse/jetty/jetty-security/9.2.17.v20160517/jetty-security-9.2.17.v20160517.pom (3 KB at 100.4 KB/sec)
15-Aug-2017 23:55:59 [INFO] Downloading: https://oss.sonatype.org/content/groups/jetty/org/eclipse/jetty/jetty-security/9.2.17.v20160517/jetty-security-9.2.17.v20160517.pom
15-Aug-2017 23:55:59 [INFO] Downloaded: https://oss.sonatype.org/content/groups/jetty/org/eclipse/jetty/jetty-security/9.2.17.v20160517/jetty-security-9.2.17.v20160517.pom (3 KB at 16.8 KB/sec)
15-Aug-2017 23:55:59 [INFO] Downloading: https://oss.sonatype.org/content/repositories/snapshots/org/eclipse/jetty/jetty-server/9.2.17.v20160517/jetty-server-9.2.17.v20160517.pom
15-Aug-2017 23:56:00 [INFO] Downloading: https://repository.apache.org/content/repositories/snapshots/org/eclipse/jetty/jetty-server/9.2.17.v20160517/jetty-server-9.2.17.v20160517.pom
15-Aug-2017 23:56:00 [INFO] Downloading: http://repo.maven.apache.org/maven2/org/eclipse/jetty/jetty-server/9.2.17.v20160517/jetty-server-9.2.17.v20160517.pom
15-Aug-2017 23:56:00 [INFO] Downloaded: http://repo.maven.apache.org/maven2/org/eclipse/jetty/jetty-server/9.2.17.v20160517/jetty-server-9.2.17.v20160517.pom (5 KB at 148.4 KB/sec)
15-Aug-2017 23:56:00 [INFO] Downloading: https://oss.sonatype.org/content/groups/jetty/org/eclipse/jetty/jetty-server/9.2.17.v20160517/jetty-server-9.2.17.v20160517.pom
15-Aug-2017 23:56:00 [INFO] Downloaded: https://oss.sonatype.org/content/groups/jetty/org/eclipse/jetty/jetty-server/9.2.17.v20160517/jetty-server-9.2.17.v20160517.pom (5 KB at 23.2 KB/sec)
15-Aug-2017 23:56:00 [INFO] Downloading: https://oss.sonatype.org/content/repositories/snapshots/org/eclipse/jetty/jetty-http/9.2.17.v20160517/jetty-http-9.2.17.v20160517.pom
15-Aug-2017 23:56:00 [INFO] Downloading: https://repository.apache.org/content/repositories/snapshots/org/eclipse/jetty/jetty-http/9.2.17.v20160517/jetty-http-9.2.17.v20160517.pom
15-Aug-2017 23:56:00 [INFO] Downloading: http://repo.maven.apache.org/maven2/org/eclipse/jetty/jetty-http/9.2.17.v20160517/jetty-http-9.2.17.v20160517.pom
15-Aug-2017 23:56:00 [INFO] Downloaded: http://repo.maven.apache.org/maven2/org/eclipse/jetty/jetty-http/9.2.17.v20160517/jetty-http-9.2.17.v20160517.pom (3 KB at 88.0 KB/sec)
15-Aug-2017 23:56:00 [INFO] Downloading: https://oss.sonatype.org/content/groups/jetty/org/eclipse/jetty/jetty-http/9.2.17.v20160517/jetty-http-9.2.17.v20160517.pom
15-Aug-2017 23:56:00 [INFO] Downloaded: https://oss.sonatype.org/content/groups/jetty/org/eclipse/jetty/jetty-http/9.2.17.v20160517/jetty-http-9.2.17.v20160517.pom (3 KB at 14.7 KB/sec)
15-Aug-2017 23:56:10 [INFO] Downloading: https://oss.sonatype.org/content/repositories/snapshots/com/amazonaws/aws-java-sdk-sqs/1.11.163/aws-java-sdk-sqs-1.11.163.jar
15-Aug-2017 23:56:10 [INFO] Downloading: https://oss.sonatype.org/content/repositories/snapshots/com/amazonaws/aws-java-sdk-core/1.11.163/aws-java-sdk-core-1.11.163.jar
15-Aug-2017 23:56:10 [INFO] Downloading: https://oss.sonatype.org/content/repositories/snapshots/com/fasterxml/jackson/core/jackson-databind/2.6.7.1/jackson-databind-2.6.7.1.jar
15-Aug-2017 23:56:10 [INFO] Downloading: https://oss.sonatype.org/content/repositories/snapshots/com/fasterxml/jackson/core/jackson-core/2.6.7/jackson-core-2.6.7.jar
15-Aug-2017 23:56:10 [INFO] Downloading: https://oss.sonatype.org/content/repositories/snapshots/com/fasterxml/jackson/dataformat/jackson-dataformat-cbor/2.6.7/jackson-dataformat-cbor-2.6.7.jar
15-Aug-2017 23:56:10 [INFO] Downloading: https://oss.sonatype.org/content/repositories/snapshots/com/amazonaws/jmespath-java/1.11.163/jmespath-java-1.11.163.jar
15-Aug-2017 23:56:10 [INFO] Downloading: https://oss.sonatype.org/content/repositories/snapshots/org/eclipse/jetty/websocket/websocket-api/9.2.17.v20160517/websocket-api-9.2.17.v20160517.jar
15-Aug-2017 23:56:10 [INFO] Downloading: https://oss.sonatype.org/content/repositories/snapshots/org/eclipse/jetty/websocket/websocket-client/9.2.17.v20160517/websocket-client-9.2.17.v20160517.jar
15-Aug-2017 23:56:10 [INFO] Downloading: https://oss.sonatype.org/content/repositories/snapshots/org/eclipse/jetty/jetty-util/9.2.17.v20160517/jetty-util-9.2.17.v20160517.jar
15-Aug-2017 23:56:10 [INFO] Downloading: https://oss.sonatype.org/content/repositories/snapshots/org/eclipse/jetty/jetty-io/9.2.17.v20160517/jetty-io-9.2.17.v20160517.jar
15-Aug-2017 23:56:10 [INFO] Downloading: https://oss.sonatype.org/content/repositories/snapshots/org/eclipse/jetty/websocket/websocket-server/9.2.17.v20160517/websocket-server-9.2.17.v20160517.jar
15-Aug-2017 23:56:10 [INFO] Downloading: https://oss.sonatype.org/content/repositories/snapshots/org/eclipse/jetty/websocket/websocket-servlet/9.2.17.v20160517/websocket-servlet-9.2.17.v20160517.jar
15-Aug-2017 23:56:10 [INFO] Downloading: https://oss.sonatype.org/content/repositories/snapshots/org/eclipse/jetty/jetty-http/9.2.17.v20160517/jetty-http-9.2.17.v20160517.jar
15-Aug-2017 23:56:10 [INFO] Downloading: https://oss.sonatype.org/content/repositories/snapshots/org/eclipse/jetty/jetty-server/9.2.17.v20160517/jetty-server-9.2.17.v20160517.jar
15-Aug-2017 23:56:10 [INFO] Downloading: https://oss.sonatype.org/content/repositories/snapshots/javax/servlet/javax.servlet-api/3.1.0/javax.servlet-api-3.1.0.jar
15-Aug-2017 23:56:10 [INFO] Downloading: https://oss.sonatype.org/content/repositories/snapshots/org/eclipse/jetty/jetty-servlet/9.2.17.v20160517/jetty-servlet-9.2.17.v20160517.jar
15-Aug-2017 23:56:10 [INFO] Downloading: https://oss.sonatype.org/content/repositories/snapshots/org/eclipse/jetty/jetty-security/9.2.17.v20160517/jetty-security-9.2.17.v20160517.jar
15-Aug-2017 23:56:10 [INFO] Downloading: https://oss.sonatype.org/content/repositories/snapshots/org/eclipse/jetty/websocket/websocket-common/9.2.17.v20160517/websocket-common-9.2.17.v20160517.jar
15-Aug-2017 23:56:11 [INFO] Downloading: https://repository.apache.org/content/repositories/snapshots/com/amazonaws/aws-java-sdk-sqs/1.11.163/aws-java-sdk-sqs-1.11.163.jar
15-Aug-2017 23:56:11 [INFO] Downloading: https://repository.apache.org/content/repositories/snapshots/com/amazonaws/aws-java-sdk-core/1.11.163/aws-java-sdk-core-1.11.163.jar
15-Aug-2017 23:56:11 [INFO] Downloading: https://repository.apache.org/content/repositories/snapshots/com/fasterxml/jackson/core/jackson-databind/2.6.7.1/jackson-databind-2.6.7.1.jar
15-Aug-2017 23:56:11 [INFO] Downloading: https://repository.apache.org/content/repositories/snapshots/com/fasterxml/jackson/core/jackson-core/2.6.7/jackson-core-2.6.7.jar
15-Aug-2017 23:56:11 [INFO] Downloading: https://repository.apache.org/content/repositories/snapshots/com/fasterxml/jackson/dataformat/jackson-dataformat-cbor/2.6.7/jackson-dataformat-cbor-2.6.7.jar
15-Aug-2017 23:56:11 [INFO] Downloading: https://repository.apache.org/content/repositories/snapshots/com/amazonaws/jmespath-java/1.11.163/jmespath-java-1.11.163.jar
15-Aug-2017 23:56:11 [INFO] Downloading: https://repository.apache.org/content/repositories/snapshots/org/eclipse/jetty/websocket/websocket-api/9.2.17.v20160517/websocket-api-9.2.17.v20160517.jar
15-Aug-2017 23:56:11 [INFO] Downloading: https://repository.apache.org/content/repositories/snapshots/org/eclipse/jetty/websocket/websocket-client/9.2.17.v20160517/websocket-client-9.2.17.v20160517.jar
15-Aug-2017 23:56:11 [INFO] Downloading: https://repository.apache.org/content/repositories/snapshots/org/eclipse/jetty/jetty-util/9.2.17.v20160517/jetty-util-9.2.17.v20160517.jar
15-Aug-2017 23:56:11 [INFO] Downloading: https://repository.apache.org/content/repositories/snapshots/org/eclipse/jetty/jetty-io/9.2.17.v20160517/jetty-io-9.2.17.v20160517.jar
15-Aug-2017 23:56:11 [INFO] Downloading: https://repository.apache.org/content/repositories/snapshots/org/eclipse/jetty/websocket/websocket-server/9.2.17.v20160517/websocket-server-9.2.17.v20160517.jar
15-Aug-2017 23:56:11 [INFO] Downloading: https://repository.apache.org/content/repositories/snapshots/org/eclipse/jetty/websocket/websocket-servlet/9.2.17.v20160517/websocket-servlet-9.2.17.v20160517.jar
15-Aug-2017 23:56:11 [INFO] Downloading: https://repository.apache.org/content/repositories/snapshots/org/eclipse/jetty/jetty-http/9.2.17.v20160517/jetty-http-9.2.17.v20160517.jar
15-Aug-2017 23:56:11 [INFO] Downloading: https://repository.apache.org/content/repositories/snapshots/org/eclipse/jetty/jetty-server/9.2.17.v20160517/jetty-server-9.2.17.v20160517.jar
15-Aug-2017 23:56:11 [INFO] Downloading: https://repository.apache.org/content/repositories/snapshots/javax/servlet/javax.servlet-api/3.1.0/javax.servlet-api-3.1.0.jar
15-Aug-2017 23:56:11 [INFO] Downloading: https://repository.apache.org/content/repositories/snapshots/org/eclipse/jetty/jetty-servlet/9.2.17.v20160517/jetty-servlet-9.2.17.v20160517.jar
15-Aug-2017 23:56:11 [INFO] Downloading: https://repository.apache.org/content/repositories/snapshots/org/eclipse/jetty/jetty-security/9.2.17.v20160517/jetty-security-9.2.17.v20160517.jar
15-Aug-2017 23:56:11 [INFO] Downloading: https://repository.apache.org/content/repositories/snapshots/org/eclipse/jetty/websocket/websocket-common/9.2.17.v20160517/websocket-common-9.2.17.v20160517.jar
15-Aug-2017 23:56:11 [INFO] Downloading: http://repo.maven.apache.org/maven2/com/amazonaws/aws-java-sdk-sqs/1.11.163/aws-java-sdk-sqs-1.11.163.jar
15-Aug-2017 23:56:11 [INFO] Downloading: http://repo.maven.apache.org/maven2/com/amazonaws/aws-java-sdk-core/1.11.163/aws-java-sdk-core-1.11.163.jar
15-Aug-2017 23:56:11 [INFO] Downloading: http://repo.maven.apache.org/maven2/com/fasterxml/jackson/core/jackson-databind/2.6.7.1/jackson-databind-2.6.7.1.jar
15-Aug-2017 23:56:11 [INFO] Downloading: http://repo.maven.apache.org/maven2/com/fasterxml/jackson/core/jackson-core/2.6.7/jackson-core-2.6.7.jar
15-Aug-2017 23:56:11 [INFO] Downloading: http://repo.maven.apache.org/maven2/com/fasterxml/jackson/dataformat/jackson-dataformat-cbor/2.6.7/jackson-dataformat-cbor-2.6.7.jar
15-Aug-2017 23:56:11 [INFO] Downloaded: http://repo.maven.apache.org/maven2/com/amazonaws/aws-java-sdk-sqs/1.11.163/aws-java-sdk-sqs-1.11.163.jar (274 KB at 6509.5 KB/sec)
15-Aug-2017 23:56:11 [INFO] Downloading: http://repo.maven.apache.org/maven2/com/amazonaws/jmespath-java/1.11.163/jmespath-java-1.11.163.jar
15-Aug-2017 23:56:11 [INFO] Downloaded: http://repo.maven.apache.org/maven2/com/fasterxml/jackson/core/jackson-core/2.6.7/jackson-core-2.6.7.jar (253 KB at 4682.4 KB/sec)
15-Aug-2017 23:56:11 [INFO] Downloading: http://repo.maven.apache.org/maven2/org/eclipse/jetty/websocket/websocket-api/9.2.17.v20160517/websocket-api-9.2.17.v20160517.jar
15-Aug-2017 23:56:11 [INFO] Downloaded: http://repo.maven.apache.org/maven2/com/fasterxml/jackson/dataformat/jackson-dataformat-cbor/2.6.7/jackson-dataformat-cbor-2.6.7.jar (48 KB at 802.2 KB/sec)
15-Aug-2017 23:56:11 [INFO] Downloading: http://repo.maven.apache.org/maven2/org/eclipse/jetty/websocket/websocket-client/9.2.17.v20160517/websocket-client-9.2.17.v20160517.jar
15-Aug-2017 23:56:11 [INFO] Downloaded: http://repo.maven.apache.org/maven2/com/amazonaws/jmespath-java/1.11.163/jmespath-java-1.11.163.jar (27 KB at 937.4 KB/sec)
15-Aug-2017 23:56:11 [INFO] Downloading: http://repo.maven.apache.org/maven2/org/eclipse/jetty/jetty-util/9.2.17.v20160517/jetty-util-9.2.17.v20160517.jar
15-Aug-2017 23:56:11 [INFO] Downloaded: http://repo.maven.apache.org/maven2/org/eclipse/jetty/websocket/websocket-client/9.2.17.v20160517/websocket-client-9.2.17.v20160517.jar (36 KB at 1106.6 KB/sec)
15-Aug-2017 23:56:11 [INFO] Downloading: http://repo.maven.apache.org/maven2/org/eclipse/jetty/jetty-io/9.2.17.v20160517/jetty-io-9.2.17.v20160517.jar
15-Aug-2017 23:56:11 [INFO] Downloaded: http://repo.maven.apache.org/maven2/org/eclipse/jetty/websocket/websocket-api/9.2.17.v20160517/websocket-api-9.2.17.v20160517.jar (43 KB at 843.1 KB/sec)
15-Aug-2017 23:56:11 [INFO] Downloading: http://repo.maven.apache.org/maven2/org/eclipse/jetty/websocket/websocket-server/9.2.17.v20160517/websocket-server-9.2.17.v20160517.jar
15-Aug-2017 23:56:11 [INFO] Downloaded: http://repo.maven.apache.org/maven2/org/eclipse/jetty/jetty-util/9.2.17.v20160517/jetty-util-9.2.17.v20160517.jar (360 KB at 8984.9 KB/sec)
15-Aug-2017 23:56:11 [INFO] Downloading: http://repo.maven.apache.org/maven2/org/eclipse/jetty/websocket/websocket-servlet/9.2.17.v20160517/websocket-servlet-9.2.17.v20160517.jar
15-Aug-2017 23:56:11 [INFO] Downloaded: http://repo.maven.apache.org/maven2/org/eclipse/jetty/jetty-io/9.2.17.v20160517/jetty-io-9.2.17.v20160517.jar (106 KB at 2516.6 KB/sec)
15-Aug-2017 23:56:11 [INFO] Downloading: http://repo.maven.apache.org/maven2/org/eclipse/jetty/jetty-http/9.2.17.v20160517/jetty-http-9.2.17.v20160517.jar
15-Aug-2017 23:56:11 [INFO] Downloaded: http://repo.maven.apache.org/maven2/org/eclipse/jetty/websocket/websocket-servlet/9.2.17.v20160517/websocket-servlet-9.2.17.v20160517.jar (18 KB at 638.3 KB/sec)
15-Aug-2017 23:56:11 [INFO] Downloading: http://repo.maven.apache.org/maven2/org/eclipse/jetty/jetty-server/9.2.17.v20160517/jetty-server-9.2.17.v20160517.jar
15-Aug-2017 23:56:11 [INFO] Downloaded: http://repo.maven.apache.org/maven2/org/eclipse/jetty/websocket/websocket-server/9.2.17.v20160517/websocket-server-9.2.17.v20160517.jar (37 KB at 766.4 KB/sec)
15-Aug-2017 23:56:11 [INFO] Downloading: http://repo.maven.apache.org/maven2/javax/servlet/javax.servlet-api/3.1.0/javax.servlet-api-3.1.0.jar
15-Aug-2017 23:56:11 [INFO] Downloaded: http://repo.maven.apache.org/maven2/com/amazonaws/aws-java-sdk-core/1.11.163/aws-java-sdk-core-1.11.163.jar (826 KB at 5291.1 KB/sec)
15-Aug-2017 23:56:11 [INFO] Downloading: http://repo.maven.apache.org/maven2/org/eclipse/jetty/jetty-servlet/9.2.17.v20160517/jetty-servlet-9.2.17.v20160517.jar
15-Aug-2017 23:56:11 [INFO] Downloaded: http://repo.maven.apache.org/maven2/org/eclipse/jetty/jetty-http/9.2.17.v20160517/jetty-http-9.2.17.v20160517.jar (124 KB at 3166.0 KB/sec)
15-Aug-2017 23:56:11 [INFO] Downloading: http://repo.maven.apache.org/maven2/org/eclipse/jetty/jetty-security/9.2.17.v20160517/jetty-security-9.2.17.v20160517.jar
15-Aug-2017 23:56:11 [INFO] Downloaded: http://repo.maven.apache.org/maven2/javax/servlet/javax.servlet-api/3.1.0/javax.servlet-api-3.1.0.jar (94 KB at 3341.4 KB/sec)
15-Aug-2017 23:56:11 [INFO] Downloading: http://repo.maven.apache.org/maven2/org/eclipse/jetty/websocket/websocket-common/9.2.17.v20160517/websocket-common-9.2.17.v20160517.jar
15-Aug-2017 23:56:11 [INFO] Downloaded: http://repo.maven.apache.org/maven2/org/eclipse/jetty/jetty-server/9.2.17.v20160517/jetty-server-9.2.17.v20160517.jar (410 KB at 8350.6 KB/sec)
15-Aug-2017 23:56:11 [INFO] Downloaded: http://repo.maven.apache.org/maven2/org/eclipse/jetty/jetty-servlet/9.2.17.v20160517/jetty-servlet-9.2.17.v20160517.jar (113 KB at 3528.8 KB/sec)
15-Aug-2017 23:56:11 [INFO] Downloaded: http://repo.maven.apache.org/maven2/org/eclipse/jetty/jetty-security/9.2.17.v20160517/jetty-security-9.2.17.v20160517.jar (94 KB at 2926.2 KB/sec)
15-Aug-2017 23:56:11 [INFO] Downloaded: http://repo.maven.apache.org/maven2/com/fasterxml/jackson/core/jackson-databind/2.6.7.1/jackson-databind-2.6.7.1.jar (1139 KB at 5342.8 KB/sec)
15-Aug-2017 23:56:11 [INFO] Downloaded: http://repo.maven.apache.org/maven2/org/eclipse/jetty/websocket/websocket-common/9.2.17.v20160517/websocket-common-9.2.17.v20160517.jar (176 KB at 4395.6 KB/sec)
15-Aug-2017 23:56:11 [INFO] Downloading: https://oss.sonatype.org/content/groups/jetty/org/eclipse/jetty/jetty-util/9.2.17.v20160517/jetty-util-9.2.17.v20160517.jar
15-Aug-2017 23:56:11 [INFO] Downloading: https://oss.sonatype.org/content/groups/jetty/org/eclipse/jetty/jetty-io/9.2.17.v20160517/jetty-io-9.2.17.v20160517.jar
15-Aug-2017 23:56:11 [INFO] Downloading: https://oss.sonatype.org/content/groups/jetty/org/eclipse/jetty/jetty-http/9.2.17.v20160517/jetty-http-9.2.17.v20160517.jar
15-Aug-2017 23:56:11 [INFO] Downloading: https://oss.sonatype.org/content/groups/jetty/org/eclipse/jetty/websocket/websocket-servlet/9.2.17.v20160517/websocket-servlet-9.2.17.v20160517.jar
15-Aug-2017 23:56:11 [INFO] Downloading: https://oss.sonatype.org/content/groups/jetty/javax/servlet/javax.servlet-api/3.1.0/javax.servlet-api-3.1.0.jar
15-Aug-2017 23:56:11 [INFO] Downloading: https://oss.sonatype.org/content/groups/jetty/org/eclipse/jetty/jetty-security/9.2.17.v20160517/jetty-security-9.2.17.v20160517.jar
15-Aug-2017 23:56:11 [INFO] Downloaded: https://oss.sonatype.org/content/groups/jetty/org/eclipse/jetty/websocket/websocket-servlet/9.2.17.v20160517/websocket-servlet-9.2.17.v20160517.jar (18 KB at 79.8 KB/sec)
15-Aug-2017 23:56:11 [INFO] Downloaded: https://oss.sonatype.org/content/groups/jetty/org/eclipse/jetty/jetty-http/9.2.17.v20160517/jetty-http-9.2.17.v20160517.jar (124 KB at 473.1 KB/sec)
15-Aug-2017 23:56:11 [INFO] Downloaded: https://oss.sonatype.org/content/groups/jetty/org/eclipse/jetty/jetty-io/9.2.17.v20160517/jetty-io-9.2.17.v20160517.jar (106 KB at 401.9 KB/sec)
15-Aug-2017 23:56:12 [INFO] Downloaded: https://oss.sonatype.org/content/groups/jetty/org/eclipse/jetty/jetty-util/9.2.17.v20160517/jetty-util-9.2.17.v20160517.jar (360 KB at 1060.2 KB/sec)
15-Aug-2017 23:56:12 [INFO] Downloaded: https://oss.sonatype.org/content/groups/jetty/org/eclipse/jetty/jetty-security/9.2.17.v20160517/jetty-security-9.2.17.v20160517.jar (94 KB at 379.1 KB/sec)
15-Aug-2017 23:56:12 [INFO]
15-Aug-2017 23:56:12 [INFO] --- maven-clean-plugin:2.5:clean (default-clean) @ microservice-app ---
15-Aug-2017 23:56:12 [INFO]
15-Aug-2017 23:56:12 [INFO] --- apache-rat-plugin:0.10:check (rat-check) @ microservice-app ---
15-Aug-2017 23:56:12 [INFO] 51 implicit excludes (use -debug for more details).
15-Aug-2017 23:56:12 [INFO] Exclude: build-number.txt
15-Aug-2017 23:56:12 [INFO] Exclude: LICENSE*.txt
15-Aug-2017 23:56:12 [INFO] Exclude: *.rst
15-Aug-2017 23:56:12 [INFO] Exclude: *.md
15-Aug-2017 23:56:12 [INFO] Exclude: **/*.md
15-Aug-2017 23:56:12 [INFO] 27 resources included (use -debug for more details)
15-Aug-2017 23:56:12 [INFO] Rat check: Summary of files. Unapproved: 0 unknown: 0 generated: 0 approved: 27 licence.
15-Aug-2017 23:56:12 [INFO]
15-Aug-2017 23:56:12 [INFO] --- maven-resources-plugin:2.6:resources (default-resources) @ microservice-app ---
15-Aug-2017 23:56:12 [INFO] Using 'UTF-8' encoding to copy filtered resources.
15-Aug-2017 23:56:12 [INFO] skip non existing resourceDirectory /var/bamboo/xml-data/build-dir/MS-BT4-JOB1/microservice-app/src/main/resources
15-Aug-2017 23:56:12 [INFO]
15-Aug-2017 23:56:12 [INFO] --- maven-compiler-plugin:3.1:compile (default-compile) @ microservice-app ---
15-Aug-2017 23:56:12 [INFO] Changes detected - recompiling the module!
15-Aug-2017 23:56:12 [INFO] Compiling 21 source files to /var/bamboo/xml-data/build-dir/MS-BT4-JOB1/microservice-app/target/classes
15-Aug-2017 23:56:13 [WARNING] /var/bamboo/xml-data/build-dir/MS-BT4-JOB1/microservice-app/src/main/java/co/cask/microservice/MicroserviceApp.java: /var/bamboo/xml-data/build-dir/MS-BT4-JOB1/microservice-app/src/main/java/co/cask/microservice/MicroserviceApp.java uses unchecked or unsafe operations.
15-Aug-2017 23:56:13 [WARNING] /var/bamboo/xml-data/build-dir/MS-BT4-JOB1/microservice-app/src/main/java/co/cask/microservice/MicroserviceApp.java: Recompile with -Xlint:unchecked for details.
15-Aug-2017 23:56:13 [INFO]
15-Aug-2017 23:56:13 [INFO] --- maven-resources-plugin:2.6:testResources (default-testResources) @ microservice-app ---
15-Aug-2017 23:56:13 [INFO] Using 'UTF-8' encoding to copy filtered resources.
15-Aug-2017 23:56:13 [INFO] skip non existing resourceDirectory /var/bamboo/xml-data/build-dir/MS-BT4-JOB1/microservice-app/src/test/resources
15-Aug-2017 23:56:13 [INFO]
15-Aug-2017 23:56:13 [INFO] --- maven-compiler-plugin:3.1:testCompile (default-testCompile) @ microservice-app ---
15-Aug-2017 23:56:13 [INFO] Changes detected - recompiling the module!
15-Aug-2017 23:56:13 [INFO] Compiling 5 source files to /var/bamboo/xml-data/build-dir/MS-BT4-JOB1/microservice-app/target/test-classes
15-Aug-2017 23:56:18 [INFO]
15-Aug-2017 23:56:18 [INFO] --- maven-checkstyle-plugin:2.17:check (validate) @ microservice-app ---
15-Aug-2017 23:56:20 [INFO] Starting audit...
15-Aug-2017 23:56:20 Audit done.
15-Aug-2017 23:56:20 [INFO]
15-Aug-2017 23:56:20 [INFO] --- maven-surefire-plugin:2.14.1:test (default-test) @ microservice-app ---
15-Aug-2017 23:56:20 [INFO] Surefire report directory: /var/bamboo/xml-data/build-dir/MS-BT4-JOB1/microservice-app/target/surefire-reports
15-Aug-2017 23:56:20
15-Aug-2017 23:56:20 -------------------------------------------------------
15-Aug-2017 23:56:20 T E S T S
15-Aug-2017 23:56:20 -------------------------------------------------------
15-Aug-2017 23:56:20
15-Aug-2017 23:56:20 -------------------------------------------------------
15-Aug-2017 23:56:20 T E S T S
15-Aug-2017 23:56:20 -------------------------------------------------------
15-Aug-2017 23:56:21 Running co.cask.microservice.MicroserviceAppTest
15-Aug-2017 23:56:21 SLF4J: Class path contains multiple SLF4J bindings.
15-Aug-2017 23:56:21 SLF4J: Found binding in [jar:file:/home/bamboo/.m2/repository/co/cask/cdap/cdap-explore-jdbc/4.2.0/cdap-explore-jdbc-4.2.0.jar!/org/slf4j/impl/StaticLoggerBinder.class]
15-Aug-2017 23:56:21 SLF4J: Found binding in [jar:file:/home/bamboo/.m2/repository/ch/qos/logback/logback-classic/1.0.9/logback-classic-1.0.9.jar!/org/slf4j/impl/StaticLoggerBinder.class]
15-Aug-2017 23:56:21 SLF4J: See http://www.slf4j.org/codes.html#multiple_bindings for an explanation.
15-Aug-2017 23:56:22 23:56:21,837 |-INFO in ch.qos.logback.classic.LoggerContext[default] - Could NOT find resource [logback.groovy]
15-Aug-2017 23:56:22 23:56:21,837 |-INFO in ch.qos.logback.classic.LoggerContext[default] - Found resource [logback-test.xml] at [jar:file:/home/bamboo/.m2/repository/co/cask/cdap/cdap-app-fabric/4.2.0/cdap-app-fabric-4.2.0-tests.jar!/logback-test.xml]
15-Aug-2017 23:56:22 23:56:21,839 |-WARN in ch.qos.logback.classic.LoggerContext[default] - Resource [logback-test.xml] occurs multiple times on the classpath.
15-Aug-2017 23:56:22 23:56:21,839 |-WARN in ch.qos.logback.classic.LoggerContext[default] - Resource [logback-test.xml] occurs at [jar:file:/home/bamboo/.m2/repository/co/cask/cdap/cdap-common/4.2.0/cdap-common-4.2.0-tests.jar!/logback-test.xml]
15-Aug-2017 23:56:22 23:56:21,839 |-WARN in ch.qos.logback.classic.LoggerContext[default] - Resource [logback-test.xml] occurs at [jar:file:/home/bamboo/.m2/repository/co/cask/cdap/cdap-app-fabric/4.2.0/cdap-app-fabric-4.2.0-tests.jar!/logback-test.xml]
15-Aug-2017 23:56:22 23:56:21,877 |-INFO in ch.qos.logback.core.joran.spi.ConfigurationWatchList@3483c0e9 - URL [jar:file:/home/bamboo/.m2/repository/co/cask/cdap/cdap-app-fabric/4.2.0/cdap-app-fabric-4.2.0-tests.jar!/logback-test.xml] is not of type file
15-Aug-2017 23:56:22 23:56:22,015 |-INFO in ch.qos.logback.classic.joran.action.ConfigurationAction - debug attribute not set
15-Aug-2017 23:56:22 23:56:22,031 |-INFO in ch.qos.logback.classic.joran.action.LoggerAction - Setting level of logger [org.apache.hadoop] to INFO
15-Aug-2017 23:56:22 23:56:22,031 |-INFO in ch.qos.logback.classic.joran.action.LoggerAction - Setting level of logger [org.mortbay.log] to INFO
15-Aug-2017 23:56:22 23:56:22,031 |-INFO in ch.qos.logback.core.joran.action.AppenderAction - About to instantiate appender of type [ch.qos.logback.core.ConsoleAppender]
15-Aug-2017 23:56:22 23:56:22,037 |-INFO in ch.qos.logback.core.joran.action.AppenderAction - Naming appender as [STDOUT]
15-Aug-2017 23:56:22 23:56:22,071 |-INFO in ch.qos.logback.core.joran.action.NestedComplexPropertyIA - Assuming default type [ch.qos.logback.classic.encoder.PatternLayoutEncoder] for [encoder] property
15-Aug-2017 23:56:22 23:56:22,260 |-INFO in ch.qos.logback.classic.joran.action.LoggerAction - Setting level of logger [co.cask.cdap] to INFO
15-Aug-2017 23:56:22 23:56:22,260 |-INFO in ch.qos.logback.classic.joran.action.RootLoggerAction - Setting level of ROOT logger to WARN
15-Aug-2017 23:56:22 23:56:22,260 |-INFO in ch.qos.logback.core.joran.action.AppenderRefAction - Attaching appender named [STDOUT] to Logger[ROOT]
15-Aug-2017 23:56:22 23:56:22,261 |-INFO in ch.qos.logback.classic.joran.action.ConfigurationAction - End of configuration.
15-Aug-2017 23:56:22 23:56:22,263 |-INFO in ch.qos.logback.classic.joran.JoranConfigurator@35ee1bee - Registering current configuration as safe fallback point
15-Aug-2017 23:56:22
15-Aug-2017 23:56:22 SLF4J: Actual binding is of type [ch.qos.logback.classic.util.ContextSelectorStaticBinder]
15-Aug-2017 23:56:22 SLF4J: Class path contains multiple SLF4J bindings.
15-Aug-2017 23:56:22 SLF4J: Found binding in [jar:file:/home/bamboo/.m2/repository/co/cask/cdap/cdap-explore-jdbc/4.2.0/cdap-explore-jdbc-4.2.0.jar!/org/slf4j/impl/StaticLoggerBinder.class]
15-Aug-2017 23:56:22 SLF4J: Found binding in [jar:file:/home/bamboo/.m2/repository/ch/qos/logback/logback-classic/1.0.9/logback-classic-1.0.9.jar!/org/slf4j/impl/StaticLoggerBinder.class]
15-Aug-2017 23:56:22 SLF4J: See http://www.slf4j.org/codes.html#multiple_bindings for an explanation.
15-Aug-2017 23:56:23 23:56:22,964 |-INFO in ch.qos.logback.classic.LoggerContext[default] - Could NOT find resource [logback.groovy]
15-Aug-2017 23:56:23 23:56:22,964 |-INFO in ch.qos.logback.classic.LoggerContext[default] - Found resource [logback-test.xml] at [jar:file:/home/bamboo/.m2/repository/co/cask/cdap/cdap-app-fabric/4.2.0/cdap-app-fabric-4.2.0-tests.jar!/logback-test.xml]
15-Aug-2017 23:56:23 23:56:22,966 |-WARN in ch.qos.logback.classic.LoggerContext[default] - Resource [logback-test.xml] occurs multiple times on the classpath.
15-Aug-2017 23:56:23 23:56:22,966 |-WARN in ch.qos.logback.classic.LoggerContext[default] - Resource [logback-test.xml] occurs at [jar:file:/home/bamboo/.m2/repository/co/cask/cdap/cdap-common/4.2.0/cdap-common-4.2.0-tests.jar!/logback-test.xml]
15-Aug-2017 23:56:23 23:56:22,966 |-WARN in ch.qos.logback.classic.LoggerContext[default] - Resource [logback-test.xml] occurs at [jar:file:/home/bamboo/.m2/repository/co/cask/cdap/cdap-app-fabric/4.2.0/cdap-app-fabric-4.2.0-tests.jar!/logback-test.xml]
15-Aug-2017 23:56:23 23:56:23,009 |-INFO in ch.qos.logback.core.joran.spi.ConfigurationWatchList@7bb0e64a - URL [jar:file:/home/bamboo/.m2/repository/co/cask/cdap/cdap-app-fabric/4.2.0/cdap-app-fabric-4.2.0-tests.jar!/logback-test.xml] is not of type file
15-Aug-2017 23:56:23 23:56:23,068 |-INFO in ch.qos.logback.classic.joran.action.ConfigurationAction - debug attribute not set
15-Aug-2017 23:56:23 23:56:23,084 |-INFO in ch.qos.logback.classic.joran.action.LoggerAction - Setting level of logger [org.apache.hadoop] to INFO
15-Aug-2017 23:56:23 23:56:23,085 |-INFO in ch.qos.logback.classic.joran.action.LoggerAction - Setting level of logger [org.mortbay.log] to INFO
15-Aug-2017 23:56:23 23:56:23,085 |-INFO in ch.qos.logback.core.joran.action.AppenderAction - About to instantiate appender of type [ch.qos.logback.core.ConsoleAppender]
15-Aug-2017 23:56:23 23:56:23,092 |-INFO in ch.qos.logback.core.joran.action.AppenderAction - Naming appender as [STDOUT]
15-Aug-2017 23:56:23 23:56:23,122 |-INFO in ch.qos.logback.core.joran.action.NestedComplexPropertyIA - Assuming default type [ch.qos.logback.classic.encoder.PatternLayoutEncoder] for [encoder] property
15-Aug-2017 23:56:23 23:56:23,262 |-INFO in ch.qos.logback.classic.joran.action.LoggerAction - Setting level of logger [co.cask.cdap] to INFO
15-Aug-2017 23:56:23 23:56:23,262 |-INFO in ch.qos.logback.classic.joran.action.RootLoggerAction - Setting level of ROOT logger to WARN
15-Aug-2017 23:56:23 23:56:23,262 |-INFO in ch.qos.logback.core.joran.action.AppenderRefAction - Attaching appender named [STDOUT] to Logger[ROOT]
15-Aug-2017 23:56:23 23:56:23,263 |-INFO in ch.qos.logback.classic.joran.action.ConfigurationAction - End of configuration.
15-Aug-2017 23:56:23 23:56:23,266 |-INFO in ch.qos.logback.classic.joran.JoranConfigurator@1adf43b7 - Registering current configuration as safe fallback point
15-Aug-2017 23:56:23
15-Aug-2017 23:56:23 SLF4J: Actual binding is of type [ch.qos.logback.classic.util.ContextSelectorStaticBinder]
15-Aug-2017 23:56:23 2017-08-15 23:56:23,586 - INFO  [main:c.c.c.t.TestBase@411] - Custom configuration set: cdap.unit.test.explore.enabled = false
15-Aug-2017 23:56:27 2017-08-15 23:56:27,586 - INFO  [CoreMessagingService STARTING:c.c.c.m.s.l.LevelDBTableFactory@81] - Messaging metadata table created at /tmp/MS-BT4-JOB1/junit659657479746278169/junit8608187920824827877/messaging/system.tms.meta
15-Aug-2017 23:56:27 2017-08-15 23:56:27,629 - INFO  [CoreMessagingService STARTING:c.c.c.m.s.CoreMessagingService@312] - System topic created: topic:system.audit
15-Aug-2017 23:56:27 2017-08-15 23:56:27,632 - INFO  [CoreMessagingService STARTING:c.c.c.m.s.CoreMessagingService@312] - System topic created: topic:system.dataevent
15-Aug-2017 23:56:27 2017-08-15 23:56:27,634 - INFO  [CoreMessagingService STARTING:c.c.c.m.s.CoreMessagingService@312] - System topic created: topic:system.metrics0
15-Aug-2017 23:56:27 2017-08-15 23:56:27,636 - INFO  [CoreMessagingService STARTING:c.c.c.m.s.CoreMessagingService@312] - System topic created: topic:system.metrics1
15-Aug-2017 23:56:27 2017-08-15 23:56:27,639 - INFO  [CoreMessagingService STARTING:c.c.c.m.s.CoreMessagingService@312] - System topic created: topic:system.metrics2
15-Aug-2017 23:56:27 2017-08-15 23:56:27,641 - INFO  [CoreMessagingService STARTING:c.c.c.m.s.CoreMessagingService@312] - System topic created: topic:system.metrics3
15-Aug-2017 23:56:27 2017-08-15 23:56:27,643 - INFO  [CoreMessagingService STARTING:c.c.c.m.s.CoreMessagingService@312] - System topic created: topic:system.metrics4
15-Aug-2017 23:56:27 2017-08-15 23:56:27,646 - INFO  [CoreMessagingService STARTING:c.c.c.m.s.CoreMessagingService@312] - System topic created: topic:system.metrics5
15-Aug-2017 23:56:27 2017-08-15 23:56:27,648 - INFO  [CoreMessagingService STARTING:c.c.c.m.s.CoreMessagingService@312] - System topic created: topic:system.metrics6
15-Aug-2017 23:56:27 2017-08-15 23:56:27,650 - INFO  [CoreMessagingService STARTING:c.c.c.m.s.CoreMessagingService@312] - System topic created: topic:system.metrics7
15-Aug-2017 23:56:27 2017-08-15 23:56:27,652 - INFO  [CoreMessagingService STARTING:c.c.c.m.s.CoreMessagingService@312] - System topic created: topic:system.metrics8
15-Aug-2017 23:56:27 2017-08-15 23:56:27,654 - INFO  [CoreMessagingService STARTING:c.c.c.m.s.CoreMessagingService@312] - System topic created: topic:system.metrics9
15-Aug-2017 23:56:27 2017-08-15 23:56:27,656 - INFO  [CoreMessagingService STARTING:c.c.c.m.s.CoreMessagingService@312] - System topic created: topic:system.notifications
15-Aug-2017 23:56:27 2017-08-15 23:56:27,659 - INFO  [CoreMessagingService STARTING:c.c.c.m.s.CoreMessagingService@312] - System topic created: topic:system.timeevent
15-Aug-2017 23:56:27 2017-08-15 23:56:27,661 - INFO  [CoreMessagingService STARTING:c.c.c.m.s.CoreMessagingService@312] - System topic created: topic:system.streamsizeevent
15-Aug-2017 23:56:27 2017-08-15 23:56:27,661 - INFO  [CoreMessagingService STARTING:c.c.c.m.s.CoreMessagingService@240] - Core Messaging Service started
15-Aug-2017 23:56:28 2017-08-15 23:56:28,132 - WARN  [main:o.a.h.u.NativeCodeLoader@62] - Unable to load native-hadoop library for your platform... using builtin-java classes where applicable
15-Aug-2017 23:56:28 2017-08-15 23:56:28,667 - INFO  [DatasetOpExecutorService STARTING:c.c.c.d.d.d.s.e.DatasetOpExecutorService@81] - Starting DatasetOpExecutorService...
15-Aug-2017 23:56:28 2017-08-15 23:56:28,828 - INFO  [DatasetOpExecutorService STARTING:c.c.c.d.d.d.s.e.DatasetOpExecutorService@86] - DatasetOpExecutorService started successfully on /127.0.0.1:43806
15-Aug-2017 23:56:29 2017-08-15 23:56:29,062 - WARN  [main:c.c.c.e.c.ExploreFacade@56] - Explore functionality for datasets is disabled. All calls to enable explore will be no-ops
15-Aug-2017 23:56:29 2017-08-15 23:56:29,098 - INFO  [DatasetService:c.c.c.d.d.d.s.DatasetService@110] - Starting DatasetService...
15-Aug-2017 23:56:29 2017-08-15 23:56:29,110 - INFO  [DatasetTypeService STARTING:c.c.c.d.d.InMemoryDatasetFramework@254] - Created dataset dataset:system.datasets.type of type co.cask.cdap.data2.datafabric.dataset.service.mds.DatasetTypeMDS
15-Aug-2017 23:56:29 2017-08-15 23:56:29,110 - INFO  [DatasetTypeService STARTING:c.c.c.d.d.InMemoryDatasetFramework@254] - Created dataset dataset:system.datasets.instance of type co.cask.cdap.data2.datafabric.dataset.service.mds.DatasetInstanceMDS
15-Aug-2017 23:56:29 2017-08-15 23:56:29,468 - INFO  [NettyHttpService STARTING:c.c.c.d.d.d.s.DatasetTypeHandler@60] - Starting DatasetTypeHandler
15-Aug-2017 23:56:29 2017-08-15 23:56:29,484 - INFO  [DatasetService:c.c.c.d.d.d.s.DatasetService$1@124] - Discovered dataset.executor service
15-Aug-2017 23:56:29 2017-08-15 23:56:29,486 - INFO  [DatasetService:c.c.c.d.d.d.s.DatasetService@168] - Waiting for dataset.executor service to be discoverable
15-Aug-2017 23:56:29 2017-08-15 23:56:29,487 - INFO  [DatasetService:c.c.c.d.d.d.s.DatasetService@150] - Announcing DatasetService for discovery...
15-Aug-2017 23:56:29 2017-08-15 23:56:29,487 - INFO  [DatasetService:c.c.c.d.d.d.s.DatasetService@155] - DatasetService started successfully on localhost/127.0.0.1:43698
15-Aug-2017 23:56:29 2017-08-15 23:56:29,515 - INFO  [main:c.c.c.m.q.MetricsQueryService@79] - Configuring MetricsService , address: 127.0.0.1, backlog connections: 20000, execthreads: 20, bossthreads: 1, workerthreads: 10
15-Aug-2017 23:56:29 2017-08-15 23:56:29,516 - INFO  [MetricsQueryService STARTING:c.c.c.m.q.MetricsQueryService@93] - Starting Metrics Service...
15-Aug-2017 23:56:29 2017-08-15 23:56:29,528 - INFO  [MetricsQueryService STARTING:c.c.c.m.q.MetricsQueryService@95] - Started Metrics HTTP Service...
15-Aug-2017 23:56:29 2017-08-15 23:56:29,528 - INFO  [MetricsQueryService STARTING:c.c.c.m.q.MetricsQueryService@99] - Metrics Service started successfully on /127.0.0.1:44366
15-Aug-2017 23:56:29 2017-08-15 23:56:29,781 - WARN  [main:c.c.c.e.c.ExploreFacade@56] - Explore functionality for datasets is disabled. All calls to enable explore will be no-ops
15-Aug-2017 23:56:29 2017-08-15 23:56:29,782 - WARN  [main:c.c.c.e.c.ExploreFacade@56] - Explore functionality for datasets is disabled. All calls to enable explore will be no-ops
15-Aug-2017 23:56:30 2017-08-15 23:56:30,192 - INFO  [dataset.service-executor-9:c.c.c.d.d.d.s.DatasetInstanceService@264] - Creating dataset system.schedule.store, type name: ProgramScheduleStoreDataset, properties: {}
15-Aug-2017 23:56:30 2017-08-15 23:56:30,247 - INFO  [dataset.executor-executor-2:c.c.c.d.d.d.s.e.DatasetAdminService@101] - Creating dataset instance dataset:system.schedule.store, type meta: DatasetTypeMeta{name='ProgramScheduleStoreDataset', modules=[DatasetModuleMeta{name='orderedTable-memory', className='co.cask.cdap.data2.dataset2.module.lib.inmemory.InMemoryTableModule', jarLocation=null, jarLocationPath=null, types=[table, co.cask.cdap.api.dataset.table.Table], usesModules=[], usedByModules=[core, objectMappedTable, cube, usage, lineage, app-fabric]}, DatasetModuleMeta{name='core', className='co.cask.cdap.data2.dataset2.lib.table.CoreDatasetsModule', jarLocation=null, jarLocationPath=null, types=[keyValueTable, co.cask.cdap.api.dataset.lib.KeyValueTable, objectStore, co.cask.cdap.api.dataset.lib.ObjectStore, indexedObjectStore, co.cask.cdap.api.dataset.lib.IndexedObjectStore, indexedTable, co.cask.cdap.api.dataset.lib.IndexedTable, timeseriesTable, co.cask.cdap.api.dataset.lib.TimeseriesTable, counterTimeseriesTable, co.cask.cdap.api.dataset.lib.CounterTimeseriesTable, memoryTable], usesModules=[orderedTable-memory], usedByModules=[timePartitionedFileSet, partitionedFileSet, metadata, app-fabric]}, DatasetModuleMeta{name='app-fabric', className='co.cask.cdap.internal.app.AppFabricDatasetModule', jarLocation=null, jarLocationPath=null, types=[co.cask.cdap.internal.app.runtime.schedule.queue.JobQueueDataset, ProgramScheduleStoreDataset], usesModules=[orderedTable-memory, core], usedByModules=[]}]}
15-Aug-2017 23:56:30 2017-08-15 23:56:30,279 - WARN  [dataset.service-executor-9:c.c.c.d.a.AuditPublishers@120] - Audit publisher is null, audit information will not be published
15-Aug-2017 23:56:30 2017-08-15 23:56:30,389 - INFO  [LocalSchedulerService STARTING:o.q.s.RAMJobStore@155] - RAMJobStore initialized.
15-Aug-2017 23:56:30 2017-08-15 23:56:30,416 - INFO  [dataset.service-executor-8:c.c.c.d.d.d.s.DatasetInstanceService@264] - Creating dataset system.schedulestore, type name: co.cask.cdap.api.dataset.table.Table, properties: {}
15-Aug-2017 23:56:30 2017-08-15 23:56:30,435 - INFO  [dataset.executor-executor-9:c.c.c.d.d.d.s.e.DatasetAdminService@101] - Creating dataset instance dataset:system.schedulestore, type meta: DatasetTypeMeta{name='co.cask.cdap.api.dataset.table.Table', modules=[DatasetModuleMeta{name='orderedTable-memory', className='co.cask.cdap.data2.dataset2.module.lib.inmemory.InMemoryTableModule', jarLocation=null, jarLocationPath=null, types=[table, co.cask.cdap.api.dataset.table.Table], usesModules=[], usedByModules=[core, objectMappedTable, cube, usage, lineage, app-fabric]}]}
15-Aug-2017 23:56:30 2017-08-15 23:56:30,529 - INFO  [LocalSchedulerService STARTING:c.c.c.i.a.r.s.AbstractSchedulerService@67] - Started time scheduler
15-Aug-2017 23:56:30 2017-08-15 23:56:30,585 - INFO  [LocalSchedulerService STARTING:c.c.c.i.a.r.s.AbstractSchedulerService@76] - Started stream size scheduler
15-Aug-2017 23:56:30 2017-08-15 23:56:30,616 - INFO  [dataset.service-executor-7:c.c.c.d.d.d.s.DatasetInstanceService@264] - Creating dataset system.metrics.v2.table.ts.1, type name: co.cask.cdap.data2.dataset2.lib.table.MetricsTable, properties: {hbase.splits=[[0,0,0,2],[0,0,0,3],[0,0,0,4],[0,0,0,5],[0,0,0,6],[0,0,0,7],[0,0,0,8],[0,0,0,9],[0,0,0,10],[0,0,0,11],[0,0,0,12]], dataset.table.ttl=7200, dataset.table.readless.increment=true}
15-Aug-2017 23:56:30 2017-08-15 23:56:30,633 - INFO  [dataset.executor-executor-3:c.c.c.d.d.d.s.e.DatasetAdminService@101] - Creating dataset instance dataset:system.metrics.v2.table.ts.1, type meta: DatasetTypeMeta{name='co.cask.cdap.data2.dataset2.lib.table.MetricsTable', modules=[DatasetModuleMeta{name='metricsTable-memory', className='co.cask.cdap.data2.dataset2.module.lib.inmemory.InMemoryMetricsTableModule', jarLocation=null, jarLocationPath=null, types=[co.cask.cdap.data2.dataset2.lib.table.inmemory.InMemoryMetricsTable, co.cask.cdap.data2.dataset2.lib.table.MetricsTable], usesModules=[], usedByModules=[cube]}]}
15-Aug-2017 23:56:30 2017-08-15 23:56:30,644 - INFO  [dataset.service-executor-5:c.c.c.d.d.d.s.DatasetInstanceService@264] - Creating dataset system.app.meta, type name: co.cask.cdap.api.dataset.table.Table, properties: {}
15-Aug-2017 23:56:30 2017-08-15 23:56:30,654 - INFO  [dataset.executor-executor-1:c.c.c.d.d.d.s.e.DatasetAdminService@101] - Creating dataset instance dataset:system.app.meta, type meta: DatasetTypeMeta{name='co.cask.cdap.api.dataset.table.Table', modules=[DatasetModuleMeta{name='orderedTable-memory', className='co.cask.cdap.data2.dataset2.module.lib.inmemory.InMemoryTableModule', jarLocation=null, jarLocationPath=null, types=[table, co.cask.cdap.api.dataset.table.Table], usesModules=[], usedByModules=[core, objectMappedTable, cube, usage, lineage, app-fabric]}]}
15-Aug-2017 23:56:30 2017-08-15 23:56:30,672 - INFO  [dataset.service-executor-6:c.c.c.d.d.d.s.DatasetInstanceService@264] - Creating dataset system.metrics.v2.entity, type name: co.cask.cdap.data2.dataset2.lib.table.MetricsTable, properties: {}
15-Aug-2017 23:56:30 2017-08-15 23:56:30,678 - INFO  [dataset.executor-executor-7:c.c.c.d.d.d.s.e.DatasetAdminService@101] - Creating dataset instance dataset:system.metrics.v2.entity, type meta: DatasetTypeMeta{name='co.cask.cdap.data2.dataset2.lib.table.MetricsTable', modules=[DatasetModuleMeta{name='metricsTable-memory', className='co.cask.cdap.data2.dataset2.module.lib.inmemory.InMemoryMetricsTableModule', jarLocation=null, jarLocationPath=null, types=[co.cask.cdap.data2.dataset2.lib.table.inmemory.InMemoryMetricsTable, co.cask.cdap.data2.dataset2.lib.table.MetricsTable], usesModules=[], usedByModules=[cube]}]}
15-Aug-2017 23:56:30 2017-08-15 23:56:30,778 - INFO  [dataset.service-executor-2:c.c.c.d.d.d.s.DatasetInstanceService@264] - Creating dataset system.metrics.v2.table.ts.60, type name: co.cask.cdap.data2.dataset2.lib.table.MetricsTable, properties: {hbase.splits=[[0,0,0,2],[0,0,0,3],[0,0,0,4],[0,0,0,5],[0,0,0,6],[0,0,0,7],[0,0,0,8],[0,0,0,9],[0,0,0,10],[0,0,0,11],[0,0,0,12]], dataset.table.ttl=2592000, dataset.table.readless.increment=true}
15-Aug-2017 23:56:30 2017-08-15 23:56:30,786 - INFO  [dataset.executor-executor-4:c.c.c.d.d.d.s.e.DatasetAdminService@101] - Creating dataset instance dataset:system.metrics.v2.table.ts.60, type meta: DatasetTypeMeta{name='co.cask.cdap.data2.dataset2.lib.table.MetricsTable', modules=[DatasetModuleMeta{name='metricsTable-memory', className='co.cask.cdap.data2.dataset2.module.lib.inmemory.InMemoryMetricsTableModule', jarLocation=null, jarLocationPath=null, types=[co.cask.cdap.data2.dataset2.lib.table.inmemory.InMemoryMetricsTable, co.cask.cdap.data2.dataset2.lib.table.MetricsTable], usesModules=[], usedByModules=[cube]}]}
15-Aug-2017 23:56:30 2017-08-15 23:56:30,808 - INFO  [ STARTING:c.c.c.s.CoreSchedulerService@205] - Schedule migration is completed for all namespaces.
15-Aug-2017 23:56:30 2017-08-15 23:56:30,835 - INFO  [dataset.service-executor-7:c.c.c.d.d.d.s.DatasetInstanceService@264] - Creating dataset system.job.queue, type name: co.cask.cdap.internal.app.runtime.schedule.queue.JobQueueDataset, properties: {}
15-Aug-2017 23:56:30 2017-08-15 23:56:30,848 - INFO  [dataset.executor-executor-8:c.c.c.d.d.d.s.e.DatasetAdminService@101] - Creating dataset instance dataset:system.job.queue, type meta: DatasetTypeMeta{name='co.cask.cdap.internal.app.runtime.schedule.queue.JobQueueDataset', modules=[DatasetModuleMeta{name='orderedTable-memory', className='co.cask.cdap.data2.dataset2.module.lib.inmemory.InMemoryTableModule', jarLocation=null, jarLocationPath=null, types=[table, co.cask.cdap.api.dataset.table.Table], usesModules=[], usedByModules=[core, objectMappedTable, cube, usage, lineage, app-fabric]}, DatasetModuleMeta{name='core', className='co.cask.cdap.data2.dataset2.lib.table.CoreDatasetsModule', jarLocation=null, jarLocationPath=null, types=[keyValueTable, co.cask.cdap.api.dataset.lib.KeyValueTable, objectStore, co.cask.cdap.api.dataset.lib.ObjectStore, indexedObjectStore, co.cask.cdap.api.dataset.lib.IndexedObjectStore, indexedTable, co.cask.cdap.api.dataset.lib.IndexedTable, timeseriesTable, co.cask.cdap.api.dataset.lib.TimeseriesTable, counterTimeseriesTable, co.cask.cdap.api.dataset.lib.CounterTimeseriesTable, memoryTable], usesModules=[orderedTable-memory], usedByModules=[timePartitionedFileSet, partitionedFileSet, metadata, app-fabric]}, DatasetModuleMeta{name='app-fabric', className='co.cask.cdap.internal.app.AppFabricDatasetModule', jarLocation=null, jarLocationPath=null, types=[co.cask.cdap.internal.app.runtime.schedule.queue.JobQueueDataset, ProgramScheduleStoreDataset], usesModules=[orderedTable-memory, core], usedByModules=[]}]}
15-Aug-2017 23:56:30 2017-08-15 23:56:30,850 - INFO  [dataset.service-executor-4:c.c.c.d.d.d.s.DatasetInstanceService@264] - Creating dataset system.metrics.v2.table.ts.3600, type name: co.cask.cdap.data2.dataset2.lib.table.MetricsTable, properties: {hbase.splits=[[0,0,0,2],[0,0,0,3],[0,0,0,4],[0,0,0,5],[0,0,0,6],[0,0,0,7],[0,0,0,8],[0,0,0,9],[0,0,0,10],[0,0,0,11],[0,0,0,12]], dataset.table.ttl=2592000, dataset.table.readless.increment=true}
15-Aug-2017 23:56:30 2017-08-15 23:56:30,857 - INFO  [dataset.executor-executor-1:c.c.c.d.d.d.s.e.DatasetAdminService@101] - Creating dataset instance dataset:system.metrics.v2.table.ts.3600, type meta: DatasetTypeMeta{name='co.cask.cdap.data2.dataset2.lib.table.MetricsTable', modules=[DatasetModuleMeta{name='metricsTable-memory', className='co.cask.cdap.data2.dataset2.module.lib.inmemory.InMemoryMetricsTableModule', jarLocation=null, jarLocationPath=null, types=[co.cask.cdap.data2.dataset2.lib.table.inmemory.InMemoryMetricsTable, co.cask.cdap.data2.dataset2.lib.table.MetricsTable], usesModules=[], usedByModules=[cube]}]}
15-Aug-2017 23:56:30 2017-08-15 23:56:30,928 - INFO  [dataset.service-executor-4:c.c.c.d.d.d.s.DatasetInstanceService@264] - Creating dataset system.metrics.v2.table.ts.2147483647, type name: co.cask.cdap.data2.dataset2.lib.table.MetricsTable, properties: {hbase.splits=[[0,0,0,2],[0,0,0,3],[0,0,0,4],[0,0,0,5],[0,0,0,6],[0,0,0,7],[0,0,0,8],[0,0,0,9],[0,0,0,10],[0,0,0,11],[0,0,0,12]], dataset.table.readless.increment=true}
15-Aug-2017 23:56:30 2017-08-15 23:56:30,933 - INFO  [dataset.executor-executor-8:c.c.c.d.d.d.s.e.DatasetAdminService@101] - Creating dataset instance dataset:system.metrics.v2.table.ts.2147483647, type meta: DatasetTypeMeta{name='co.cask.cdap.data2.dataset2.lib.table.MetricsTable', modules=[DatasetModuleMeta{name='metricsTable-memory', className='co.cask.cdap.data2.dataset2.module.lib.inmemory.InMemoryMetricsTableModule', jarLocation=null, jarLocationPath=null, types=[co.cask.cdap.data2.dataset2.lib.table.inmemory.InMemoryMetricsTable, co.cask.cdap.data2.dataset2.lib.table.MetricsTable], usesModules=[], usedByModules=[cube]}]}
15-Aug-2017 23:56:30 2017-08-15 23:56:30,936 - INFO  [ STARTING:c.c.c.s.CoreSchedulerService$2@136] - Cleaning up jobs in state PENDING_LAUNCH.
15-Aug-2017 23:56:30 2017-08-15 23:56:30,942 - INFO  [ConstraintCheckerService STARTING:c.c.c.s.ConstraintCheckerService@104] - Starting ConstraintCheckerService.
15-Aug-2017 23:56:30 2017-08-15 23:56:30,990 - INFO  [ConstraintCheckerService STARTING:c.c.c.s.ConstraintCheckerService@114] - Started ConstraintCheckerService. state: STARTING
15-Aug-2017 23:56:31 2017-08-15 23:56:31,034 - INFO  [NotificationSubscriberService STARTING:c.c.c.s.NotificationSubscriberService@108] - Start running NotificationSubscriberService
15-Aug-2017 23:56:31 2017-08-15 23:56:31,199 - INFO  [scheduler-subscriber-task:c.c.c.m.s.l.LevelDBTableFactory@93] - Messaging message table created at /tmp/MS-BT4-JOB1/junit659657479746278169/junit8608187920824827877/messaging/system.tms.message
15-Aug-2017 23:56:32 2017-08-15 23:56:32,579 - WARN  [main:c.c.c.e.c.ExploreFacade@56] - Explore functionality for datasets is disabled. All calls to enable explore will be no-ops
15-Aug-2017 23:56:32 2017-08-15 23:56:32,583 - INFO  [main:c.c.c.i.a.n.DefaultNamespaceAdmin@228] - Namespace namespace:default created with meta NamespaceMeta{name='default', description='Default Namespace', config=NamespaceConfig{schedulerQueueName='', rootDirectory='null', hbaseNamespace='null', hiveDatabase='null', principal='null', groupName='null', keytabURI='null', exploreAsPrincipal='true'}}
15-Aug-2017 23:56:37 2017-08-15 23:56:37,339 - INFO  [dataset.service-executor-3:c.c.c.d.d.d.s.DatasetInstanceService@264] - Creating dataset system.artifact.meta, type name: co.cask.cdap.api.dataset.table.Table, properties: {conflict.level=COLUMN}
15-Aug-2017 23:56:37 2017-08-15 23:56:37,342 - INFO  [dataset.executor-executor-7:c.c.c.d.d.d.s.e.DatasetAdminService@101] - Creating dataset instance dataset:system.artifact.meta, type meta: DatasetTypeMeta{name='co.cask.cdap.api.dataset.table.Table', modules=[DatasetModuleMeta{name='orderedTable-memory', className='co.cask.cdap.data2.dataset2.module.lib.inmemory.InMemoryTableModule', jarLocation=null, jarLocationPath=null, types=[table, co.cask.cdap.api.dataset.table.Table], usesModules=[], usedByModules=[core, objectMappedTable, cube, usage, lineage, app-fabric]}]}
15-Aug-2017 23:56:37 2017-08-15 23:56:37,396 - INFO  [dataset.service-executor-8:c.c.c.d.d.d.s.DatasetInstanceService@264] - Creating dataset system.system.metadata, type name: co.cask.cdap.data2.metadata.dataset.MetadataDataset, properties: {scope=SYSTEM}
15-Aug-2017 23:56:37 2017-08-15 23:56:37,400 - INFO  [dataset.executor-executor-5:c.c.c.d.d.d.s.e.DatasetAdminService@101] - Creating dataset instance dataset:system.system.metadata, type meta: DatasetTypeMeta{name='co.cask.cdap.data2.metadata.dataset.MetadataDataset', modules=[DatasetModuleMeta{name='orderedTable-memory', className='co.cask.cdap.data2.dataset2.module.lib.inmemory.InMemoryTableModule', jarLocation=null, jarLocationPath=null, types=[table, co.cask.cdap.api.dataset.table.Table], usesModules=[], usedByModules=[core, objectMappedTable, cube, usage, lineage, app-fabric]}, DatasetModuleMeta{name='core', className='co.cask.cdap.data2.dataset2.lib.table.CoreDatasetsModule', jarLocation=null, jarLocationPath=null, types=[keyValueTable, co.cask.cdap.api.dataset.lib.KeyValueTable, objectStore, co.cask.cdap.api.dataset.lib.ObjectStore, indexedObjectStore, co.cask.cdap.api.dataset.lib.IndexedObjectStore, indexedTable, co.cask.cdap.api.dataset.lib.IndexedTable, timeseriesTable, co.cask.cdap.api.dataset.lib.TimeseriesTable, counterTimeseriesTable, co.cask.cdap.api.dataset.lib.CounterTimeseriesTable, memoryTable], usesModules=[orderedTable-memory], usedByModules=[timePartitionedFileSet, partitionedFileSet, metadata, app-fabric]}, DatasetModuleMeta{name='metadata', className='co.cask.cdap.data2.metadata.dataset.MetadataDatasetModule', jarLocation=null, jarLocationPath=null, types=[metadataDataset, co.cask.cdap.data2.metadata.dataset.MetadataDataset], usesModules=[orderedTable-memory, core], usedByModules=[]}]}
15-Aug-2017 23:56:40 2017-08-15 23:56:40,870 - INFO  [main:c.c.c.i.a.d.p.DatasetModulesDeployer@73] - Not adding dataset type 'co.cask.cdap.api.dataset.lib.KeyValueTable' because it is defined by the system.
15-Aug-2017 23:56:40 2017-08-15 23:56:40,873 - INFO  [main:c.c.c.i.a.d.p.DatasetInstanceCreator@64] - Adding dataset instance: microservice
15-Aug-2017 23:56:40 2017-08-15 23:56:40,879 - INFO  [dataset.service-executor-4:c.c.c.d.d.d.s.DatasetInstanceService@264] - Creating dataset default.microservice, type name: co.cask.cdap.api.dataset.lib.KeyValueTable, properties: {}
15-Aug-2017 23:56:40 2017-08-15 23:56:40,882 - INFO  [dataset.executor-executor-8:c.c.c.d.d.d.s.e.DatasetAdminService@101] - Creating dataset instance dataset:default.microservice, type meta: DatasetTypeMeta{name='co.cask.cdap.api.dataset.lib.KeyValueTable', modules=[DatasetModuleMeta{name='orderedTable-memory', className='co.cask.cdap.data2.dataset2.module.lib.inmemory.InMemoryTableModule', jarLocation=null, jarLocationPath=null, types=[table, co.cask.cdap.api.dataset.table.Table], usesModules=[], usedByModules=[core, objectMappedTable, cube, usage, lineage, app-fabric]}, DatasetModuleMeta{name='core', className='co.cask.cdap.data2.dataset2.lib.table.CoreDatasetsModule', jarLocation=null, jarLocationPath=null, types=[keyValueTable, co.cask.cdap.api.dataset.lib.KeyValueTable, objectStore, co.cask.cdap.api.dataset.lib.ObjectStore, indexedObjectStore, co.cask.cdap.api.dataset.lib.IndexedObjectStore, indexedTable, co.cask.cdap.api.dataset.lib.IndexedTable, timeseriesTable, co.cask.cdap.api.dataset.lib.TimeseriesTable, counterTimeseriesTable, co.cask.cdap.api.dataset.lib.CounterTimeseriesTable, memoryTable], usesModules=[orderedTable-memory], usedByModules=[timePartitionedFileSet, partitionedFileSet, metadata, app-fabric]}]}
15-Aug-2017 23:56:41 2017-08-15 23:56:41,724 - INFO  [dataset.service-executor-8:c.c.c.d.d.d.s.DatasetInstanceService@264] - Creating dataset system.owner.meta, type name: co.cask.cdap.api.dataset.table.Table, properties: {conflict.level=COLUMN}
15-Aug-2017 23:56:41 2017-08-15 23:56:41,726 - INFO  [dataset.executor-executor-6:c.c.c.d.d.d.s.e.DatasetAdminService@101] - Creating dataset instance dataset:system.owner.meta, type meta: DatasetTypeMeta{name='co.cask.cdap.api.dataset.table.Table', modules=[DatasetModuleMeta{name='orderedTable-memory', className='co.cask.cdap.data2.dataset2.module.lib.inmemory.InMemoryTableModule', jarLocation=null, jarLocationPath=null, types=[table, co.cask.cdap.api.dataset.table.Table], usesModules=[], usedByModules=[core, objectMappedTable, cube, usage, lineage, app-fabric]}]}
15-Aug-2017 23:56:41 2017-08-15 23:56:41,740 - INFO  [main:c.c.c.i.a.d.p.DatasetModulesDeployer@73] - Not adding dataset type 'co.cask.cdap.api.dataset.lib.KeyValueTable' because it is defined by the system.
15-Aug-2017 23:56:41 2017-08-15 23:56:41,905 - INFO  [dataset.service-executor-7:c.c.c.d.d.d.s.DatasetInstanceService@264] - Creating dataset system.config.store.table, type name: co.cask.cdap.api.dataset.table.Table, properties: {}
15-Aug-2017 23:56:41 2017-08-15 23:56:41,907 - INFO  [dataset.executor-executor-1:c.c.c.d.d.d.s.e.DatasetAdminService@101] - Creating dataset instance dataset:system.config.store.table, type meta: DatasetTypeMeta{name='co.cask.cdap.api.dataset.table.Table', modules=[DatasetModuleMeta{name='orderedTable-memory', className='co.cask.cdap.data2.dataset2.module.lib.inmemory.InMemoryTableModule', jarLocation=null, jarLocationPath=null, types=[table, co.cask.cdap.api.dataset.table.Table], usesModules=[], usedByModules=[core, objectMappedTable, cube, usage, lineage, app-fabric]}]}
15-Aug-2017 23:56:43 2017-08-15 23:56:43,484 - WARN  [worker-microservice-0:c.c.m.c.t.TMSOutboundChannelManager@50] - Dropping data since topic default:pipe is not found.
15-Aug-2017 23:56:44 2017-08-15 23:56:44,485 - WARN  [worker-microservice-0:c.c.m.c.t.TMSOutboundChannelManager@50] - Dropping data since topic default:pipe is not found.
15-Aug-2017 23:56:45 2017-08-15 23:56:45,486 - WARN  [worker-microservice-0:c.c.m.c.t.TMSOutboundChannelManager@50] - Dropping data since topic default:pipe is not found.
15-Aug-2017 23:56:46 2017-08-15 23:56:46,487 - WARN  [worker-microservice-0:c.c.m.c.t.TMSOutboundChannelManager@50] - Dropping data since topic default:pipe is not found.
15-Aug-2017 23:56:47 2017-08-15 23:56:47,488 - WARN  [worker-microservice-0:c.c.m.c.t.TMSOutboundChannelManager@50] - Dropping data since topic default:pipe is not found.
15-Aug-2017 23:56:47 2017-08-15 23:56:47,764 - INFO  [dataset.service-executor-5:c.c.c.d.d.d.s.DatasetInstanceService@264] - Creating dataset system.lineage, type name: co.cask.cdap.data2.metadata.lineage.LineageDataset, properties: {}
15-Aug-2017 23:56:47 2017-08-15 23:56:47,766 - INFO  [dataset.executor-executor-0:c.c.c.d.d.d.s.e.DatasetAdminService@101] - Creating dataset instance dataset:system.lineage, type meta: DatasetTypeMeta{name='co.cask.cdap.data2.metadata.lineage.LineageDataset', modules=[DatasetModuleMeta{name='orderedTable-memory', className='co.cask.cdap.data2.dataset2.module.lib.inmemory.InMemoryTableModule', jarLocation=null, jarLocationPath=null, types=[table, co.cask.cdap.api.dataset.table.Table], usesModules=[], usedByModules=[core, objectMappedTable, cube, usage, lineage, app-fabric]}, DatasetModuleMeta{name='lineage', className='co.cask.cdap.data2.metadata.lineage.LineageDatasetModule', jarLocation=null, jarLocationPath=null, types=[lineageDataset, co.cask.cdap.data2.metadata.lineage.LineageDataset], usesModules=[orderedTable-memory], usedByModules=[]}]}
15-Aug-2017 23:56:47 2017-08-15 23:56:47,805 - INFO  [dataset.service-executor-0:c.c.c.d.d.d.s.DatasetInstanceService@264] - Creating dataset system.usage.registry, type name: UsageDataset, properties: {}
15-Aug-2017 23:56:47 2017-08-15 23:56:47,808 - INFO  [dataset.executor-executor-6:c.c.c.d.d.d.s.e.DatasetAdminService@101] - Creating dataset instance dataset:system.usage.registry, type meta: DatasetTypeMeta{name='UsageDataset', modules=[DatasetModuleMeta{name='orderedTable-memory', className='co.cask.cdap.data2.dataset2.module.lib.inmemory.InMemoryTableModule', jarLocation=null, jarLocationPath=null, types=[table, co.cask.cdap.api.dataset.table.Table], usesModules=[], usedByModules=[core, objectMappedTable, cube, usage, lineage, app-fabric]}, DatasetModuleMeta{name='usage', className='co.cask.cdap.data2.registry.UsageDatasetModule', jarLocation=null, jarLocationPath=null, types=[UsageDataset], usesModules=[orderedTable-memory], usedByModules=[]}]}
15-Aug-2017 23:56:47 2017-08-15 23:56:47,810 - INFO  [dataset.service-executor-1:c.c.c.d.d.d.s.DatasetInstanceService@264] - Creating dataset system.usage.registry, type name: UsageDataset, properties: {}
15-Aug-2017 23:56:47 2017-08-15 23:56:47,812 - INFO  [dataset.executor-executor-8:c.c.c.d.d.d.s.e.DatasetAdminService@101] - Creating dataset instance dataset:system.usage.registry, type meta: DatasetTypeMeta{name='UsageDataset', modules=[DatasetModuleMeta{name='orderedTable-memory', className='co.cask.cdap.data2.dataset2.module.lib.inmemory.InMemoryTableModule', jarLocation=null, jarLocationPath=null, types=[table, co.cask.cdap.api.dataset.table.Table], usesModules=[], usedByModules=[core, objectMappedTable, cube, usage, lineage, app-fabric]}, DatasetModuleMeta{name='usage', className='co.cask.cdap.data2.registry.UsageDatasetModule', jarLocation=null, jarLocationPath=null, types=[UsageDataset], usesModules=[orderedTable-memory], usedByModules=[]}]}
15-Aug-2017 23:56:57 2017-08-15 23:56:57,457 - INFO  [pcontroller-program:default.microservice-generator-app.-SNAPSHOT.worker.microservice-62a90e61-8215-11e7-9558-000000192799:c.c.c.i.a.AbstractInMemoryProgramRunner$InMemoryProgramController@187] - Stopping Program: microservice
15-Aug-2017 23:56:57 2017-08-15 23:56:57,573 - INFO  [pcontroller-program:default.microservice-generator-app.-SNAPSHOT.worker.microservice-62a90e61-8215-11e7-9558-000000192799:c.c.c.i.a.AbstractInMemoryProgramRunner$InMemoryProgramController@200] - Program stopped: microservice
15-Aug-2017 23:56:57 2017-08-15 23:56:57,583 - INFO  [pcontroller-program:default.microservice-consumer-app.-SNAPSHOT.worker.microservice-65cda6f2-8215-11e7-afa3-000000bfe767:c.c.c.i.a.AbstractInMemoryProgramRunner$InMemoryProgramController@187] - Stopping Program: microservice
15-Aug-2017 23:56:57 2017-08-15 23:56:57,616 - INFO  [pcontroller-program:default.microservice-consumer-app.-SNAPSHOT.worker.microservice-65cda6f2-8215-11e7-afa3-000000bfe767:c.c.c.i.a.AbstractInMemoryProgramRunner$InMemoryProgramController@200] - Program stopped: microservice
15-Aug-2017 23:56:59 2017-08-15 23:56:59,488 - INFO  [main:c.c.c.i.a.d.p.DatasetModulesDeployer@73] - Not adding dataset type 'co.cask.cdap.api.dataset.lib.KeyValueTable' because it is defined by the system.
15-Aug-2017 23:57:09 2017-08-15 23:57:09,815 - INFO  [pcontroller-program:default.microservice-even-filter.-SNAPSHOT.worker.microservice-6d384da3-8215-11e7-88cb-0000001698e2:c.c.c.i.a.AbstractInMemoryProgramRunner$InMemoryProgramController@187] - Stopping Program: microservice
15-Aug-2017 23:57:09 2017-08-15 23:57:09,828 - INFO  [pcontroller-program:default.microservice-even-filter.-SNAPSHOT.worker.microservice-6d384da3-8215-11e7-88cb-0000001698e2:c.c.c.i.a.AbstractInMemoryProgramRunner$InMemoryProgramController@200] - Program stopped: microservice
15-Aug-2017 23:57:09 2017-08-15 23:57:09,866 - WARN  [WebSocketClient@308533739-177:o.e.j.w.c.e.AbstractEventDriver@245] - Unhandled Error (closing connection)
15-Aug-2017 23:57:09 java.lang.NoClassDefFoundError: org/eclipse/jetty/websocket/common/io/AbstractWebSocketConnection$OnDisconnectCallback
15-Aug-2017 23:57:09         at org.eclipse.jetty.websocket.common.io.AbstractWebSocketConnection.onConnectionStateChange(AbstractWebSocketConnection.java:459) [websocket-common-9.2.17.v20160517.jar:9.2.17.v20160517]
15-Aug-2017 23:57:09         at org.eclipse.jetty.websocket.common.io.IOState.notifyStateListeners(IOState.java:184) ~[websocket-common-9.2.17.v20160517.jar:9.2.17.v20160517]
15-Aug-2017 23:57:09         at org.eclipse.jetty.websocket.common.io.IOState.onCloseRemote(IOState.java:351) ~[websocket-common-9.2.17.v20160517.jar:9.2.17.v20160517]
15-Aug-2017 23:57:09         at org.eclipse.jetty.websocket.common.events.AbstractEventDriver.incomingFrame(AbstractEventDriver.java:120) ~[websocket-common-9.2.17.v20160517.jar:9.2.17.v20160517]
15-Aug-2017 23:57:09         at org.eclipse.jetty.websocket.common.WebSocketSession.incomingFrame(WebSocketSession.java:309) [websocket-common-9.2.17.v20160517.jar:9.2.17.v20160517]
15-Aug-2017 23:57:09         at org.eclipse.jetty.websocket.common.extensions.ExtensionStack.incomingFrame(ExtensionStack.java:214) [websocket-common-9.2.17.v20160517.jar:9.2.17.v20160517]
15-Aug-2017 23:57:09         at org.eclipse.jetty.websocket.common.Parser.notifyFrame(Parser.java:220) [websocket-common-9.2.17.v20160517.jar:9.2.17.v20160517]
15-Aug-2017 23:57:09         at org.eclipse.jetty.websocket.common.Parser.parse(Parser.java:258) [websocket-common-9.2.17.v20160517.jar:9.2.17.v20160517]
15-Aug-2017 23:57:09         at org.eclipse.jetty.websocket.common.io.AbstractWebSocketConnection.readParse(AbstractWebSocketConnection.java:632) [websocket-common-9.2.17.v20160517.jar:9.2.17.v20160517]
15-Aug-2017 23:57:09         at org.eclipse.jetty.websocket.common.io.AbstractWebSocketConnection.onFillable(AbstractWebSocketConnection.java:480) [websocket-common-9.2.17.v20160517.jar:9.2.17.v20160517]
15-Aug-2017 23:57:09         at org.eclipse.jetty.io.AbstractConnection$2.run(AbstractConnection.java:544) [jetty-io-9.2.17.v20160517.jar:9.2.17.v20160517]
15-Aug-2017 23:57:09         at org.eclipse.jetty.util.thread.QueuedThreadPool.runJob(QueuedThreadPool.java:635) [jetty-util-9.2.17.v20160517.jar:9.2.17.v20160517]
15-Aug-2017 23:57:09         at org.eclipse.jetty.util.thread.QueuedThreadPool$3.run(QueuedThreadPool.java:555) [jetty-util-9.2.17.v20160517.jar:9.2.17.v20160517]
15-Aug-2017 23:57:09         at java.lang.Thread.run(Thread.java:745) [na:1.7.0_75]
15-Aug-2017 23:57:09 Caused by: java.lang.ClassNotFoundException: org.eclipse.jetty.websocket.common.io.AbstractWebSocketConnection$OnDisconnectCallback
15-Aug-2017 23:57:09         at java.net.URLClassLoader$1.run(URLClassLoader.java:366) ~[na:1.7.0_75]
15-Aug-2017 23:57:09         at java.net.URLClassLoader$1.run(URLClassLoader.java:355) ~[na:1.7.0_75]
15-Aug-2017 23:57:09         at java.security.AccessController.doPrivileged(Native Method) ~[na:1.7.0_75]
15-Aug-2017 23:57:09         at java.net.URLClassLoader.findClass(URLClassLoader.java:354) ~[na:1.7.0_75]
15-Aug-2017 23:57:09         at co.cask.cdap.common.lang.InterceptableClassLoader.findClass(InterceptableClassLoader.java:46) ~[na:na]
15-Aug-2017 23:57:09         at java.lang.ClassLoader.loadClass(ClassLoader.java:425) ~[na:1.7.0_75]
15-Aug-2017 23:57:09         at java.lang.ClassLoader.loadClass(ClassLoader.java:358) ~[na:1.7.0_75]
15-Aug-2017 23:57:09         ... 14 common frames omitted
15-Aug-2017 23:57:09 2017-08-15 23:57:09,873 - WARN  [WebSocketClient@1574625436-186:o.e.j.w.c.e.AbstractEventDriver@245] - Unhandled Error (closing connection)
15-Aug-2017 23:57:09 java.lang.NoClassDefFoundError: org/eclipse/jetty/websocket/common/io/AbstractWebSocketConnection$OnDisconnectCallback
15-Aug-2017 23:57:09         at org.eclipse.jetty.websocket.common.io.AbstractWebSocketConnection.onConnectionStateChange(AbstractWebSocketConnection.java:459) [websocket-common-9.2.17.v20160517.jar:9.2.17.v20160517]
15-Aug-2017 23:57:09         at org.eclipse.jetty.websocket.common.io.IOState.notifyStateListeners(IOState.java:184) ~[websocket-common-9.2.17.v20160517.jar:9.2.17.v20160517]
15-Aug-2017 23:57:09         at org.eclipse.jetty.websocket.common.io.IOState.onCloseRemote(IOState.java:351) ~[websocket-common-9.2.17.v20160517.jar:9.2.17.v20160517]
15-Aug-2017 23:57:09         at org.eclipse.jetty.websocket.common.events.AbstractEventDriver.incomingFrame(AbstractEventDriver.java:120) ~[websocket-common-9.2.17.v20160517.jar:9.2.17.v20160517]
15-Aug-2017 23:57:09         at org.eclipse.jetty.websocket.common.WebSocketSession.incomingFrame(WebSocketSession.java:309) [websocket-common-9.2.17.v20160517.jar:9.2.17.v20160517]
15-Aug-2017 23:57:09         at org.eclipse.jetty.websocket.common.extensions.ExtensionStack.incomingFrame(ExtensionStack.java:214) [websocket-common-9.2.17.v20160517.jar:9.2.17.v20160517]
15-Aug-2017 23:57:09         at org.eclipse.jetty.websocket.common.Parser.notifyFrame(Parser.java:220) [websocket-common-9.2.17.v20160517.jar:9.2.17.v20160517]
15-Aug-2017 23:57:09         at org.eclipse.jetty.websocket.common.Parser.parse(Parser.java:258) [websocket-common-9.2.17.v20160517.jar:9.2.17.v20160517]
15-Aug-2017 23:57:09         at org.eclipse.jetty.websocket.common.io.AbstractWebSocketConnection.readParse(AbstractWebSocketConnection.java:632) [websocket-common-9.2.17.v20160517.jar:9.2.17.v20160517]
15-Aug-2017 23:57:09         at org.eclipse.jetty.websocket.common.io.AbstractWebSocketConnection.onFillable(AbstractWebSocketConnection.java:480) [websocket-common-9.2.17.v20160517.jar:9.2.17.v20160517]
15-Aug-2017 23:57:09         at org.eclipse.jetty.io.AbstractConnection$2.run(AbstractConnection.java:544) [jetty-io-9.2.17.v20160517.jar:9.2.17.v20160517]
15-Aug-2017 23:57:09         at org.eclipse.jetty.util.thread.QueuedThreadPool.runJob(QueuedThreadPool.java:635) [jetty-util-9.2.17.v20160517.jar:9.2.17.v20160517]
15-Aug-2017 23:57:09         at org.eclipse.jetty.util.thread.QueuedThreadPool$3.run(QueuedThreadPool.java:555) [jetty-util-9.2.17.v20160517.jar:9.2.17.v20160517]
15-Aug-2017 23:57:09         at java.lang.Thread.run(Thread.java:745) [na:1.7.0_75]
15-Aug-2017 23:57:09 2017-08-15 23:57:09,874 - WARN  [WebSocketClient@1574625436-186:o.e.j.w.c.Parser@228] -
15-Aug-2017 23:57:09 java.lang.NoClassDefFoundError: org/eclipse/jetty/websocket/common/events/AbstractEventDriver$1
15-Aug-2017 23:57:09         at org.eclipse.jetty.websocket.common.events.AbstractEventDriver.unhandled(AbstractEventDriver.java:249) ~[websocket-common-9.2.17.v20160517.jar:9.2.17.v20160517]
15-Aug-2017 23:57:09         at org.eclipse.jetty.websocket.common.events.AbstractEventDriver.incomingFrame(AbstractEventDriver.java:186) ~[websocket-common-9.2.17.v20160517.jar:9.2.17.v20160517]
15-Aug-2017 23:57:09         at org.eclipse.jetty.websocket.common.WebSocketSession.incomingFrame(WebSocketSession.java:309) ~[websocket-common-9.2.17.v20160517.jar:9.2.17.v20160517]
15-Aug-2017 23:57:09         at org.eclipse.jetty.websocket.common.extensions.ExtensionStack.incomingFrame(ExtensionStack.java:214) ~[websocket-common-9.2.17.v20160517.jar:9.2.17.v20160517]
15-Aug-2017 23:57:09         at org.eclipse.jetty.websocket.common.Parser.notifyFrame(Parser.java:220) [websocket-common-9.2.17.v20160517.jar:9.2.17.v20160517]
15-Aug-2017 23:57:09         at org.eclipse.jetty.websocket.common.Parser.parse(Parser.java:258) [websocket-common-9.2.17.v20160517.jar:9.2.17.v20160517]
15-Aug-2017 23:57:09         at org.eclipse.jetty.websocket.common.io.AbstractWebSocketConnection.readParse(AbstractWebSocketConnection.java:632) [websocket-common-9.2.17.v20160517.jar:9.2.17.v20160517]
15-Aug-2017 23:57:09         at org.eclipse.jetty.websocket.common.io.AbstractWebSocketConnection.onFillable(AbstractWebSocketConnection.java:480) [websocket-common-9.2.17.v20160517.jar:9.2.17.v20160517]
15-Aug-2017 23:57:09         at org.eclipse.jetty.io.AbstractConnection$2.run(AbstractConnection.java:544) [jetty-io-9.2.17.v20160517.jar:9.2.17.v20160517]
15-Aug-2017 23:57:09         at org.eclipse.jetty.util.thread.QueuedThreadPool.runJob(QueuedThreadPool.java:635) [jetty-util-9.2.17.v20160517.jar:9.2.17.v20160517]
15-Aug-2017 23:57:09         at org.eclipse.jetty.util.thread.QueuedThreadPool$3.run(QueuedThreadPool.java:555) [jetty-util-9.2.17.v20160517.jar:9.2.17.v20160517]
15-Aug-2017 23:57:09         at java.lang.Thread.run(Thread.java:745) [na:1.7.0_75]
15-Aug-2017 23:57:09 2017-08-15 23:57:09,874 - WARN  [WebSocketClient@1574625436-186:o.e.j.w.c.Parser@235] -
15-Aug-2017 23:57:09 org.eclipse.jetty.websocket.api.WebSocketException: java.lang.NoClassDefFoundError: org/eclipse/jetty/websocket/common/events/AbstractEventDriver$1
15-Aug-2017 23:57:09         at org.eclipse.jetty.websocket.common.Parser.notifyFrame(Parser.java:229) [websocket-common-9.2.17.v20160517.jar:9.2.17.v20160517]
15-Aug-2017 23:57:09         at org.eclipse.jetty.websocket.common.Parser.parse(Parser.java:258) [websocket-common-9.2.17.v20160517.jar:9.2.17.v20160517]
15-Aug-2017 23:57:09         at org.eclipse.jetty.websocket.common.io.AbstractWebSocketConnection.readParse(AbstractWebSocketConnection.java:632) [websocket-common-9.2.17.v20160517.jar:9.2.17.v20160517]
15-Aug-2017 23:57:09         at org.eclipse.jetty.websocket.common.io.AbstractWebSocketConnection.onFillable(AbstractWebSocketConnection.java:480) [websocket-common-9.2.17.v20160517.jar:9.2.17.v20160517]
15-Aug-2017 23:57:09         at org.eclipse.jetty.io.AbstractConnection$2.run(AbstractConnection.java:544) [jetty-io-9.2.17.v20160517.jar:9.2.17.v20160517]
15-Aug-2017 23:57:09         at org.eclipse.jetty.util.thread.QueuedThreadPool.runJob(QueuedThreadPool.java:635) [jetty-util-9.2.17.v20160517.jar:9.2.17.v20160517]
15-Aug-2017 23:57:09         at org.eclipse.jetty.util.thread.QueuedThreadPool$3.run(QueuedThreadPool.java:555) [jetty-util-9.2.17.v20160517.jar:9.2.17.v20160517]
15-Aug-2017 23:57:09         at java.lang.Thread.run(Thread.java:745) [na:1.7.0_75]
15-Aug-2017 23:57:09 Caused by: java.lang.NoClassDefFoundError: org/eclipse/jetty/websocket/common/events/AbstractEventDriver$1
15-Aug-2017 23:57:09         at org.eclipse.jetty.websocket.common.events.AbstractEventDriver.unhandled(AbstractEventDriver.java:249) ~[websocket-common-9.2.17.v20160517.jar:9.2.17.v20160517]
15-Aug-2017 23:57:09         at org.eclipse.jetty.websocket.common.events.AbstractEventDriver.incomingFrame(AbstractEventDriver.java:186) ~[websocket-common-9.2.17.v20160517.jar:9.2.17.v20160517]
15-Aug-2017 23:57:09         at org.eclipse.jetty.websocket.common.WebSocketSession.incomingFrame(WebSocketSession.java:309) ~[websocket-common-9.2.17.v20160517.jar:9.2.17.v20160517]
15-Aug-2017 23:57:09         at org.eclipse.jetty.websocket.common.extensions.ExtensionStack.incomingFrame(ExtensionStack.java:214) ~[websocket-common-9.2.17.v20160517.jar:9.2.17.v20160517]
15-Aug-2017 23:57:09         at org.eclipse.jetty.websocket.common.Parser.notifyFrame(Parser.java:220) [websocket-common-9.2.17.v20160517.jar:9.2.17.v20160517]
15-Aug-2017 23:57:09         ... 7 common frames omitted
15-Aug-2017 23:57:09 2017-08-15 23:57:09,875 - WARN  [WebSocketClient@1574625436-186:o.e.j.w.c.i.AbstractWebSocketConnection@650] -
15-Aug-2017 23:57:09 java.lang.NoClassDefFoundError: org/eclipse/jetty/websocket/common/io/AbstractWebSocketConnection$OnDisconnectCallback
15-Aug-2017 23:57:09         at org.eclipse.jetty.websocket.common.io.AbstractWebSocketConnection.onConnectionStateChange(AbstractWebSocketConnection.java:445) [websocket-common-9.2.17.v20160517.jar:9.2.17.v20160517]
15-Aug-2017 23:57:09         at org.eclipse.jetty.websocket.common.io.IOState.notifyStateListeners(IOState.java:184) ~[websocket-common-9.2.17.v20160517.jar:9.2.17.v20160517]
15-Aug-2017 23:57:09         at org.eclipse.jetty.websocket.common.io.IOState.onReadFailure(IOState.java:472) ~[websocket-common-9.2.17.v20160517.jar:9.2.17.v20160517]
15-Aug-2017 23:57:09         at org.eclipse.jetty.websocket.common.io.AbstractWebSocketConnection.readParse(AbstractWebSocketConnection.java:623) [websocket-common-9.2.17.v20160517.jar:9.2.17.v20160517]
15-Aug-2017 23:57:09         at org.eclipse.jetty.websocket.common.io.AbstractWebSocketConnection.onFillable(AbstractWebSocketConnection.java:480) [websocket-common-9.2.17.v20160517.jar:9.2.17.v20160517]
15-Aug-2017 23:57:09         at org.eclipse.jetty.io.AbstractConnection$2.run(AbstractConnection.java:544) [jetty-io-9.2.17.v20160517.jar:9.2.17.v20160517]
15-Aug-2017 23:57:09         at org.eclipse.jetty.util.thread.QueuedThreadPool.runJob(QueuedThreadPool.java:635) [jetty-util-9.2.17.v20160517.jar:9.2.17.v20160517]
15-Aug-2017 23:57:09         at org.eclipse.jetty.util.thread.QueuedThreadPool$3.run(QueuedThreadPool.java:555) [jetty-util-9.2.17.v20160517.jar:9.2.17.v20160517]
15-Aug-2017 23:57:09         at java.lang.Thread.run(Thread.java:745) [na:1.7.0_75]
15-Aug-2017 23:57:09 2017-08-15 23:57:09,876 - WARN  [WebSocketClient@308533739-177:o.e.j.w.c.Parser@228] -
15-Aug-2017 23:57:09 java.lang.NoClassDefFoundError: org/eclipse/jetty/websocket/common/events/AbstractEventDriver$1
15-Aug-2017 23:57:09         at org.eclipse.jetty.websocket.common.events.AbstractEventDriver.unhandled(AbstractEventDriver.java:249) ~[websocket-common-9.2.17.v20160517.jar:9.2.17.v20160517]
15-Aug-2017 23:57:09         at org.eclipse.jetty.websocket.common.events.AbstractEventDriver.incomingFrame(AbstractEventDriver.java:186) ~[websocket-common-9.2.17.v20160517.jar:9.2.17.v20160517]
15-Aug-2017 23:57:09         at org.eclipse.jetty.websocket.common.WebSocketSession.incomingFrame(WebSocketSession.java:309) ~[websocket-common-9.2.17.v20160517.jar:9.2.17.v20160517]
15-Aug-2017 23:57:09         at org.eclipse.jetty.websocket.common.extensions.ExtensionStack.incomingFrame(ExtensionStack.java:214) ~[websocket-common-9.2.17.v20160517.jar:9.2.17.v20160517]
15-Aug-2017 23:57:09         at org.eclipse.jetty.websocket.common.Parser.notifyFrame(Parser.java:220) [websocket-common-9.2.17.v20160517.jar:9.2.17.v20160517]
15-Aug-2017 23:57:09         at org.eclipse.jetty.websocket.common.Parser.parse(Parser.java:258) [websocket-common-9.2.17.v20160517.jar:9.2.17.v20160517]
15-Aug-2017 23:57:09         at org.eclipse.jetty.websocket.common.io.AbstractWebSocketConnection.readParse(AbstractWebSocketConnection.java:632) [websocket-common-9.2.17.v20160517.jar:9.2.17.v20160517]
15-Aug-2017 23:57:09         at org.eclipse.jetty.websocket.common.io.AbstractWebSocketConnection.onFillable(AbstractWebSocketConnection.java:480) [websocket-common-9.2.17.v20160517.jar:9.2.17.v20160517]
15-Aug-2017 23:57:09         at org.eclipse.jetty.io.AbstractConnection$2.run(AbstractConnection.java:544) [jetty-io-9.2.17.v20160517.jar:9.2.17.v20160517]
15-Aug-2017 23:57:09         at org.eclipse.jetty.util.thread.QueuedThreadPool.runJob(QueuedThreadPool.java:635) [jetty-util-9.2.17.v20160517.jar:9.2.17.v20160517]
15-Aug-2017 23:57:09         at org.eclipse.jetty.util.thread.QueuedThreadPool$3.run(QueuedThreadPool.java:555) [jetty-util-9.2.17.v20160517.jar:9.2.17.v20160517]
15-Aug-2017 23:57:09         at java.lang.Thread.run(Thread.java:745) [na:1.7.0_75]
15-Aug-2017 23:57:09 Caused by: java.lang.ClassNotFoundException: org.eclipse.jetty.websocket.common.events.AbstractEventDriver$1
15-Aug-2017 23:57:09         at java.net.URLClassLoader$1.run(URLClassLoader.java:366) ~[na:1.7.0_75]
15-Aug-2017 23:57:09         at java.net.URLClassLoader$1.run(URLClassLoader.java:355) ~[na:1.7.0_75]
15-Aug-2017 23:57:09         at java.security.AccessController.doPrivileged(Native Method) ~[na:1.7.0_75]
15-Aug-2017 23:57:09         at java.net.URLClassLoader.findClass(URLClassLoader.java:354) ~[na:1.7.0_75]
15-Aug-2017 23:57:09         at co.cask.cdap.common.lang.InterceptableClassLoader.findClass(InterceptableClassLoader.java:46) ~[na:na]
15-Aug-2017 23:57:09         at java.lang.ClassLoader.loadClass(ClassLoader.java:425) ~[na:1.7.0_75]
15-Aug-2017 23:57:09         at java.lang.ClassLoader.loadClass(ClassLoader.java:358) ~[na:1.7.0_75]
15-Aug-2017 23:57:09         ... 12 common frames omitted
15-Aug-2017 23:57:09 2017-08-15 23:57:09,878 - WARN  [WebSocketClient@308533739-177:o.e.j.w.c.Parser@235] -
15-Aug-2017 23:57:09 org.eclipse.jetty.websocket.api.WebSocketException: java.lang.NoClassDefFoundError: org/eclipse/jetty/websocket/common/events/AbstractEventDriver$1
15-Aug-2017 23:57:09         at org.eclipse.jetty.websocket.common.Parser.notifyFrame(Parser.java:229) [websocket-common-9.2.17.v20160517.jar:9.2.17.v20160517]
15-Aug-2017 23:57:09         at org.eclipse.jetty.websocket.common.Parser.parse(Parser.java:258) [websocket-common-9.2.17.v20160517.jar:9.2.17.v20160517]
15-Aug-2017 23:57:09         at org.eclipse.jetty.websocket.common.io.AbstractWebSocketConnection.readParse(AbstractWebSocketConnection.java:632) [websocket-common-9.2.17.v20160517.jar:9.2.17.v20160517]
15-Aug-2017 23:57:09         at org.eclipse.jetty.websocket.common.io.AbstractWebSocketConnection.onFillable(AbstractWebSocketConnection.java:480) [websocket-common-9.2.17.v20160517.jar:9.2.17.v20160517]
15-Aug-2017 23:57:09         at org.eclipse.jetty.io.AbstractConnection$2.run(AbstractConnection.java:544) [jetty-io-9.2.17.v20160517.jar:9.2.17.v20160517]
15-Aug-2017 23:57:09         at org.eclipse.jetty.util.thread.QueuedThreadPool.runJob(QueuedThreadPool.java:635) [jetty-util-9.2.17.v20160517.jar:9.2.17.v20160517]
15-Aug-2017 23:57:09         at org.eclipse.jetty.util.thread.QueuedThreadPool$3.run(QueuedThreadPool.java:555) [jetty-util-9.2.17.v20160517.jar:9.2.17.v20160517]
15-Aug-2017 23:57:09         at java.lang.Thread.run(Thread.java:745) [na:1.7.0_75]
15-Aug-2017 23:57:09 Caused by: java.lang.NoClassDefFoundError: org/eclipse/jetty/websocket/common/events/AbstractEventDriver$1
15-Aug-2017 23:57:09         at org.eclipse.jetty.websocket.common.events.AbstractEventDriver.unhandled(AbstractEventDriver.java:249) ~[websocket-common-9.2.17.v20160517.jar:9.2.17.v20160517]
15-Aug-2017 23:57:09         at org.eclipse.jetty.websocket.common.events.AbstractEventDriver.incomingFrame(AbstractEventDriver.java:186) ~[websocket-common-9.2.17.v20160517.jar:9.2.17.v20160517]
15-Aug-2017 23:57:09         at org.eclipse.jetty.websocket.common.WebSocketSession.incomingFrame(WebSocketSession.java:309) ~[websocket-common-9.2.17.v20160517.jar:9.2.17.v20160517]
15-Aug-2017 23:57:09         at org.eclipse.jetty.websocket.common.extensions.ExtensionStack.incomingFrame(ExtensionStack.java:214) ~[websocket-common-9.2.17.v20160517.jar:9.2.17.v20160517]
15-Aug-2017 23:57:09         at org.eclipse.jetty.websocket.common.Parser.notifyFrame(Parser.java:220) [websocket-common-9.2.17.v20160517.jar:9.2.17.v20160517]
15-Aug-2017 23:57:09         ... 7 common frames omitted
15-Aug-2017 23:57:09 Caused by: java.lang.ClassNotFoundException: org.eclipse.jetty.websocket.common.events.AbstractEventDriver$1
15-Aug-2017 23:57:09         at java.net.URLClassLoader$1.run(URLClassLoader.java:366) ~[na:1.7.0_75]
15-Aug-2017 23:57:09         at java.net.URLClassLoader$1.run(URLClassLoader.java:355) ~[na:1.7.0_75]
15-Aug-2017 23:57:09         at java.security.AccessController.doPrivileged(Native Method) ~[na:1.7.0_75]
15-Aug-2017 23:57:09         at java.net.URLClassLoader.findClass(URLClassLoader.java:354) ~[na:1.7.0_75]
15-Aug-2017 23:57:09         at co.cask.cdap.common.lang.InterceptableClassLoader.findClass(InterceptableClassLoader.java:46) ~[na:na]
15-Aug-2017 23:57:09         at java.lang.ClassLoader.loadClass(ClassLoader.java:425) ~[na:1.7.0_75]
15-Aug-2017 23:57:09         at java.lang.ClassLoader.loadClass(ClassLoader.java:358) ~[na:1.7.0_75]
15-Aug-2017 23:57:09         ... 12 common frames omitted
15-Aug-2017 23:57:09 2017-08-15 23:57:09,879 - WARN  [WebSocketClient@308533739-177:o.e.j.w.c.i.AbstractWebSocketConnection@650] -
15-Aug-2017 23:57:09 java.lang.NoClassDefFoundError: org/eclipse/jetty/websocket/common/io/AbstractWebSocketConnection$OnDisconnectCallback
15-Aug-2017 23:57:09         at org.eclipse.jetty.websocket.common.io.AbstractWebSocketConnection.onConnectionStateChange(AbstractWebSocketConnection.java:445) [websocket-common-9.2.17.v20160517.jar:9.2.17.v20160517]
15-Aug-2017 23:57:09         at org.eclipse.jetty.websocket.common.io.IOState.notifyStateListeners(IOState.java:184) ~[websocket-common-9.2.17.v20160517.jar:9.2.17.v20160517]
15-Aug-2017 23:57:09         at org.eclipse.jetty.websocket.common.io.IOState.onReadFailure(IOState.java:472) ~[websocket-common-9.2.17.v20160517.jar:9.2.17.v20160517]
15-Aug-2017 23:57:09         at org.eclipse.jetty.websocket.common.io.AbstractWebSocketConnection.readParse(AbstractWebSocketConnection.java:623) [websocket-common-9.2.17.v20160517.jar:9.2.17.v20160517]
15-Aug-2017 23:57:09         at org.eclipse.jetty.websocket.common.io.AbstractWebSocketConnection.onFillable(AbstractWebSocketConnection.java:480) [websocket-common-9.2.17.v20160517.jar:9.2.17.v20160517]
15-Aug-2017 23:57:09         at org.eclipse.jetty.io.AbstractConnection$2.run(AbstractConnection.java:544) [jetty-io-9.2.17.v20160517.jar:9.2.17.v20160517]
15-Aug-2017 23:57:09         at org.eclipse.jetty.util.thread.QueuedThreadPool.runJob(QueuedThreadPool.java:635) [jetty-util-9.2.17.v20160517.jar:9.2.17.v20160517]
15-Aug-2017 23:57:09         at org.eclipse.jetty.util.thread.QueuedThreadPool$3.run(QueuedThreadPool.java:555) [jetty-util-9.2.17.v20160517.jar:9.2.17.v20160517]
15-Aug-2017 23:57:09         at java.lang.Thread.run(Thread.java:745) [na:1.7.0_75]
15-Aug-2017 23:57:09 2017-08-15 23:57:09,902 - INFO  [main:c.c.c.i.a.n.DefaultNamespaceAdmin@312] - Deleting namespace 'namespace:default'.
15-Aug-2017 23:57:09 2017-08-15 23:57:09,905 - WARN  [main:c.c.c.e.c.ExploreFacade@56] - Explore functionality for datasets is disabled. All calls to enable explore will be no-ops
15-Aug-2017 23:57:10 2017-08-15 23:57:10,066 - INFO  [dataset.service-executor-9:c.c.c.d.d.d.s.DatasetInstanceService@264] - Creating dataset system.business.metadata, type name: co.cask.cdap.data2.metadata.dataset.MetadataDataset, properties: {scope=USER}
15-Aug-2017 23:57:10 2017-08-15 23:57:10,069 - INFO  [dataset.executor-executor-2:c.c.c.d.d.d.s.e.DatasetAdminService@101] - Creating dataset instance dataset:system.business.metadata, type meta: DatasetTypeMeta{name='co.cask.cdap.data2.metadata.dataset.MetadataDataset', modules=[DatasetModuleMeta{name='orderedTable-memory', className='co.cask.cdap.data2.dataset2.module.lib.inmemory.InMemoryTableModule', jarLocation=null, jarLocationPath=null, types=[table, co.cask.cdap.api.dataset.table.Table], usesModules=[], usedByModules=[core, objectMappedTable, cube, usage, lineage, app-fabric]}, DatasetModuleMeta{name='core', className='co.cask.cdap.data2.dataset2.lib.table.CoreDatasetsModule', jarLocation=null, jarLocationPath=null, types=[keyValueTable, co.cask.cdap.api.dataset.lib.KeyValueTable, objectStore, co.cask.cdap.api.dataset.lib.ObjectStore, indexedObjectStore, co.cask.cdap.api.dataset.lib.IndexedObjectStore, indexedTable, co.cask.cdap.api.dataset.lib.IndexedTable, timeseriesTable, co.cask.cdap.api.dataset.lib.TimeseriesTable, counterTimeseriesTable, co.cask.cdap.api.dataset.lib.CounterTimeseriesTable, memoryTable], usesModules=[orderedTable-memory], usedByModules=[timePartitionedFileSet, partitionedFileSet, metadata, app-fabric]}, DatasetModuleMeta{name='metadata', className='co.cask.cdap.data2.metadata.dataset.MetadataDatasetModule', jarLocation=null, jarLocationPath=null, types=[metadataDataset, co.cask.cdap.data2.metadata.dataset.MetadataDataset], usesModules=[orderedTable-memory, core], usedByModules=[]}]}
15-Aug-2017 23:57:10 2017-08-15 23:57:10,137 - INFO  [dataset.service-executor-4:c.c.c.d.d.d.s.DatasetInstanceService@264] - Creating dataset system.workflow.stats, type name: co.cask.cdap.api.dataset.table.Table, properties: {}
15-Aug-2017 23:57:10 2017-08-15 23:57:10,140 - INFO  [dataset.executor-executor-5:c.c.c.d.d.d.s.e.DatasetAdminService@101] - Creating dataset instance dataset:system.workflow.stats, type meta: DatasetTypeMeta{name='co.cask.cdap.api.dataset.table.Table', modules=[DatasetModuleMeta{name='orderedTable-memory', className='co.cask.cdap.data2.dataset2.module.lib.inmemory.InMemoryTableModule', jarLocation=null, jarLocationPath=null, types=[table, co.cask.cdap.api.dataset.table.Table], usesModules=[], usedByModules=[core, objectMappedTable, cube, usage, lineage, app-fabric]}]}
15-Aug-2017 23:57:10 2017-08-15 23:57:10,330 - INFO  [dataset.service-executor-0:c.c.c.d.d.d.s.DatasetInstanceService@474] - Deleting dataset default.microservice
15-Aug-2017 23:57:10 2017-08-15 23:57:10,339 - INFO  [dataset.executor-executor-2:c.c.c.d.d.d.s.e.DatasetAdminService@201] - Dropping dataset with spec: DatasetSpecification{name='microservice', type='co.cask.cdap.api.dataset.lib.KeyValueTable', description='null', originalProperties={}, properties={}, datasetSpecs={kv=DatasetSpecification{name='microservice.kv', type='table', description='null', originalProperties=null, properties={}, datasetSpecs={}}}}, type meta: DatasetTypeMeta{name='co.cask.cdap.api.dataset.lib.KeyValueTable', modules=[DatasetModuleMeta{name='orderedTable-memory', className='co.cask.cdap.data2.dataset2.module.lib.inmemory.InMemoryTableModule', jarLocation=null, jarLocationPath=null, types=[table, co.cask.cdap.api.dataset.table.Table], usesModules=[], usedByModules=[core, objectMappedTable, cube, usage, lineage, app-fabric]}, DatasetModuleMeta{name='core', className='co.cask.cdap.data2.dataset2.lib.table.CoreDatasetsModule', jarLocation=null, jarLocationPath=null, types=[keyValueTable, co.cask.cdap.api.dataset.lib.KeyValueTable, objectStore, co.cask.cdap.api.dataset.lib.ObjectStore, indexedObjectStore, co.cask.cdap.api.dataset.lib.IndexedObjectStore, indexedTable, co.cask.cdap.api.dataset.lib.IndexedTable, timeseriesTable, co.cask.cdap.api.dataset.lib.TimeseriesTable, counterTimeseriesTable, co.cask.cdap.api.dataset.lib.CounterTimeseriesTable, memoryTable], usesModules=[orderedTable-memory], usedByModules=[timePartitionedFileSet, partitionedFileSet, metadata, app-fabric]}]}
15-Aug-2017 23:57:10 2017-08-15 23:57:10,386 - WARN  [dataset.service-executor-9:c.c.c.d.d.d.t.DatasetTypeManager@411] - Deleting all modules from namespace namespace:default
15-Aug-2017 23:57:10 2017-08-15 23:57:10,520 - INFO  [main:c.c.c.i.a.n.AbstractNamespaceResourceDeleter@113] - All data for namespace 'namespace:default' deleted.
15-Aug-2017 23:57:10 2017-08-15 23:57:10,520 - INFO  [main:c.c.c.i.a.n.DefaultNamespaceAdmin@331] - Keeping the 'namespace:default' namespace after removing all data.
15-Aug-2017 23:57:10 2017-08-15 23:57:10,536 - INFO  [NotificationSubscriberService STOPPING:c.c.c.s.NotificationSubscriberService@122] - Stopping NotificationSubscriberService.
15-Aug-2017 23:57:15 2017-08-15 23:57:15,537 - INFO  [NotificationSubscriberService STOPPING:c.c.c.s.NotificationSubscriberService@132] - Stopped NotificationSubscriberService.
15-Aug-2017 23:57:15 2017-08-15 23:57:15,539 - INFO  [ConstraintCheckerService STOPPING:c.c.c.s.ConstraintCheckerService@120] - Stopping ConstraintCheckerService.
15-Aug-2017 23:57:20 2017-08-15 23:57:20,540 - INFO  [ConstraintCheckerService STOPPING:c.c.c.s.ConstraintCheckerService@130] - Stopped ConstraintCheckerService.
15-Aug-2017 23:57:20 2017-08-15 23:57:20,542 - INFO  [LocalSchedulerService STOPPING:c.c.c.i.a.r.s.AbstractSchedulerService@89] - Stopped stream size scheduler
15-Aug-2017 23:57:20 2017-08-15 23:57:20,547 - INFO  [LocalSchedulerService STOPPING:c.c.c.i.a.r.s.AbstractSchedulerService@97] - Stopped time scheduler
15-Aug-2017 23:57:20 2017-08-15 23:57:20,549 - INFO  [MetricsQueryService STOPPING:c.c.c.m.q.MetricsQueryService@104] - Stopping Metrics Service...
15-Aug-2017 23:57:21 2017-08-15 23:57:21,515 - INFO  [DatasetService:c.c.c.d.d.d.s.DatasetService@198] - Stopping DatasetService...
15-Aug-2017 23:57:24 2017-08-15 23:57:24,519 - INFO  [NettyHttpService STOPPING:c.c.c.d.d.d.s.DatasetTypeHandler@65] - Stopping DatasetTypeHandler
15-Aug-2017 23:57:24 2017-08-15 23:57:24,523 - INFO  [DatasetOpExecutorService STOPPING:c.c.c.d.d.d.s.e.DatasetOpExecutorService@91] - Stopping DatasetOpExecutorService...
15-Aug-2017 23:57:24 2017-08-15 23:57:24,534 - INFO  [CoreMessagingService STOPPING:c.c.c.m.s.CoreMessagingService@263] - Core Messaging Service stopped
15-Aug-2017 23:57:24 Tests run: 3, Failures: 0, Errors: 0, Skipped: 1, Time elapsed: 63.061 sec
15-Aug-2017 23:57:24 testTMSGenConsumer(co.cask.microservice.MicroserviceAppTest)  Time elapsed: 17.541 sec
15-Aug-2017 23:57:24 testWebSocketChannel(co.cask.microservice.MicroserviceAppTest)  Time elapsed: 12.232 sec
15-Aug-2017 23:57:24 testSQSGenConsumer(co.cask.microservice.MicroserviceAppTest) skipped
15-Aug-2017 23:57:24 2017-08-15 23:57:24,550 - WARN  [Thread-14:o.e.j.u.c.AbstractLifeCycle@212] - FAILED org.eclipse.jetty.io.SelectorManager$ManagedSelector@250b47ee keys=1 selected=0: java.lang.NoClassDefFoundError: org/eclipse/jetty/io/SelectorManager$ManagedSelector$Stop
15-Aug-2017 23:57:24 java.lang.NoClassDefFoundError: org/eclipse/jetty/io/SelectorManager$ManagedSelector$Stop
15-Aug-2017 23:57:24         at org.eclipse.jetty.io.SelectorManager$ManagedSelector.doStop(SelectorManager.java:434) ~[jetty-io-9.2.17.v20160517.jar:9.2.17.v20160517]
15-Aug-2017 23:57:24         at org.eclipse.jetty.util.component.AbstractLifeCycle.stop(AbstractLifeCycle.java:89) [jetty-util-9.2.17.v20160517.jar:9.2.17.v20160517]
15-Aug-2017 23:57:24         at org.eclipse.jetty.io.SelectorManager.doStop(SelectorManager.java:277) [jetty-io-9.2.17.v20160517.jar:9.2.17.v20160517]
15-Aug-2017 23:57:24         at org.eclipse.jetty.util.component.AbstractLifeCycle.stop(AbstractLifeCycle.java:89) [jetty-util-9.2.17.v20160517.jar:9.2.17.v20160517]
15-Aug-2017 23:57:24         at org.eclipse.jetty.util.component.ContainerLifeCycle.stop(ContainerLifeCycle.java:143) [jetty-util-9.2.17.v20160517.jar:9.2.17.v20160517]
15-Aug-2017 23:57:24         at org.eclipse.jetty.util.component.ContainerLifeCycle.doStop(ContainerLifeCycle.java:162) [jetty-util-9.2.17.v20160517.jar:9.2.17.v20160517]
15-Aug-2017 23:57:24         at org.eclipse.jetty.websocket.client.io.ConnectionManager.doStop(ConnectionManager.java:217) [websocket-client-9.2.17.v20160517.jar:9.2.17.v20160517]
15-Aug-2017 23:57:24         at org.eclipse.jetty.util.component.AbstractLifeCycle.stop(AbstractLifeCycle.java:89) [jetty-util-9.2.17.v20160517.jar:9.2.17.v20160517]
15-Aug-2017 23:57:24         at org.eclipse.jetty.util.component.ContainerLifeCycle.stop(ContainerLifeCycle.java:143) [jetty-util-9.2.17.v20160517.jar:9.2.17.v20160517]
15-Aug-2017 23:57:24         at org.eclipse.jetty.util.component.ContainerLifeCycle.doStop(ContainerLifeCycle.java:162) [jetty-util-9.2.17.v20160517.jar:9.2.17.v20160517]
15-Aug-2017 23:57:24         at org.eclipse.jetty.websocket.client.WebSocketClient.doStop(WebSocketClient.java:279) [websocket-client-9.2.17.v20160517.jar:9.2.17.v20160517]
15-Aug-2017 23:57:24         at org.eclipse.jetty.util.component.AbstractLifeCycle.stop(AbstractLifeCycle.java:89) [jetty-util-9.2.17.v20160517.jar:9.2.17.v20160517]
15-Aug-2017 23:57:24         at org.eclipse.jetty.util.thread.ShutdownThread.run(ShutdownThread.java:138) [jetty-util-9.2.17.v20160517.jar:9.2.17.v20160517]
15-Aug-2017 23:57:24 Caused by: java.lang.ClassNotFoundException: org.eclipse.jetty.io.SelectorManager$ManagedSelector$Stop
15-Aug-2017 23:57:24         at java.net.URLClassLoader$1.run(URLClassLoader.java:366) ~[na:1.7.0_75]
15-Aug-2017 23:57:24         at java.net.URLClassLoader$1.run(URLClassLoader.java:355) ~[na:1.7.0_75]
15-Aug-2017 23:57:24         at java.security.AccessController.doPrivileged(Native Method) ~[na:1.7.0_75]
15-Aug-2017 23:57:24         at java.net.URLClassLoader.findClass(URLClassLoader.java:354) ~[na:1.7.0_75]
15-Aug-2017 23:57:24         at co.cask.cdap.common.lang.InterceptableClassLoader.findClass(InterceptableClassLoader.java:46) ~[na:na]
15-Aug-2017 23:57:24         at java.lang.ClassLoader.loadClass(ClassLoader.java:425) ~[na:1.7.0_75]
15-Aug-2017 23:57:24         at java.lang.ClassLoader.loadClass(ClassLoader.java:358) ~[na:1.7.0_75]
15-Aug-2017 23:57:24         ... 13 common frames omitted
15-Aug-2017 23:57:24 2017-08-15 23:57:24,552 - WARN  [Thread-14:o.e.j.u.c.AbstractLifeCycle@212] - FAILED org.eclipse.jetty.websocket.client.io.WebSocketClientSelectorManager@f72ebc1: java.lang.NoClassDefFoundError: org/eclipse/jetty/io/SelectorManager$ManagedSelector$Stop
15-Aug-2017 23:57:24 java.lang.NoClassDefFoundError: org/eclipse/jetty/io/SelectorManager$ManagedSelector$Stop
15-Aug-2017 23:57:24         at org.eclipse.jetty.io.SelectorManager$ManagedSelector.doStop(SelectorManager.java:434) ~[jetty-io-9.2.17.v20160517.jar:9.2.17.v20160517]
15-Aug-2017 23:57:24         at org.eclipse.jetty.util.component.AbstractLifeCycle.stop(AbstractLifeCycle.java:89) [jetty-util-9.2.17.v20160517.jar:9.2.17.v20160517]
15-Aug-2017 23:57:24 Exception in thread "Thread-14" java.lang.NoClassDefFoundError: org/eclipse/jetty/io/SelectorManager$ManagedSelector$Stop
15-Aug-2017 23:57:24         at org.eclipse.jetty.io.SelectorManager.doStop(SelectorManager.java:277) ~[jetty-io-9.2.17.v20160517.jar:9.2.17.v20160517]
15-Aug-2017 23:57:24         at org.eclipse.jetty.util.component.AbstractLifeCycle.stop(AbstractLifeCycle.java:89) [jetty-util-9.2.17.v20160517.jar:9.2.17.v20160517]
15-Aug-2017 23:57:24         at org.eclipse.jetty.util.component.ContainerLifeCycle.stop(ContainerLifeCycle.java:143) [jetty-util-9.2.17.v20160517.jar:9.2.17.v20160517]
15-Aug-2017 23:57:24         at org.eclipse.jetty.util.component.ContainerLifeCycle.doStop(ContainerLifeCycle.java:162) [jetty-util-9.2.17.v20160517.jar:9.2.17.v20160517]
15-Aug-2017 23:57:24         at org.eclipse.jetty.websocket.client.io.ConnectionManager.doStop(ConnectionManager.java:217) [websocket-client-9.2.17.v20160517.jar:9.2.17.v20160517]
15-Aug-2017 23:57:24         at org.eclipse.jetty.util.component.AbstractLifeCycle.stop(AbstractLifeCycle.java:89) [jetty-util-9.2.17.v20160517.jar:9.2.17.v20160517]
15-Aug-2017 23:57:24         at org.eclipse.jetty.util.component.ContainerLifeCycle.stop(ContainerLifeCycle.java:143) [jetty-util-9.2.17.v20160517.jar:9.2.17.v20160517]
15-Aug-2017 23:57:24         at org.eclipse.jetty.util.component.ContainerLifeCycle.doStop(ContainerLifeCycle.java:162) [jetty-util-9.2.17.v20160517.jar:9.2.17.v20160517]
15-Aug-2017 23:57:24         at org.eclipse.jetty.websocket.client.WebSocketClient.doStop(WebSocketClient.java:279) [websocket-client-9.2.17.v20160517.jar:9.2.17.v20160517]
15-Aug-2017 23:57:24         at org.eclipse.jetty.util.component.AbstractLifeCycle.stop(AbstractLifeCycle.java:89) [jetty-util-9.2.17.v20160517.jar:9.2.17.v20160517]
15-Aug-2017 23:57:24         at org.eclipse.jetty.util.thread.ShutdownThread.run(ShutdownThread.java:138) [jetty-util-9.2.17.v20160517.jar:9.2.17.v20160517]
15-Aug-2017 23:57:24 Caused by: java.lang.ClassNotFoundException: org.eclipse.jetty.io.SelectorManager$ManagedSelector$Stop
15-Aug-2017 23:57:24         at java.net.URLClassLoader$1.run(URLClassLoader.java:366) ~[na:1.7.0_75]
15-Aug-2017 23:57:24         at org.eclipse.jetty.io.SelectorManager$ManagedSelector.doStop(SelectorManager.java:434)
15-Aug-2017 23:57:24         at java.net.URLClassLoader$1.run(URLClassLoader.java:355) ~[na:1.7.0_75]
15-Aug-2017 23:57:24         at java.security.AccessController.doPrivileged(Native Method) ~[na:1.7.0_75]
15-Aug-2017 23:57:24         at java.net.URLClassLoader.findClass(URLClassLoader.java:354) ~[na:1.7.0_75]
15-Aug-2017 23:57:24         at co.cask.cdap.common.lang.InterceptableClassLoader.findClass(InterceptableClassLoader.java:46) ~[na:na]
15-Aug-2017 23:57:24         at java.lang.ClassLoader.loadClass(ClassLoader.java:425) ~[na:1.7.0_75]
15-Aug-2017 23:57:24         at java.lang.ClassLoader.loadClass(ClassLoader.java:358) ~[na:1.7.0_75]
15-Aug-2017 23:57:24         ... 13 common frames omitted
15-Aug-2017 23:57:24 2017-08-15 23:57:24,552 - WARN  [Thread-14:o.e.j.u.c.AbstractLifeCycle@212] - FAILED org.eclipse.jetty.websocket.client.io.ConnectionManager@42037ed7: java.lang.NoClassDefFoundError: org/eclipse/jetty/io/SelectorManager$ManagedSelector$Stop
15-Aug-2017 23:57:24 java.lang.NoClassDefFoundError: org/eclipse/jetty/io/SelectorManager$ManagedSelector$Stop
15-Aug-2017 23:57:24         at org.eclipse.jetty.io.SelectorManager$ManagedSelector.doStop(SelectorManager.java:434) ~[jetty-io-9.2.17.v20160517.jar:9.2.17.v20160517]
15-Aug-2017 23:57:24         at org.eclipse.jetty.util.component.AbstractLifeCycle.stop(AbstractLifeCycle.java:89) [jetty-util-9.2.17.v20160517.jar:9.2.17.v20160517]
15-Aug-2017 23:57:24         at org.eclipse.jetty.io.SelectorManager.doStop(SelectorManager.java:277) ~[jetty-io-9.2.17.v20160517.jar:9.2.17.v20160517]
15-Aug-2017 23:57:24         at org.eclipse.jetty.util.component.AbstractLifeCycle.stop(AbstractLifeCycle.java:89)
15-Aug-2017 23:57:24         at org.eclipse.jetty.util.component.AbstractLifeCycle.stop(AbstractLifeCycle.java:89) [jetty-util-9.2.17.v20160517.jar:9.2.17.v20160517]
15-Aug-2017 23:57:24         at org.eclipse.jetty.util.component.ContainerLifeCycle.stop(ContainerLifeCycle.java:143) [jetty-util-9.2.17.v20160517.jar:9.2.17.v20160517]
15-Aug-2017 23:57:24         at org.eclipse.jetty.util.component.ContainerLifeCycle.doStop(ContainerLifeCycle.java:162) [jetty-util-9.2.17.v20160517.jar:9.2.17.v20160517]
15-Aug-2017 23:57:24         at org.eclipse.jetty.websocket.client.io.ConnectionManager.doStop(ConnectionManager.java:217) ~[websocket-client-9.2.17.v20160517.jar:9.2.17.v20160517]
15-Aug-2017 23:57:24         at org.eclipse.jetty.util.component.AbstractLifeCycle.stop(AbstractLifeCycle.java:89) [jetty-util-9.2.17.v20160517.jar:9.2.17.v20160517]
15-Aug-2017 23:57:24         at org.eclipse.jetty.util.component.ContainerLifeCycle.stop(ContainerLifeCycle.java:143) [jetty-util-9.2.17.v20160517.jar:9.2.17.v20160517]
15-Aug-2017 23:57:24         at org.eclipse.jetty.util.component.ContainerLifeCycle.doStop(ContainerLifeCycle.java:162) [jetty-util-9.2.17.v20160517.jar:9.2.17.v20160517]
15-Aug-2017 23:57:24         at org.eclipse.jetty.websocket.client.WebSocketClient.doStop(WebSocketClient.java:279) [websocket-client-9.2.17.v20160517.jar:9.2.17.v20160517]
15-Aug-2017 23:57:24         at org.eclipse.jetty.util.component.AbstractLifeCycle.stop(AbstractLifeCycle.java:89) [jetty-util-9.2.17.v20160517.jar:9.2.17.v20160517]
15-Aug-2017 23:57:24         at org.eclipse.jetty.util.thread.ShutdownThread.run(ShutdownThread.java:138) [jetty-util-9.2.17.v20160517.jar:9.2.17.v20160517]
15-Aug-2017 23:57:24 Caused by: java.lang.ClassNotFoundException: org.eclipse.jetty.io.SelectorManager$ManagedSelector$Stop
15-Aug-2017 23:57:24         at java.net.URLClassLoader$1.run(URLClassLoader.java:366) ~[na:1.7.0_75]
15-Aug-2017 23:57:24         at java.net.URLClassLoader$1.run(URLClassLoader.java:355) ~[na:1.7.0_75]
15-Aug-2017 23:57:24         at org.eclipse.jetty.io.SelectorManager.doStop(SelectorManager.java:277)
15-Aug-2017 23:57:24         at java.security.AccessController.doPrivileged(Native Method) ~[na:1.7.0_75]
15-Aug-2017 23:57:24         at java.net.URLClassLoader.findClass(URLClassLoader.java:354) ~[na:1.7.0_75]
15-Aug-2017 23:57:24         at co.cask.cdap.common.lang.InterceptableClassLoader.findClass(InterceptableClassLoader.java:46) ~[na:na]
15-Aug-2017 23:57:24         at java.lang.ClassLoader.loadClass(ClassLoader.java:425) ~[na:1.7.0_75]
15-Aug-2017 23:57:24         at java.lang.ClassLoader.loadClass(ClassLoader.java:358) ~[na:1.7.0_75]
15-Aug-2017 23:57:24         ... 13 common frames omitted
15-Aug-2017 23:57:24 2017-08-15 23:57:24,553 - WARN  [Thread-14:o.e.j.u.c.AbstractLifeCycle@212] - FAILED org.eclipse.jetty.websocket.client.WebSocketClient@1263d9eb: java.lang.NoClassDefFoundError: org/eclipse/jetty/io/SelectorManager$ManagedSelector$Stop
15-Aug-2017 23:57:24 java.lang.NoClassDefFoundError: org/eclipse/jetty/io/SelectorManager$ManagedSelector$Stop
15-Aug-2017 23:57:24         at org.eclipse.jetty.io.SelectorManager$ManagedSelector.doStop(SelectorManager.java:434) ~[jetty-io-9.2.17.v20160517.jar:9.2.17.v20160517]
15-Aug-2017 23:57:24         at org.eclipse.jetty.util.component.AbstractLifeCycle.stop(AbstractLifeCycle.java:89) ~[jetty-util-9.2.17.v20160517.jar:9.2.17.v20160517]
15-Aug-2017 23:57:24         at org.eclipse.jetty.io.SelectorManager.doStop(SelectorManager.java:277) ~[jetty-io-9.2.17.v20160517.jar:9.2.17.v20160517]
15-Aug-2017 23:57:24         at org.eclipse.jetty.util.component.AbstractLifeCycle.stop(AbstractLifeCycle.java:89) ~[jetty-util-9.2.17.v20160517.jar:9.2.17.v20160517]
15-Aug-2017 23:57:24         at org.eclipse.jetty.util.component.ContainerLifeCycle.stop(ContainerLifeCycle.java:143) ~[jetty-util-9.2.17.v20160517.jar:9.2.17.v20160517]
15-Aug-2017 23:57:24         at org.eclipse.jetty.util.component.ContainerLifeCycle.doStop(ContainerLifeCycle.java:162) ~[jetty-util-9.2.17.v20160517.jar:9.2.17.v20160517]
15-Aug-2017 23:57:24         at org.eclipse.jetty.websocket.client.io.ConnectionManager.doStop(ConnectionManager.java:217) ~[websocket-client-9.2.17.v20160517.jar:9.2.17.v20160517]
15-Aug-2017 23:57:24         at org.eclipse.jetty.util.component.AbstractLifeCycle.stop(AbstractLifeCycle.java:89)
15-Aug-2017 23:57:24         at org.eclipse.jetty.util.component.AbstractLifeCycle.stop(AbstractLifeCycle.java:89) ~[jetty-util-9.2.17.v20160517.jar:9.2.17.v20160517]
15-Aug-2017 23:57:24         at org.eclipse.jetty.util.component.ContainerLifeCycle.stop(ContainerLifeCycle.java:143) ~[jetty-util-9.2.17.v20160517.jar:9.2.17.v20160517]
15-Aug-2017 23:57:24         at org.eclipse.jetty.util.component.ContainerLifeCycle.doStop(ContainerLifeCycle.java:162) ~[jetty-util-9.2.17.v20160517.jar:9.2.17.v20160517]
15-Aug-2017 23:57:24         at org.eclipse.jetty.websocket.client.WebSocketClient.doStop(WebSocketClient.java:279) ~[websocket-client-9.2.17.v20160517.jar:9.2.17.v20160517]
15-Aug-2017 23:57:24         at org.eclipse.jetty.util.component.AbstractLifeCycle.stop(AbstractLifeCycle.java:89) ~[jetty-util-9.2.17.v20160517.jar:9.2.17.v20160517]
15-Aug-2017 23:57:24         at org.eclipse.jetty.util.thread.ShutdownThread.run(ShutdownThread.java:138) [jetty-util-9.2.17.v20160517.jar:9.2.17.v20160517]
15-Aug-2017 23:57:24 Caused by: java.lang.ClassNotFoundException: org.eclipse.jetty.io.SelectorManager$ManagedSelector$Stop
15-Aug-2017 23:57:24         at java.net.URLClassLoader$1.run(URLClassLoader.java:366) ~[na:1.7.0_75]
15-Aug-2017 23:57:24         at java.net.URLClassLoader$1.run(URLClassLoader.java:355) ~[na:1.7.0_75]
15-Aug-2017 23:57:24         at java.security.AccessController.doPrivileged(Native Method) ~[na:1.7.0_75]
15-Aug-2017 23:57:24         at java.net.URLClassLoader.findClass(URLClassLoader.java:354) ~[na:1.7.0_75]
15-Aug-2017 23:57:24         at co.cask.cdap.common.lang.InterceptableClassLoader.findClass(InterceptableClassLoader.java:46) ~[na:na]
15-Aug-2017 23:57:24         at org.eclipse.jetty.util.component.ContainerLifeCycle.stop(ContainerLifeCycle.java:143)
15-Aug-2017 23:57:24         at java.lang.ClassLoader.loadClass(ClassLoader.java:425) ~[na:1.7.0_75]
15-Aug-2017 23:57:24         at java.lang.ClassLoader.loadClass(ClassLoader.java:358) ~[na:1.7.0_75]
15-Aug-2017 23:57:24         ... 13 common frames omitted
15-Aug-2017 23:57:24         at org.eclipse.jetty.util.component.ContainerLifeCycle.doStop(ContainerLifeCycle.java:162)
15-Aug-2017 23:57:24         at org.eclipse.jetty.websocket.client.io.ConnectionManager.doStop(ConnectionManager.java:217)
15-Aug-2017 23:57:24         at org.eclipse.jetty.util.component.AbstractLifeCycle.stop(AbstractLifeCycle.java:89)
15-Aug-2017 23:57:24         at org.eclipse.jetty.util.component.ContainerLifeCycle.stop(ContainerLifeCycle.java:143)
15-Aug-2017 23:57:24         at org.eclipse.jetty.util.component.ContainerLifeCycle.doStop(ContainerLifeCycle.java:162)
15-Aug-2017 23:57:24         at org.eclipse.jetty.websocket.client.WebSocketClient.doStop(WebSocketClient.java:279)
15-Aug-2017 23:57:24         at org.eclipse.jetty.util.component.AbstractLifeCycle.stop(AbstractLifeCycle.java:89)
15-Aug-2017 23:57:24         at org.eclipse.jetty.util.thread.ShutdownThread.run(ShutdownThread.java:138)
15-Aug-2017 23:57:24 Caused by: java.lang.ClassNotFoundException: org.eclipse.jetty.io.SelectorManager$ManagedSelector$Stop
15-Aug-2017 23:57:24         at java.net.URLClassLoader$1.run(URLClassLoader.java:366)
15-Aug-2017 23:57:24         at java.net.URLClassLoader$1.run(URLClassLoader.java:355)
15-Aug-2017 23:57:24         at java.security.AccessController.doPrivileged(Native Method)
15-Aug-2017 23:57:24         at java.net.URLClassLoader.findClass(URLClassLoader.java:354)
15-Aug-2017 23:57:24         at co.cask.cdap.common.lang.InterceptableClassLoader.findClass(InterceptableClassLoader.java:46)
15-Aug-2017 23:57:24         at java.lang.ClassLoader.loadClass(ClassLoader.java:425)
15-Aug-2017 23:57:24         at java.lang.ClassLoader.loadClass(ClassLoader.java:358)
15-Aug-2017 23:57:24         ... 13 more
15-Aug-2017 23:57:24
15-Aug-2017 23:57:24 Results :
15-Aug-2017 23:57:24
15-Aug-2017 23:57:24 Tests run: 3, Failures: 0, Errors: 0, Skipped: 1
15-Aug-2017 23:57:24
15-Aug-2017 23:57:24 [INFO] ------------------------------------------------------------------------
15-Aug-2017 23:57:24 [INFO] Reactor Summary:
15-Aug-2017 23:57:24 [INFO]
15-Aug-2017 23:57:24 [INFO] Microservice Framework built over CDAP ............ SUCCESS [5.196s]
15-Aug-2017 23:57:24 [INFO] Microservice APIs ................................. SUCCESS [3.533s]
15-Aug-2017 23:57:24 [INFO] Microservice Application .......................... SUCCESS [1:32.694s]
15-Aug-2017 23:57:24 [INFO] ------------------------------------------------------------------------
15-Aug-2017 23:57:24 [INFO] BUILD SUCCESS
15-Aug-2017 23:57:24 [INFO] ------------------------------------------------------------------------
15-Aug-2017 23:57:24 [INFO] Total time: 1:44.992s
15-Aug-2017 23:57:24 [INFO] Finished at: Tue Aug 15 23:57:24 UTC 2017
15-Aug-2017 23:57:25 [INFO] Final Memory: 68M/340M
15-Aug-2017 23:57:25 [INFO] ------------------------------------------------------------------------
15-Aug-2017 23:57:25 Parsing test results under /var/bamboo/xml-data/build-dir/MS-BT4-JOB1...
15-Aug-2017 23:57:25 Finished task 'build and unit test' with result: Success
15-Aug-2017 23:57:25 Running post build plugin 'Docker Container Cleanup'
15-Aug-2017 23:57:25 Running post build plugin 'NCover Results Collector'
15-Aug-2017 23:57:25 Running post build plugin 'Clover Results Collector'
15-Aug-2017 23:57:25 Running post build plugin 'npm Cache Cleanup'
15-Aug-2017 23:57:25 Running post build plugin 'Artifact Copier'
15-Aug-2017 23:57:25 Finalising the build...
15-Aug-2017 23:57:25 Stopping timer.
15-Aug-2017 23:57:25 Build MS-BT4-JOB1-2 completed.
15-Aug-2017 23:57:25 Running on server: post build plugin 'NCover Results Collector'
15-Aug-2017 23:57:26 Running on server: post build plugin 'Build Hanging Detection Configuration'
15-Aug-2017 23:57:26 Running on server: post build plugin 'Clover Delta Calculator'
15-Aug-2017 23:57:26 Running on server: post build plugin 'Maven Dependencies Postprocessor'
15-Aug-2017 23:57:26 All post build plugins have finished
15-Aug-2017 23:57:26 Generating build results summary...
15-Aug-2017 23:57:26 Saving build results to disk...
15-Aug-2017 23:57:26 Logging substituted variables...
15-Aug-2017 23:57:26 Indexing build results...
15-Aug-2017 23:57:26 Finished building MS-BT4-JOB1-2.