Build #1

Build: #1 failed

Job: Upgrade Tests failed

Stages & jobs

  1. Spinup and Test

Job result summary

Completed
Duration
127 minutes
Agent
bamboo-agent14
Revision
df613f36352f3acf50b029372a3492e16e4d0175 df613f36352f3acf50b029372a3492e16e4d0175
Total tests
5

Tests

  • 5 tests in total
  • 5 tests failed
  • 5 failures are new
  • 50 minutes taken in total.
New test failures 5
Status Test Duration
Collapse Failed LineageUpgradeTest testUpgrade History
10 mins
java.lang.RuntimeException: java.util.concurrent.TimeoutException: CDAP Services are not available. Retried for 600 seconds.
	at com.google.common.base.Throwables.propagate(Throwables.java:160)
	at co.cask.cdap.test.IntegrationTestBase.checkSystemServices(IntegrationTestBase.java:206)
	at co.cask.cdap.upgrade.UpgradeTestBase.setUp(UpgradeTestBase.java:41)
	at sun.reflect.NativeMethodAccessorImpl.invoke0(Native Method)
	at sun.reflect.NativeMethodAccessorImpl.invoke(NativeMethodAccessorImpl.java:62)
	at sun.reflect.DelegatingMethodAccessorImpl.invoke(DelegatingMethodAccessorImpl.java:43)
	at java.lang.reflect.Method.invoke(Method.java:498)
(54 more lines...)
Collapse Failed MetadataUpgradeTest testUpgrade History
10 mins
java.lang.RuntimeException: java.util.concurrent.TimeoutException: CDAP Services are not available. Retried for 600 seconds.
	at com.google.common.base.Throwables.propagate(Throwables.java:160)
	at co.cask.cdap.test.IntegrationTestBase.checkSystemServices(IntegrationTestBase.java:206)
	at co.cask.cdap.upgrade.UpgradeTestBase.setUp(UpgradeTestBase.java:41)
	at sun.reflect.NativeMethodAccessorImpl.invoke0(Native Method)
	at sun.reflect.NativeMethodAccessorImpl.invoke(NativeMethodAccessorImpl.java:62)
	at sun.reflect.DelegatingMethodAccessorImpl.invoke(DelegatingMethodAccessorImpl.java:43)
	at java.lang.reflect.Method.invoke(Method.java:498)
(54 more lines...)
Collapse Failed QueueStateUpgradeTest testUpgrade History
10 mins
java.lang.RuntimeException: java.util.concurrent.TimeoutException: CDAP Services are not available. Retried for 600 seconds.
	at com.google.common.base.Throwables.propagate(Throwables.java:160)
	at co.cask.cdap.test.IntegrationTestBase.checkSystemServices(IntegrationTestBase.java:206)
	at co.cask.cdap.upgrade.UpgradeTestBase.setUp(UpgradeTestBase.java:41)
	at sun.reflect.NativeMethodAccessorImpl.invoke0(Native Method)
	at sun.reflect.NativeMethodAccessorImpl.invoke(NativeMethodAccessorImpl.java:62)
	at sun.reflect.DelegatingMethodAccessorImpl.invoke(DelegatingMethodAccessorImpl.java:43)
	at java.lang.reflect.Method.invoke(Method.java:498)
(54 more lines...)
Collapse Failed StreamEventUpgradeTest testUpgrade History
10 mins
java.lang.RuntimeException: java.util.concurrent.TimeoutException: CDAP Services are not available. Retried for 600 seconds.
	at com.google.common.base.Throwables.propagate(Throwables.java:160)
	at co.cask.cdap.test.IntegrationTestBase.checkSystemServices(IntegrationTestBase.java:206)
	at co.cask.cdap.upgrade.UpgradeTestBase.setUp(UpgradeTestBase.java:41)
	at sun.reflect.NativeMethodAccessorImpl.invoke0(Native Method)
	at sun.reflect.NativeMethodAccessorImpl.invoke(NativeMethodAccessorImpl.java:62)
	at sun.reflect.DelegatingMethodAccessorImpl.invoke(DelegatingMethodAccessorImpl.java:43)
	at java.lang.reflect.Method.invoke(Method.java:498)
(54 more lines...)
Collapse Failed StreamStateUpgradeTest testUpgrade History
10 mins
java.lang.RuntimeException: java.util.concurrent.TimeoutException: CDAP Services are not available. Retried for 600 seconds.
	at com.google.common.base.Throwables.propagate(Throwables.java:160)
	at co.cask.cdap.test.IntegrationTestBase.checkSystemServices(IntegrationTestBase.java:206)
	at co.cask.cdap.upgrade.UpgradeTestBase.setUp(UpgradeTestBase.java:41)
	at sun.reflect.NativeMethodAccessorImpl.invoke0(Native Method)
	at sun.reflect.NativeMethodAccessorImpl.invoke(NativeMethodAccessorImpl.java:62)
	at sun.reflect.DelegatingMethodAccessorImpl.invoke(DelegatingMethodAccessorImpl.java:43)
	at java.lang.reflect.Method.invoke(Method.java:498)
(54 more lines...)

Error summary

The build generated some errors. See the full build log for more details.

Java HotSpot(TM) 64-Bit Server VM warning: ignoring option MaxPermSize=128m; support was removed in 8.0
Warning:  org.apache.xerces.jaxp.SAXParserImpl$JAXPSAXParser: Property 'http://www.oracle.com/xml/jaxp/properties/entityExpansionLimit' is not recognized.
Compiler warnings:
  WARNING:  'org.apache.xerces.jaxp.SAXParserImpl: Property 'http://javax.xml.XMLConstants/property/accessExternalDTD' is not recognized.'
Warning:  org.apache.xerces.parsers.SAXParser: Feature 'http://javax.xml.XMLConstants/feature/secure-processing' is not recognized.
Warning:  org.apache.xerces.parsers.SAXParser: Property 'http://javax.xml.XMLConstants/property/accessExternalDTD' is not recognized.
Warning:  org.apache.xerces.parsers.SAXParser: Property 'http://www.oracle.com/xml/jaxp/properties/entityExpansionLimit' is not recognized.
Warning:  org.apache.xerces.jaxp.SAXParserImpl$JAXPSAXParser: Property 'http://www.oracle.com/xml/jaxp/properties/entityExpansionLimit' is not recognized.
Compiler warnings:
  WARNING:  'org.apache.xerces.jaxp.SAXParserImpl: Property 'http://javax.xml.XMLConstants/property/accessExternalDTD' is not recognized.'
Warning:  org.apache.xerces.parsers.SAXParser: Feature 'http://javax.xml.XMLConstants/feature/secure-processing' is not recognized.
Warning:  org.apache.xerces.parsers.SAXParser: Property 'http://javax.xml.XMLConstants/property/accessExternalDTD' is not recognized.
Warning:  org.apache.xerces.parsers.SAXParser: Property 'http://www.oracle.com/xml/jaxp/properties/entityExpansionLimit' is not recognized.
Warning:  org.apache.xerces.jaxp.SAXParserImpl$JAXPSAXParser: Property 'http://www.oracle.com/xml/jaxp/properties/entityExpansionLimit' is not recognized.
Compiler warnings:
  WARNING:  'org.apache.xerces.jaxp.SAXParserImpl: Property 'http://javax.xml.XMLConstants/property/accessExternalDTD' is not recognized.'
Warning:  org.apache.xerces.parsers.SAXParser: Feature 'http://javax.xml.XMLConstants/feature/secure-processing' is not recognized.
Warning:  org.apache.xerces.parsers.SAXParser: Property 'http://javax.xml.XMLConstants/property/accessExternalDTD' is not recognized.
Warning:  org.apache.xerces.parsers.SAXParser: Property 'http://www.oracle.com/xml/jaxp/properties/entityExpansionLimit' is not recognized.
SLF4J: Class path contains multiple SLF4J bindings.
SLF4J: Found binding in [jar:file:/home/bamboo/.m2/repository/co/cask/cdap/cdap-cli/4.3.2/cdap-cli-4.3.2.jar!/org/slf4j/impl/StaticLoggerBinder.class]
SLF4J: Found binding in [jar:file:/home/bamboo/.m2/repository/co/cask/cdap/cdap-explore-jdbc/4.3.2/cdap-explore-jdbc-4.3.2.jar!/org/slf4j/impl/StaticLoggerBinder.class]
SLF4J: Found binding in [jar:file:/home/bamboo/.m2/repository/ch/qos/logback/logback-classic/1.0.9/logback-classic-1.0.9.jar!/org/slf4j/impl/StaticLoggerBinder.class]
SLF4J: See http://www.slf4j.org/codes.html#multiple_bindings for an explanation.
SLF4J: Actual binding is of type [ch.qos.logback.classic.util.ContextSelectorStaticBinder]
SLF4J: Class path contains multiple SLF4J bindings.
SLF4J: Found binding in [jar:file:/home/bamboo/.m2/repository/co/cask/cdap/cdap-cli/4.3.2/cdap-cli-4.3.2.jar!/org/slf4j/impl/StaticLoggerBinder.class]
SLF4J: Found binding in [jar:file:/home/bamboo/.m2/repository/co/cask/cdap/cdap-explore-jdbc/4.3.2/cdap-explore-jdbc-4.3.2.jar!/org/slf4j/impl/StaticLoggerBinder.class]
SLF4J: Found binding in [jar:file:/home/bamboo/.m2/repository/ch/qos/logback/logback-classic/1.0.9/logback-classic-1.0.9.jar!/org/slf4j/impl/StaticLoggerBinder.class]
SLF4J: See http://www.slf4j.org/codes.html#multiple_bindings for an explanation.
SLF4J: Actual binding is of type [ch.qos.logback.classic.util.ContextSelectorStaticBinder]
SLF4J: Class path contains multiple SLF4J bindings.
SLF4J: Found binding in [jar:file:/home/bamboo/.m2/repository/co/cask/cdap/cdap-cli/4.3.2/cdap-cli-4.3.2.jar!/org/slf4j/impl/StaticLoggerBinder.class]
SLF4J: Found binding in [jar:file:/home/bamboo/.m2/repository/co/cask/cdap/cdap-explore-jdbc/4.3.2/cdap-explore-jdbc-4.3.2.jar!/org/slf4j/impl/StaticLoggerBinder.class]
SLF4J: Found binding in [jar:file:/home/bamboo/.m2/repository/ch/qos/logback/logback-classic/1.0.9/logback-classic-1.0.9.jar!/org/slf4j/impl/StaticLoggerBinder.class]
SLF4J: See http://www.slf4j.org/codes.html#multiple_bindings for an explanation.
SLF4J: Actual binding is of type [ch.qos.logback.classic.util.ContextSelectorStaticBinder]
SLF4J: Class path contains multiple SLF4J bindings.
SLF4J: Found binding in [jar:file:/home/bamboo/.m2/repository/co/cask/cdap/cdap-cli/4.3.2/cdap-cli-4.3.2.jar!/org/slf4j/impl/StaticLoggerBinder.class]
SLF4J: Found binding in [jar:file:/home/bamboo/.m2/repository/co/cask/cdap/cdap-explore-jdbc/4.3.2/cdap-explore-jdbc-4.3.2.jar!/org/slf4j/impl/StaticLoggerBinder.class]
SLF4J: Found binding in [jar:file:/home/bamboo/.m2/repository/ch/qos/logback/logback-classic/1.0.9/logback-classic-1.0.9.jar!/org/slf4j/impl/StaticLoggerBinder.class]
SLF4J: See http://www.slf4j.org/codes.html#multiple_bindings for an explanation.
SLF4J: Actual binding is of type [ch.qos.logback.classic.util.ContextSelectorStaticBinder]
SLF4J: Class path contains multiple SLF4J bindings.
SLF4J: Found binding in [jar:file:/home/bamboo/.m2/repository/co/cask/cdap/cdap-cli/4.3.2/cdap-cli-4.3.2.jar!/org/slf4j/impl/StaticLoggerBinder.class]
SLF4J: Found binding in [jar:file:/home/bamboo/.m2/repository/co/cask/cdap/cdap-explore-jdbc/4.3.2/cdap-explore-jdbc-4.3.2.jar!/org/slf4j/impl/StaticLoggerBinder.class]
SLF4J: Found binding in [jar:file:/home/bamboo/.m2/repository/ch/qos/logback/logback-classic/1.0.9/logback-classic-1.0.9.jar!/org/slf4j/impl/StaticLoggerBinder.class]
SLF4J: See http://www.slf4j.org/codes.html#multiple_bindings for an explanation.
SLF4J: Actual binding is of type [ch.qos.logback.classic.util.ContextSelectorStaticBinder]