Build #8

Build: #8 failed Manual run by Derek Wood

Build result summary

Details

Completed
Duration
85 minutes
Labels
None
Agent
bamboo-agent09
Revision
1ceebdff4044303d90fb6005f2c84634f95c8909 1ceebdff4044303d90fb6005f2c84634f95c8909
Total tests
5
Failing since
#1 (Manual run by Rohit Sinha)

Responsible

This build has been failing since #1
No one has taken responsibility

Code commits

Author Commit Message Commit date
Rohit Sinha <rosinha@google.com> Rohit Sinha <rosinha@google.com> 1ceebdff4044303d90fb6005f2c84634f95c8909 1ceebdff4044303d90fb6005f2c84634f95c8909 Merge pull request #970 from caskdata/feature/fix-lin-up
Fix LineageUpgradeTest asserstion
Rohit Sinha <rosinha@google.com> Rohit Sinha <rosinha@google.com> 908818ec09a1740a518b1661affdfbad71e499dc 908818ec09a1740a518b1661affdfbad71e499dc Fix LineageUpgradeTest asserstion
Rohit Sinha <rosinha@google.com> Rohit Sinha <rosinha@google.com> aaea9de8b38d383753c8229103693a6dabcb10e6 aaea9de8b38d383753c8229103693a6dabcb10e6 Merge pull request #968 from caskdata/feature/fix-assertion
Fix metadata result assertion for stream
Rohit Sinha <rosinha@google.com> Rohit Sinha <rosinha@google.com> 79823b89cd59ed5ee80ed4a0e5d71fdf6a48ad7e 79823b89cd59ed5ee80ed4a0e5d71fdf6a48ad7e Fix metadata result assertion for stream

Tests

New test failures 5
Status Test View job Duration
Collapse Failed LineageUpgradeTest testUpgrade History
Upgrade Tests 10 mins
java.lang.RuntimeException: java.util.concurrent.TimeoutException: CDAP Services are not available. Retried for 600 seconds.
	at com.google.common.base.Throwables.propagate(Throwables.java:240)
	at co.cask.cdap.test.IntegrationTestBase.checkSystemServices(IntegrationTestBase.java:204)
	at co.cask.cdap.upgrade.UpgradeTestBase.setUp(UpgradeTestBase.java:41)
	at sun.reflect.NativeMethodAccessorImpl.invoke0(Native Method)
	at sun.reflect.NativeMethodAccessorImpl.invoke(NativeMethodAccessorImpl.java:62)
	at sun.reflect.DelegatingMethodAccessorImpl.invoke(DelegatingMethodAccessorImpl.java:43)
	at java.lang.reflect.Method.invoke(Method.java:498)
(54 more lines...)
Collapse Failed MetadataUpgradeTest testUpgrade History
Upgrade Tests 10 mins
java.lang.RuntimeException: java.util.concurrent.TimeoutException: CDAP Services are not available. Retried for 600 seconds.
	at com.google.common.base.Throwables.propagate(Throwables.java:240)
	at co.cask.cdap.test.IntegrationTestBase.checkSystemServices(IntegrationTestBase.java:204)
	at co.cask.cdap.upgrade.UpgradeTestBase.setUp(UpgradeTestBase.java:41)
	at sun.reflect.NativeMethodAccessorImpl.invoke0(Native Method)
	at sun.reflect.NativeMethodAccessorImpl.invoke(NativeMethodAccessorImpl.java:62)
	at sun.reflect.DelegatingMethodAccessorImpl.invoke(DelegatingMethodAccessorImpl.java:43)
	at java.lang.reflect.Method.invoke(Method.java:498)
(54 more lines...)
Collapse Failed QueueStateUpgradeTest testUpgrade History
Upgrade Tests 10 mins
java.lang.RuntimeException: java.util.concurrent.TimeoutException: CDAP Services are not available. Retried for 600 seconds.
	at com.google.common.base.Throwables.propagate(Throwables.java:240)
	at co.cask.cdap.test.IntegrationTestBase.checkSystemServices(IntegrationTestBase.java:204)
	at co.cask.cdap.upgrade.UpgradeTestBase.setUp(UpgradeTestBase.java:41)
	at sun.reflect.NativeMethodAccessorImpl.invoke0(Native Method)
	at sun.reflect.NativeMethodAccessorImpl.invoke(NativeMethodAccessorImpl.java:62)
	at sun.reflect.DelegatingMethodAccessorImpl.invoke(DelegatingMethodAccessorImpl.java:43)
	at java.lang.reflect.Method.invoke(Method.java:498)
(54 more lines...)
Collapse Failed StreamEventUpgradeTest testUpgrade History
Upgrade Tests 10 mins
java.lang.RuntimeException: java.util.concurrent.TimeoutException: CDAP Services are not available. Retried for 600 seconds.
	at com.google.common.base.Throwables.propagate(Throwables.java:240)
	at co.cask.cdap.test.IntegrationTestBase.checkSystemServices(IntegrationTestBase.java:204)
	at co.cask.cdap.upgrade.UpgradeTestBase.setUp(UpgradeTestBase.java:41)
	at sun.reflect.NativeMethodAccessorImpl.invoke0(Native Method)
	at sun.reflect.NativeMethodAccessorImpl.invoke(NativeMethodAccessorImpl.java:62)
	at sun.reflect.DelegatingMethodAccessorImpl.invoke(DelegatingMethodAccessorImpl.java:43)
	at java.lang.reflect.Method.invoke(Method.java:498)
(54 more lines...)
Collapse Failed StreamStateUpgradeTest testUpgrade History
Upgrade Tests 10 mins
java.lang.RuntimeException: java.util.concurrent.TimeoutException: CDAP Services are not available. Retried for 600 seconds.
	at com.google.common.base.Throwables.propagate(Throwables.java:240)
	at co.cask.cdap.test.IntegrationTestBase.checkSystemServices(IntegrationTestBase.java:204)
	at co.cask.cdap.upgrade.UpgradeTestBase.setUp(UpgradeTestBase.java:41)
	at sun.reflect.NativeMethodAccessorImpl.invoke0(Native Method)
	at sun.reflect.NativeMethodAccessorImpl.invoke(NativeMethodAccessorImpl.java:62)
	at sun.reflect.DelegatingMethodAccessorImpl.invoke(DelegatingMethodAccessorImpl.java:43)
	at java.lang.reflect.Method.invoke(Method.java:498)
(54 more lines...)