Integration tests for CDAP Sandbox

Build: #11 failed Scheduled

Build result summary

Details

Completed
Duration
112 minutes
Labels
None
Agent
bamboo-agent03
Revision
33ca06a919bc191bb2b52d458ad4b6d7ef17737b 33ca06a919bc191bb2b52d458ad4b6d7ef17737b
Total tests
54
Failing since
#1 (Manual run by Ali Anwar)

Responsible

This build has been failing since #1
No one has taken responsibility

Tests

Existing test failures 3
Status Test Failing since View job Duration
java.util.concurrent.TimeoutException: Timeout occurred. Expected true but found false.
	at co.cask.cdap.common.utils.Tasks.waitFor(Tasks.java:70)
	at co.cask.cdap.common.utils.Tasks.waitFor(Tasks.java:91)
	at co.cask.cdap.common.utils.Tasks.waitFor(Tasks.java:130)
	at co.cask.cdap.test.AbstractProgramManager.waitForRuns(AbstractProgramManager.java:81)
	at co.cask.cdap.test.AbstractProgramManager.waitForRun(AbstractProgramManager.java:75)
	at co.cask.cdap.app.etl.batch.BatchJoinerTest.testJoiner(BatchJoinerTest.java:225)
	at co.cask.cdap.app.etl.batch.BatchJoinerTest.testJoinerMR(BatchJoinerTest.java:88)
java.util.concurrent.TimeoutException: Timeout occurred. Expected true but found false.
	at co.cask.cdap.common.utils.Tasks.waitFor(Tasks.java:70)
	at co.cask.cdap.common.utils.Tasks.waitFor(Tasks.java:91)
	at co.cask.cdap.common.utils.Tasks.waitFor(Tasks.java:130)
	at co.cask.cdap.test.AbstractProgramManager.waitForRuns(AbstractProgramManager.java:81)
	at co.cask.cdap.test.AbstractProgramManager.waitForRun(AbstractProgramManager.java:75)
	at co.cask.cdap.apps.spark.sparkpagerank.SparkPageRankAppTest.test(SparkPageRankAppTest.java:141)
java.util.concurrent.TimeoutException: Timeout occurred. Expected true but found false.
	at co.cask.cdap.common.utils.Tasks.waitFor(Tasks.java:70)
	at co.cask.cdap.common.utils.Tasks.waitFor(Tasks.java:91)
	at co.cask.cdap.apps.workflow.WorkflowTest.testWorkflow(WorkflowTest.java:133)
	at co.cask.cdap.apps.workflow.WorkflowTest.testKMeans(WorkflowTest.java:108)