Integration tests for CDAP Sandbox

Build: #10 failed Manual run by Ali Anwar

Build result summary

Details

Completed
Duration
114 minutes
Labels
None
Agent
bamboo-agent13
Revision
33ca06a919bc191bb2b52d458ad4b6d7ef17737b 33ca06a919bc191bb2b52d458ad4b6d7ef17737b
Total tests
54
Failing since
#1 (Manual run by Ali Anwar)

Responsible

This build has been failing since #1
No one has taken responsibility

Tests

Existing test failures 3
Status Test Failing since View job Duration
java.util.concurrent.TimeoutException: Timeout occurred. Expected true but found false.
	at co.cask.cdap.common.utils.Tasks.waitFor(Tasks.java:70)
	at co.cask.cdap.common.utils.Tasks.waitFor(Tasks.java:91)
	at co.cask.cdap.common.utils.Tasks.waitFor(Tasks.java:130)
	at co.cask.cdap.test.AbstractProgramManager.waitForRuns(AbstractProgramManager.java:81)
	at co.cask.cdap.test.AbstractProgramManager.waitForRun(AbstractProgramManager.java:75)
	at co.cask.cdap.app.etl.batch.BatchJoinerTest.testJoiner(BatchJoinerTest.java:225)
	at co.cask.cdap.app.etl.batch.BatchJoinerTest.testJoinerMR(BatchJoinerTest.java:88)
java.util.concurrent.TimeoutException: Timeout occurred. Expected true but found false.
	at co.cask.cdap.common.utils.Tasks.waitFor(Tasks.java:70)
	at co.cask.cdap.common.utils.Tasks.waitFor(Tasks.java:91)
	at co.cask.cdap.common.utils.Tasks.waitFor(Tasks.java:130)
	at co.cask.cdap.test.AbstractProgramManager.waitForRuns(AbstractProgramManager.java:81)
	at co.cask.cdap.test.AbstractProgramManager.waitForRun(AbstractProgramManager.java:75)
	at co.cask.cdap.apps.spark.sparkpagerank.SparkPageRankAppTest.test(SparkPageRankAppTest.java:141)
java.util.concurrent.TimeoutException: Timeout occurred. Expected true but found false.
	at co.cask.cdap.common.utils.Tasks.waitFor(Tasks.java:70)
	at co.cask.cdap.common.utils.Tasks.waitFor(Tasks.java:91)
	at co.cask.cdap.apps.workflow.WorkflowTest.testWorkflow(WorkflowTest.java:133)
	at co.cask.cdap.apps.workflow.WorkflowTest.testKMeans(WorkflowTest.java:108)
Fixed tests 27
Status Test Failing since View job Duration
Successful KVTableWithProjectionTest testKVTableWithProjection History
Failing since build #9 (Manual run by Ali Anwar) Default Job 20 secs
Successful StreamTPFSWithProjectionTest testStreamTPFSWithProjection History
Failing since build #9 (Manual run by Ali Anwar) Default Job 41 secs
Successful BatchAggregatorTest test History
Failing since build #9 (Manual run by Ali Anwar) Default Job 49 secs
Successful BatchCubeSinkTest test History
Failing since build #9 (Manual run by Ali Anwar) Default Job 27 secs
Successful BatchJoinerTest testJoinerSpark History
Failing since build #9 (Manual run by Ali Anwar) Default Job 58 secs
Successful ETLMapReduceTest testTableToTableWithValidations History
Failing since build #9 (Manual run by Ali Anwar) Default Job 37 secs
Successful ETLMapReduceTest testKVToKV History
Failing since build #9 (Manual run by Ali Anwar) Default Job 35 secs
Successful ETLMapReduceTest testDAGSchemaChanges History
Failing since build #9 (Manual run by Ali Anwar) Default Job 28 secs
Successful ETLMapReduceTest testDAGInvalidSchema History
Failing since build #9 (Manual run by Ali Anwar) Default Job 4 secs
Successful ETLMapReduceTest testDAG History
Failing since build #9 (Manual run by Ali Anwar) Default Job 24 secs
Successful ExcelInputReaderTest testExcelReaderReprocessFalse History
Failing since build #9 (Manual run by Ali Anwar) Default Job 33 secs
Successful ExcelInputReaderTest testExcelReader History
Failing since build #9 (Manual run by Ali Anwar) Default Job 28 secs
Successful NormalizeTest testNormalizeWithEmptyAttributeValue History
Failing since build #9 (Manual run by Ali Anwar) Default Job 26 secs
Successful NormalizeTest testNormalize History
Failing since build #9 (Manual run by Ali Anwar) Default Job 27 secs
Successful RowDenormalizerTest test History
Failing since build #9 (Manual run by Ali Anwar) Default Job 28 secs
Successful TPFSSinkSourceTest testSpark History
Failing since build #9 (Manual run by Ali Anwar) Default Job 44 secs
Successful TPFSSinkSourceTest testMR History
Failing since build #9 (Manual run by Ali Anwar) Default Job 44 secs
Successful ValueMapperTest test History
Failing since build #9 (Manual run by Ali Anwar) Default Job 32 secs
Successful XMLReaderTest testInvalidNodePathWithMoveAction History
Failing since build #9 (Manual run by Ali Anwar) Default Job 36 secs
Successful XMLReaderTest testPatternWithDeleteAction History
Failing since build #9 (Manual run by Ali Anwar) Default Job 34 secs
Successful XMLReaderTest testPreProcessingRequired History
Failing since build #9 (Manual run by Ali Anwar) Default Job 35 secs
Successful XMLReaderTest testInvalidPatternWithDeleteAction History
Failing since build #9 (Manual run by Ali Anwar) Default Job 32 secs
Successful XMLReaderTest testPreProcessingNotRequired History
Failing since build #9 (Manual run by Ali Anwar) Default Job 35 secs
Successful DataStreamsTest testDataStreams History
Failing since build #9 (Manual run by Ali Anwar) Default Job 30 secs
Successful WranglerServiceTest test History
Failing since build #9 (Manual run by Ali Anwar) Default Job 17 secs
Successful WranglerTest testWranglerMR History
Failing since build #9 (Manual run by Ali Anwar) Default Job 53 secs
Successful WranglerTest testWranglerSpark History
Failing since build #9 (Manual run by Ali Anwar) Default Job 56 secs