Build #9

Build: #9 failed Scheduled

Build result summary

Details

Completed
Duration
280 minutes
Labels
None
Revisions
CDAP Integration Tests
1da0b96664f63000618060df74596dfe49f3c26b 1da0b96664f63000618060df74596dfe49f3c26b
Coopr-internal
adc2bdb8afbee27a73c1b672fafd1b80ad463389 adc2bdb8afbee27a73c1b672fafd1b80ad463389
Total tests
178
Failing since
#6 (Manual run by Sreevatsan Raman)

Responsible

Tests

New test failures 4
Status Test View job Duration
Collapse Failed KVTableWithProjectionTest testKVTableWithProjection History
Distro Tests - HDP 2.6 2 mins
co.cask.cdap.common.DatasetNotFoundException: 'dataset:default.kvtable1' was not found.
	at co.cask.cdap.client.DatasetClient.delete(DatasetClient.java:211)
	at co.cask.cdap.test.IntegrationTestBase.doClear(IntegrationTestBase.java:413)
	at co.cask.cdap.test.IntegrationTestBase.tearDown(IntegrationTestBase.java:126)
	at sun.reflect.GeneratedMethodAccessor4.invoke(Unknown Source)
	at sun.reflect.DelegatingMethodAccessorImpl.invoke(DelegatingMethodAccessorImpl.java:43)
	at java.lang.reflect.Method.invoke(Method.java:498)
	at org.junit.runners.model.FrameworkMethod$1.runReflectiveCall(FrameworkMethod.java:47)
(29 more lines...)
Collapse Failed DataStreamsTest testDataStreams History
Distro Tests - HDP 2.6 4 mins
java.util.concurrent.ExecutionException: java.lang.RuntimeException: java.net.SocketTimeoutException: Read timed out
	at java.net.SocketInputStream.socketRead0(Native Method)
	at java.net.SocketInputStream.socketRead(SocketInputStream.java:116)
	at java.net.SocketInputStream.read(SocketInputStream.java:170)
	at java.net.SocketInputStream.read(SocketInputStream.java:141)
	at java.io.BufferedInputStream.fill(BufferedInputStream.java:246)
	at java.io.BufferedInputStream.read1(BufferedInputStream.java:286)
	at java.io.BufferedInputStream.read(BufferedInputStream.java:345)
(17 more lines...)
Collapse Failed ApplicationTest test History
Distro Tests - HDP 2.6 1 min
java.lang.RuntimeException: java.io.IOException: Service 'dataset.executor' is not available. Please wait until it is up and running.
	at co.cask.cdap.client.util.RESTClient.upload(RESTClient.java:160)
	at co.cask.cdap.client.ApplicationClient.deployApp(ApplicationClient.java:449)
	at co.cask.cdap.client.ApplicationClient.deploy(ApplicationClient.java:377)
	at co.cask.cdap.client.ApplicationClient.deploy(ApplicationClient.java:353)
	at co.cask.cdap.test.IntegrationTestManager.deployApplication(IntegrationTestManager.java:183)
	at co.cask.cdap.test.AbstractTestManager.deployApplication(AbstractTestManager.java:43)
	at co.cask.cdap.test.IntegrationTestBase.deployApplication(IntegrationTestBase.java:374)
(2 more lines...)
Collapse Failed ExploreTest testSubqueryInWhereClause History
Distro Tests - HDP 2.6 15 secs
java.lang.RuntimeException: java.io.IOException: Service 'dataset.executor' is not available. Please wait until it is up and running.
	at co.cask.cdap.client.util.RESTClient.upload(RESTClient.java:160)
	at co.cask.cdap.client.ApplicationClient.deployApp(ApplicationClient.java:449)
	at co.cask.cdap.client.ApplicationClient.deploy(ApplicationClient.java:377)
	at co.cask.cdap.client.ApplicationClient.deploy(ApplicationClient.java:353)
	at co.cask.cdap.test.IntegrationTestManager.deployApplication(IntegrationTestManager.java:183)
	at co.cask.cdap.test.AbstractTestManager.deployApplication(AbstractTestManager.java:43)
	at co.cask.cdap.test.IntegrationTestBase.deployApplication(IntegrationTestBase.java:374)
(3 more lines...)
Existing test failures 14
Status Test Failing since View job Duration
java.io.IOException: Service 'dataset.executor' is not available. Please wait until it is up and running.
	at co.cask.cdap.client.util.RESTClient.upload(RESTClient.java:160)
	at co.cask.cdap.client.ApplicationClient.deploy(ApplicationClient.java:410)
	at co.cask.cdap.test.IntegrationTestManager.deployApplication(IntegrationTestManager.java:203)
	at co.cask.cdap.app.etl.StreamTPFSWithProjectionTest.testStreamTPFSWithProjection(StreamTPFSWithProjectionTest.java:83)
java.io.IOException: Service 'dataset.executor' is not available. Please wait until it is up and running.
	at co.cask.cdap.client.util.RESTClient.upload(RESTClient.java:160)
	at co.cask.cdap.client.ApplicationClient.deploy(ApplicationClient.java:410)
	at co.cask.cdap.test.IntegrationTestManager.deployApplication(IntegrationTestManager.java:203)
	at co.cask.cdap.test.IntegrationTestBase.deployApplication(IntegrationTestBase.java:383)
	at co.cask.cdap.app.etl.batch.BatchAggregatorTest.test(BatchAggregatorTest.java:149)
java.io.IOException: Service 'dataset.executor' is not available. Please wait until it is up and running.
	at co.cask.cdap.client.util.RESTClient.upload(RESTClient.java:160)
	at co.cask.cdap.client.ApplicationClient.deploy(ApplicationClient.java:410)
	at co.cask.cdap.test.IntegrationTestManager.deployApplication(IntegrationTestManager.java:203)
	at co.cask.cdap.test.IntegrationTestBase.deployApplication(IntegrationTestBase.java:383)
	at co.cask.cdap.app.etl.batch.BatchJoinerTest.testJoiner(BatchJoinerTest.java:215)
	at co.cask.cdap.app.etl.batch.BatchJoinerTest.testJoinerSpark(BatchJoinerTest.java:102)
co.cask.cdap.common.DatasetNotFoundException: 'dataset:default.allRewards' was not found.
	at co.cask.cdap.client.DatasetClient.delete(DatasetClient.java:211)
	at co.cask.cdap.test.IntegrationTestBase.doClear(IntegrationTestBase.java:413)
	at co.cask.cdap.test.IntegrationTestBase.tearDown(IntegrationTestBase.java:126)
	at sun.reflect.NativeMethodAccessorImpl.invoke0(Native Method)
	at sun.reflect.NativeMethodAccessorImpl.invoke(NativeMethodAccessorImpl.java:62)
	at sun.reflect.DelegatingMethodAccessorImpl.invoke(DelegatingMethodAccessorImpl.java:43)
	at java.lang.reflect.Method.invoke(Method.java:498)
(30 more lines...)
java.io.IOException: Failed to add instance tpfs1, details: Response code: 500, message: 'Internal Server Error', body: 'Base location for file set 'tpfs1.files' at hdfs://10.210.0.20:8020/cdap/namespaces/default/data/tpfs1 already exists'
	at co.cask.cdap.client.util.RESTClient.upload(RESTClient.java:160)
	at co.cask.cdap.client.ApplicationClient.deploy(ApplicationClient.java:410)
	at co.cask.cdap.test.IntegrationTestManager.deployApplication(IntegrationTestManager.java:203)
	at co.cask.cdap.app.etl.batch.TPFSSinkSourceTest.testStreamTPFSWithProjection(TPFSSinkSourceTest.java:103)
	at co.cask.cdap.app.etl.batch.TPFSSinkSourceTest.testMR(TPFSSinkSourceTest.java:71)
co.cask.cdap.common.DatasetNotFoundException: 'dataset:default.tpfs1' was not found.
	at co.cask.cdap.client.DatasetClient.delete(DatasetClient.java:211)
	at co.cask.cdap.test.IntegrationTestBase.doClear(IntegrationTestBase.java:413)
	at co.cask.cdap.test.IntegrationTestBase.tearDown(IntegrationTestBase.java:126)
	at sun.reflect.GeneratedMethodAccessor4.invoke(Unknown Source)
	at sun.reflect.DelegatingMethodAccessorImpl.invoke(DelegatingMethodAccessorImpl.java:43)
	at java.lang.reflect.Method.invoke(Method.java:498)
	at org.junit.runners.model.FrameworkMethod$1.runReflectiveCall(FrameworkMethod.java:47)
(29 more lines...)
java.io.IOException: Service 'dataset.executor' is not available. Please wait until it is up and running.
	at co.cask.cdap.client.util.RESTClient.upload(RESTClient.java:160)
	at co.cask.cdap.client.ApplicationClient.deploy(ApplicationClient.java:410)
	at co.cask.cdap.test.IntegrationTestManager.deployApplication(IntegrationTestManager.java:203)
	at co.cask.cdap.test.IntegrationTestBase.deployApplication(IntegrationTestBase.java:383)
	at co.cask.cdap.app.etl.batch.XMLReaderTest.deployApplication(XMLReaderTest.java:143)
	at co.cask.cdap.app.etl.batch.XMLReaderTest.testInvalidNodePathWithMoveAction(XMLReaderTest.java:287)
java.io.IOException: Service 'dataset.executor' is not available. Please wait until it is up and running.
	at co.cask.cdap.client.util.RESTClient.upload(RESTClient.java:160)
	at co.cask.cdap.client.ApplicationClient.deploy(ApplicationClient.java:410)
	at co.cask.cdap.test.IntegrationTestManager.deployApplication(IntegrationTestManager.java:203)
	at co.cask.cdap.test.IntegrationTestBase.deployApplication(IntegrationTestBase.java:383)
	at co.cask.cdap.app.etl.wrangler.WranglerTest.testWrangler(WranglerTest.java:186)
	at co.cask.cdap.app.etl.wrangler.WranglerTest.testWranglerMR(WranglerTest.java:85)
java.util.concurrent.TimeoutException: Timeout occurred. Expected true but found false.
	at co.cask.cdap.common.utils.Tasks.waitFor(Tasks.java:70)
	at co.cask.cdap.common.utils.Tasks.waitFor(Tasks.java:91)
	at co.cask.cdap.common.utils.Tasks.waitFor(Tasks.java:130)
	at co.cask.cdap.test.AbstractProgramManager.waitForRuns(AbstractProgramManager.java:81)
	at co.cask.cdap.app.fileset.PermissionTest.test(PermissionTest.java:160)
java.util.concurrent.TimeoutException: Timeout occurred. Expected true but found false.
	at co.cask.cdap.common.utils.Tasks.waitFor(Tasks.java:70)
	at co.cask.cdap.common.utils.Tasks.waitFor(Tasks.java:91)
	at co.cask.cdap.common.utils.Tasks.waitFor(Tasks.java:130)
	at co.cask.cdap.test.AbstractProgramManager.waitForRuns(AbstractProgramManager.java:81)
	at co.cask.cdap.test.AbstractProgramManager.waitForRun(AbstractProgramManager.java:75)
	at co.cask.cdap.app.mapreduce.readless.ReadlessIncrementTest.testReadlessIncrementsInMapReduce(ReadlessIncrementTest.java:67)
java.util.concurrent.TimeoutException: Timeout occurred. Expected true but found false.
	at co.cask.cdap.common.utils.Tasks.waitFor(Tasks.java:70)
	at co.cask.cdap.common.utils.Tasks.waitFor(Tasks.java:91)
	at co.cask.cdap.common.utils.Tasks.waitFor(Tasks.java:130)
	at co.cask.cdap.test.AbstractProgramManager.waitForRuns(AbstractProgramManager.java:81)
	at co.cask.cdap.test.AbstractProgramManager.waitForRun(AbstractProgramManager.java:75)
	at co.cask.cdap.apps.fileset.FileSetTest.test(FileSetTest.java:97)
java.lang.RuntimeException: java.io.IOException: Service 'dataset.executor' is not available. Please wait until it is up and running.
	at co.cask.cdap.client.util.RESTClient.upload(RESTClient.java:160)
	at co.cask.cdap.client.ApplicationClient.deployApp(ApplicationClient.java:449)
	at co.cask.cdap.client.ApplicationClient.deploy(ApplicationClient.java:377)
	at co.cask.cdap.client.ApplicationClient.deploy(ApplicationClient.java:353)
	at co.cask.cdap.test.IntegrationTestManager.deployApplication(IntegrationTestManager.java:183)
	at co.cask.cdap.test.AbstractTestManager.deployApplication(AbstractTestManager.java:43)
	at co.cask.cdap.test.IntegrationTestBase.deployApplication(IntegrationTestBase.java:374)
(2 more lines...)
java.lang.RuntimeException: java.io.IOException: Service 'dataset.executor' is not available. Please wait until it is up and running.
	at co.cask.cdap.client.util.RESTClient.upload(RESTClient.java:160)
	at co.cask.cdap.client.ApplicationClient.deployApp(ApplicationClient.java:449)
	at co.cask.cdap.client.ApplicationClient.deploy(ApplicationClient.java:377)
	at co.cask.cdap.client.ApplicationClient.deploy(ApplicationClient.java:353)
	at co.cask.cdap.test.IntegrationTestManager.deployApplication(IntegrationTestManager.java:183)
	at co.cask.cdap.test.AbstractTestManager.deployApplication(AbstractTestManager.java:43)
	at co.cask.cdap.test.IntegrationTestBase.deployApplication(IntegrationTestBase.java:374)
(2 more lines...)
java.lang.RuntimeException: java.io.IOException: Service 'dataset.executor' is not available. Please wait until it is up and running.
	at co.cask.cdap.client.util.RESTClient.upload(RESTClient.java:160)
	at co.cask.cdap.client.ApplicationClient.deployApp(ApplicationClient.java:449)
	at co.cask.cdap.client.ApplicationClient.deploy(ApplicationClient.java:377)
	at co.cask.cdap.client.ApplicationClient.deploy(ApplicationClient.java:353)
	at co.cask.cdap.test.IntegrationTestManager.deployApplication(IntegrationTestManager.java:183)
	at co.cask.cdap.apps.tracker.TrackerTestBase.enableTracker(TrackerTestBase.java:103)
	at co.cask.cdap.apps.tracker.TrackerTest.test(TrackerTest.java:47)
Fixed tests 9
Status Test Failing since View job Duration
Successful BatchJoinerTest testJoinerMR History
Failing since build #6 (Manual run by Sreevatsan Raman) Distro Tests - HDP 2.6 8 mins
Successful ExcelInputReaderTest testExcelReaderReprocessFalse History
Failing since build #7 (Scheduled) Distro Tests - HDP 2.6 4 mins
Successful XMLReaderTest testPreProcessingNotRequired History
Failing since build #7 (Scheduled) Distro Tests - HDP 2.6 4 mins
Successful WranglerServiceTest test History
Failing since build #8 (Scheduled) Distro Tests - HDP 2.6 1 min
Successful WranglerTest testWranglerSpark History
Failing since build #8 (Scheduled) Distro Tests - HDP 2.6 4 mins
Successful ExploreTest test History
Failing since build #8 (Scheduled) Distro Tests - HDP 2.6 < 1 sec
Successful PurchaseMetadataTest testLineage History
Failing since build #8 (Scheduled) Distro Tests - CDH 5.12 4 mins
Successful WorkflowTest testKMeans History
Failing since build #8 (Scheduled) Distro Tests - HDP 2.6 8 mins
Successful WorkflowTest testLDA History
Distro Tests - HDP 2.6 10 mins