Build #34

Build: #34 failed Manual run by Ali Anwar

Build result summary

Details

Completed
Duration
340 minutes
Labels
None
Revision
295239798751b16eeec6d12eb194d56f39663529 295239798751b16eeec6d12eb194d56f39663529
Total tests
169
Failing since
#26 (Scheduled with changes by 3 people)
Fixed in
#35 (Manual run by Ali Anwar)

Responsible

This build has been failing since #26
No one has taken responsibility

Tests

New test failures 4
Status Test View job Duration
Collapse Failed ReportGenerationAppTest testGenerateApp History
Distro Tests - CDH 5.12 2 mins
java.lang.AssertionError: expected:<[co.cask.cdap.report.proto.summary.NamespaceAggregate@5c13dde2]> but was:<[co.cask.cdap.report.proto.summary.NamespaceAggregate@5c13e0ab]>
	at org.junit.Assert.fail(Assert.java:88)
	at org.junit.Assert.failNotEquals(Assert.java:834)
	at org.junit.Assert.assertEquals(Assert.java:118)
	at org.junit.Assert.assertEquals(Assert.java:144)
	at co.cask.cdap.apps.report.ReportGenerationAppTest.testGenerateApp(ReportGenerationAppTest.java:174)
Collapse Failed ReportGenerationAppTest testGenerateApp History
Distro Tests - HDP 2.6 2 mins
java.lang.AssertionError: expected:<[co.cask.cdap.report.proto.summary.NamespaceAggregate@5c13dde2]> but was:<[co.cask.cdap.report.proto.summary.NamespaceAggregate@5c13e06d]>
	at org.junit.Assert.fail(Assert.java:88)
	at org.junit.Assert.failNotEquals(Assert.java:834)
	at org.junit.Assert.assertEquals(Assert.java:118)
	at org.junit.Assert.assertEquals(Assert.java:144)
	at co.cask.cdap.apps.report.ReportGenerationAppTest.testGenerateApp(ReportGenerationAppTest.java:174)
Collapse Failed ReportGenerationAppTest testGenerateApp History
Distro Tests - MapR 5.2 MEP 1.1 2 mins
java.util.concurrent.TimeoutException: Timeout occurred. Expected true but found false.
	at co.cask.cdap.common.utils.Tasks.waitFor(Tasks.java:70)
	at co.cask.cdap.common.utils.Tasks.waitFor(Tasks.java:91)
	at co.cask.cdap.test.AudiTestBase.checkMetricAtLeast(AudiTestBase.java:152)
	at co.cask.cdap.apps.report.ReportGenerationAppTest.testGenerateApp(ReportGenerationAppTest.java:121)
Collapse Failed SparkPageRankAppTest test History
Distro Tests - MapR 5.2 MEP 1.1 10 mins
java.util.concurrent.TimeoutException: Timeout occurred. Expected true but found false.
	at co.cask.cdap.common.utils.Tasks.waitFor(Tasks.java:70)
	at co.cask.cdap.common.utils.Tasks.waitFor(Tasks.java:91)
	at co.cask.cdap.common.utils.Tasks.waitFor(Tasks.java:130)
	at co.cask.cdap.test.AbstractProgramManager.waitForRuns(AbstractProgramManager.java:81)
	at co.cask.cdap.test.AbstractProgramManager.waitForRun(AbstractProgramManager.java:75)
	at co.cask.cdap.apps.spark.sparkpagerank.SparkPageRankAppTest.test(SparkPageRankAppTest.java:133)
Fixed tests 3
Status Test Failing since View job Duration
Successful PartitionedFileSetUpdateTest test History
Failing since build #33 (Scheduled) Distro Tests - CDH 5.12 2 mins
Successful PartitionedFileSetUpdateTest test History
Failing since build #33 (Scheduled) Distro Tests - HDP 2.6 3 mins
Successful WorkflowTest testLDA History
Failing since build #33 (Scheduled) Distro Tests - CDH 5.12 8 mins