Build #33

Build: #33 failed Scheduled

Build result summary

Details

Completed
Duration
472 minutes
Labels
None
Revisions
CDAP Integration Tests
0fda9fb554504d3df96b1a1c1e56cccaa3851b51 0fda9fb554504d3df96b1a1c1e56cccaa3851b51
Coopr-internal
1e6163ce92629a2f8229cd1c44ab8b1f98da833a 1e6163ce92629a2f8229cd1c44ab8b1f98da833a
Total tests
168
Failing since
#26 (Scheduled with changes by 3 people)
Fixed in
#35 (Manual run by Ali Anwar)

Responsible

This build has been failing since #26
No one has taken responsibility

Tests

New test failures 3
Status Test View job Duration
Collapse Failed PartitionedFileSetUpdateTest test History
Distro Tests - CDH 5.12 2 mins
java.util.concurrent.TimeoutException: Timeout occurred. Expected true but found false.
	at co.cask.cdap.common.utils.Tasks.waitFor(Tasks.java:70)
	at co.cask.cdap.common.utils.Tasks.waitFor(Tasks.java:91)
	at co.cask.cdap.common.utils.Tasks.waitFor(Tasks.java:130)
	at co.cask.cdap.test.AbstractProgramManager.waitForRuns(AbstractProgramManager.java:81)
	at co.cask.cdap.test.AbstractProgramManager.waitForRun(AbstractProgramManager.java:75)
	at co.cask.cdap.apps.fileset.PartitionedFileSetUpdateTest.test(PartitionedFileSetUpdateTest.java:120)
Collapse Failed PartitionedFileSetUpdateTest test History
Distro Tests - HDP 2.6 3 mins
java.util.concurrent.TimeoutException: Timeout occurred. Expected true but found false.
	at co.cask.cdap.common.utils.Tasks.waitFor(Tasks.java:70)
	at co.cask.cdap.common.utils.Tasks.waitFor(Tasks.java:91)
	at co.cask.cdap.common.utils.Tasks.waitFor(Tasks.java:130)
	at co.cask.cdap.test.AbstractProgramManager.waitForRuns(AbstractProgramManager.java:81)
	at co.cask.cdap.test.AbstractProgramManager.waitForRun(AbstractProgramManager.java:75)
	at co.cask.cdap.apps.fileset.PartitionedFileSetUpdateTest.test(PartitionedFileSetUpdateTest.java:120)
Collapse Failed WorkflowTest testLDA History
Distro Tests - CDH 5.12 3 mins
co.cask.cdap.common.NotFoundException: 'Either the workflow or its run id or the specified key at the specified scope' was not found.
	at co.cask.cdap.client.WorkflowClient.getWorkflowTokenAtNode(WorkflowClient.java:205)
	at co.cask.cdap.test.remote.RemoteWorkflowManager.getTokenAtNode(RemoteWorkflowManager.java:83)
	at co.cask.cdap.apps.workflow.WorkflowTest.testWorkflow(WorkflowTest.java:133)
	at co.cask.cdap.apps.workflow.WorkflowTest.testWorkflow(WorkflowTest.java:112)
	at co.cask.cdap.apps.workflow.WorkflowTest.testLDA(WorkflowTest.java:92)
Fixed tests 2
Status Test Failing since View job Duration
Successful ApplicationTest test History
Failing since build #30 (Scheduled) Distro Tests - HDP 2.6 2 mins
Successful WorkflowTest testLDA History
Failing since build #27 (Scheduled with changes by mattwuenschel <mwuenschel@google.com>) Distro Tests - HDP 2.6 11 mins