Build #30

Build: #30 failed Scheduled

Test results

  • 168 tests in total
  • 2 tests failed
  • 1 failure is new
  • 536 minutes taken in total.
New test failures 1
Status Test View job Duration
Collapse Failed ApplicationTest test History
Distro Tests - HDP 2.6 57 secs
java.lang.RuntimeException: java.io.IOException: 500: No server address listed in hbase:meta for region cdap_system:config.store.table,,1530613341883.1b5a0955d3f434108b55f4d49fc118ea. containing row \x00\x00\x00\x00\x00\x00\x00\x00\x0Bpreferences\x00\x00\x00\x0C\x00\x00\x00\x08instance
	at co.cask.cdap.client.util.RESTClient.execute(RESTClient.java:132)
	at co.cask.cdap.client.util.RESTClient.execute(RESTClient.java:69)
	at co.cask.cdap.client.ProgramClient.start(ProgramClient.java:132)
	at co.cask.cdap.test.remote.RemoteApplicationManager.startProgram(RemoteApplicationManager.java:140)
	at co.cask.cdap.test.AbstractProgramManager.start(AbstractProgramManager.java:56)
	at co.cask.cdap.test.AbstractProgramManager.start(AbstractProgramManager.java:51)
	at co.cask.cdap.apps.ApplicationTest.test(ApplicationTest.java:40)
Existing test failures 1
Status Test Failing since View job Duration
co.cask.cdap.common.NotFoundException: 'Either the workflow or its run id or the specified key at the specified scope' was not found.
	at co.cask.cdap.client.WorkflowClient.getWorkflowTokenAtNode(WorkflowClient.java:205)
	at co.cask.cdap.test.remote.RemoteWorkflowManager.getTokenAtNode(RemoteWorkflowManager.java:83)
	at co.cask.cdap.apps.workflow.WorkflowTest.testWorkflow(WorkflowTest.java:133)
	at co.cask.cdap.apps.workflow.WorkflowTest.testWorkflow(WorkflowTest.java:112)
	at co.cask.cdap.apps.workflow.WorkflowTest.testLDA(WorkflowTest.java:92)