Build #28

Build: #28 failed Scheduled

Test results

  • 168 tests in total
  • 3 tests failed
  • 10 tests were fixed
  • 551 minutes taken in total.
Existing test failures 3
Status Test Failing since View job Duration
java.lang.AssertionError: expected:<[MetadataRecord{entityId=application:default.PurchaseHistory.-SNAPSHOT, scope=USER, properties={spKey1=spApp1}, tags=[]}, MetadataRecord{entityId=program:default.PurchaseHistory.-SNAPSHOT.service.PurchaseHistoryService, scope=USER, properties={spKey1=spValue1, spKey2=spValue2}, tags=[serviceTag1, serviceTag2]}, MetadataRecord{entityId=dataset:default.history, scope=USER, properties={}, tags=[dsTag1, dsTag2]}]> but was:<[MetadataRecord{entityId=dataset:default.history, scope=USER, properties={}, tags=[dsTag1, dsTag2]}, MetadataRecord{entityId=application:default.PurchaseHistory.-SNAPSHOT, scope=USER, properties={spKey1=spApp1}, tags=[]}, MetadataRecord{entityId=program:default.PurchaseHistory.-SNAPSHOT.service.PurchaseHistoryService, scope=USER, properties={spKey1=spValue1}, tags=[serviceTag2, serviceTag1]}]>
	at org.junit.Assert.fail(Assert.java:88)
	at org.junit.Assert.failNotEquals(Assert.java:743)
	at org.junit.Assert.assertEquals(Assert.java:118)
	at org.junit.Assert.assertEquals(Assert.java:144)
	at co.cask.cdap.apps.metadata.PurchaseMetadataTest.testLineage(PurchaseMetadataTest.java:273)
java.lang.AssertionError: expected:<LineageRecord{start=1530360223, end=1530370223, relations=[RelationRecord{data='dataset.default.purchases', program='flows.default.PurchaseHistory.PurchaseFlow', accesses=[write], runs=[a29dbfa5-7c5d-11e8-884b-42010ad2001a], components=[collector]}, RelationRecord{data='stream.default.purchaseStream', program='flows.default.PurchaseHistory.PurchaseFlow', accesses=[read], runs=[a29dbfa5-7c5d-11e8-884b-42010ad2001a], components=[reader]}], programs={flows.default.PurchaseHistory.PurchaseFlow=ProgramRecord{entityId=program:default.PurchaseHistory.-SNAPSHOT.flow.PurchaseFlow}}, data={stream.default.purchaseStream=DataRecord{entityId=stream:default.purchaseStream}, dataset.default.purchases=DataRecord{entityId=dataset:default.purchases}}}> but was:<LineageRecord{start=1530360223, end=1530370223, relations=[RelationRecord{data='dataset.default.purchases', program='flows.default.PurchaseHistory.PurchaseFlow', accesses=[unknown], runs=[a29dbfa5-7c5d-11e8-884b-42010ad2001a], components=[collector]}, RelationRecord{data='stream.default.purchaseStream', program='flows.default.PurchaseHistory.PurchaseFlow', accesses=[read], runs=[a29dbfa5-7c5d-11e8-884b-42010ad2001a], components=[reader]}], programs={flows.default.PurchaseHistory.PurchaseFlow=ProgramRecord{entityId=program:default.PurchaseHistory.-SNAPSHOT.flow.PurchaseFlow}}, data={stream.default.purchaseStream=DataRecord{entityId=stream:default.purchaseStream}, dataset.default.purchases=DataRecord{entityId=dataset:default.purchases}}}>
	at org.junit.Assert.fail(Assert.java:88)
	at org.junit.Assert.failNotEquals(Assert.java:743)
	at org.junit.Assert.assertEquals(Assert.java:118)
	at org.junit.Assert.assertEquals(Assert.java:144)
	at co.cask.cdap.apps.metadata.PurchaseMetadataTest.testLineage(PurchaseMetadataTest.java:138)
co.cask.cdap.common.NotFoundException: 'Either the workflow or its run id or the specified key at the specified scope' was not found.
	at co.cask.cdap.client.WorkflowClient.getWorkflowTokenAtNode(WorkflowClient.java:205)
	at co.cask.cdap.test.remote.RemoteWorkflowManager.getTokenAtNode(RemoteWorkflowManager.java:83)
	at co.cask.cdap.apps.workflow.WorkflowTest.testWorkflow(WorkflowTest.java:133)
	at co.cask.cdap.apps.workflow.WorkflowTest.testWorkflow(WorkflowTest.java:112)
	at co.cask.cdap.apps.workflow.WorkflowTest.testLDA(WorkflowTest.java:92)
Fixed tests 10
Status Test Failing since View job Duration
Successful DatasetTest test History
Failing since build #27 (Scheduled with changes by mattwuenschel <mwuenschel@google.com>) Distro Tests - CDH 5.12 2 mins
Successful DatasetTest test History
Failing since build #27 (Scheduled with changes by mattwuenschel <mwuenschel@google.com>) Distro Tests - HDP 2.6 2 mins
Successful DatasetTest test History
Failing since build #27 (Scheduled with changes by mattwuenschel <mwuenschel@google.com>) Distro Tests - MapR 5.2 MEP 1.1 2 mins
Successful PurchaseMetadataTest testLineage History
Failing since build #27 (Scheduled with changes by mattwuenschel <mwuenschel@google.com>) Distro Tests - MapR 5.2 MEP 1.1 4 mins
Successful PurchaseAudiTest test History
Failing since build #27 (Scheduled with changes by mattwuenschel <mwuenschel@google.com>) Distro Tests - HDP 2.6 5 mins
Successful SparkPageRankAppTest test History
Failing since build #27 (Scheduled with changes by mattwuenschel <mwuenschel@google.com>) Distro Tests - CDH 5.12 4 mins
Successful SparkPageRankAppTest test History
Failing since build #27 (Scheduled with changes by mattwuenschel <mwuenschel@google.com>) Distro Tests - HDP 2.6 4 mins
Successful WorkflowTest testKMeans History
Failing since build #27 (Scheduled with changes by mattwuenschel <mwuenschel@google.com>) Distro Tests - CDH 5.12 6 mins
Successful WorkflowTest testLDA History
Failing since build #27 (Scheduled with changes by mattwuenschel <mwuenschel@google.com>) Distro Tests - CDH 5.12 8 mins
Successful WorkflowTest testKMeans History
Failing since build #27 (Scheduled with changes by mattwuenschel <mwuenschel@google.com>) Distro Tests - HDP 2.6 6 mins