Build #27

Build: #27 failed Scheduled with changes by mattwuenschel <mwuenschel@google.com>

Build result summary

Details

Completed
Duration
389 minutes
Labels
None
Revisions
CDAP Integration Tests
0fda9fb554504d3df96b1a1c1e56cccaa3851b51 0fda9fb554504d3df96b1a1c1e56cccaa3851b51
Coopr-internal
6bea9ea67ff7e2ec5fddbede8c93a21dd8911814 6bea9ea67ff7e2ec5fddbede8c93a21dd8911814
Total tests
168
Failing since
#26 (Scheduled with changes by 3 people)
Fixed in
#35 (Manual run by Ali Anwar)

Responsible

Code commits

CDAP Integration Tests
Author Commit Message Commit date
mattwuenschel <mwuenschel@google.com> mattwuenschel <mwuenschel@google.com> 0fda9fb554504d3df96b1a1c1e56cccaa3851b51 0fda9fb554504d3df96b1a1c1e56cccaa3851b51 Merge pull request #923 from caskdata/feature/add-cm-5.15
add cm 5.15
mattwuenschel <mwuenschel@google.com> mattwuenschel <mwuenschel@google.com> 88c3187799fd68aeb139fedfdbc2ba725ee22ffd 88c3187799fd68aeb139fedfdbc2ba725ee22ffd add cdh 5.15
mattwuenschel <mwuenschel@google.com> mattwuenschel <mwuenschel@google.com> abb654050c8c8e190183433b9ecc31d2248b8a7f abb654050c8c8e190183433b9ecc31d2248b8a7f add cm 5.15

Tests

New test failures 12
Status Test View job Duration
Collapse Failed DatasetTest test History
Distro Tests - CDH 5.12 2 mins
java.lang.AssertionError: expected:<4> but was:<0>
	at org.junit.Assert.fail(Assert.java:88)
	at org.junit.Assert.failNotEquals(Assert.java:743)
	at org.junit.Assert.assertEquals(Assert.java:118)
	at org.junit.Assert.assertEquals(Assert.java:555)
	at org.junit.Assert.assertEquals(Assert.java:542)
	at co.cask.cdap.apps.DatasetTest.test(DatasetTest.java:121)
Collapse Failed DatasetTest test History
Distro Tests - HDP 2.6 2 mins
java.lang.AssertionError: expected:<4> but was:<0>
	at org.junit.Assert.fail(Assert.java:88)
	at org.junit.Assert.failNotEquals(Assert.java:743)
	at org.junit.Assert.assertEquals(Assert.java:118)
	at org.junit.Assert.assertEquals(Assert.java:555)
	at org.junit.Assert.assertEquals(Assert.java:542)
	at co.cask.cdap.apps.DatasetTest.test(DatasetTest.java:121)
Collapse Failed DatasetTest test History
Distro Tests - MapR 5.2 MEP 1.1 1 min
java.lang.AssertionError: expected:<4> but was:<0>
	at org.junit.Assert.fail(Assert.java:88)
	at org.junit.Assert.failNotEquals(Assert.java:743)
	at org.junit.Assert.assertEquals(Assert.java:118)
	at org.junit.Assert.assertEquals(Assert.java:555)
	at org.junit.Assert.assertEquals(Assert.java:542)
	at co.cask.cdap.apps.DatasetTest.test(DatasetTest.java:121)
Collapse Failed PurchaseMetadataTest testLineage History
Distro Tests - CDH 5.12 1 min
java.lang.AssertionError: expected:<LineageRecord{start=1530273415, end=1530283415, relations=[RelationRecord{data='dataset.default.purchases', program='flows.default.PurchaseHistory.PurchaseFlow', accesses=[write], runs=[85295ee5-7b93-11e8-8924-42010ad2000b], components=[collector]}, RelationRecord{data='stream.default.purchaseStream', program='flows.default.PurchaseHistory.PurchaseFlow', accesses=[read], runs=[85295ee5-7b93-11e8-8924-42010ad2000b], components=[reader]}], programs={flows.default.PurchaseHistory.PurchaseFlow=ProgramRecord{entityId=program:default.PurchaseHistory.-SNAPSHOT.flow.PurchaseFlow}}, data={stream.default.purchaseStream=DataRecord{entityId=stream:default.purchaseStream}, dataset.default.purchases=DataRecord{entityId=dataset:default.purchases}}}> but was:<LineageRecord{start=1530273415, end=1530283415, relations=[], programs={}, data={}}>
	at org.junit.Assert.fail(Assert.java:88)
	at org.junit.Assert.failNotEquals(Assert.java:743)
	at org.junit.Assert.assertEquals(Assert.java:118)
	at org.junit.Assert.assertEquals(Assert.java:144)
	at co.cask.cdap.apps.metadata.PurchaseMetadataTest.testLineage(PurchaseMetadataTest.java:138)
Collapse Failed PurchaseMetadataTest testLineage History
Distro Tests - MapR 5.2 MEP 1.1 1 min
java.lang.AssertionError: expected:<LineageRecord{start=1530267051, end=1530277051, relations=[RelationRecord{data='stream.default.purchaseStream', program='flows.default.PurchaseHistory.PurchaseFlow', accesses=[read], runs=[b3fdbc11-7b84-11e8-b954-42010ad2001f], components=[reader]}, RelationRecord{data='dataset.default.purchases', program='flows.default.PurchaseHistory.PurchaseFlow', accesses=[write], runs=[b3fdbc11-7b84-11e8-b954-42010ad2001f], components=[collector]}], programs={flows.default.PurchaseHistory.PurchaseFlow=ProgramRecord{entityId=program:default.PurchaseHistory.-SNAPSHOT.flow.PurchaseFlow}}, data={stream.default.purchaseStream=DataRecord{entityId=stream:default.purchaseStream}, dataset.default.purchases=DataRecord{entityId=dataset:default.purchases}}}> but was:<LineageRecord{start=1530267051, end=1530277051, relations=[], programs={}, data={}}>
	at org.junit.Assert.fail(Assert.java:88)
	at org.junit.Assert.failNotEquals(Assert.java:743)
	at org.junit.Assert.assertEquals(Assert.java:118)
	at org.junit.Assert.assertEquals(Assert.java:144)
	at co.cask.cdap.apps.metadata.PurchaseMetadataTest.testLineage(PurchaseMetadataTest.java:138)
Collapse Failed PurchaseAudiTest test History
Distro Tests - HDP 2.6 2 mins
java.util.concurrent.TimeoutException: Time limit reached. Got '0' instead of '1'
	at co.cask.cdap.client.MetricsClient$3.doWaitFor(MetricsClient.java:286)
	at co.cask.cdap.client.MetricsClient$3.waitForProcessed(MetricsClient.java:256)
	at co.cask.cdap.apps.purchase.PurchaseAudiTest.test(PurchaseAudiTest.java:95)
Collapse Failed SparkPageRankAppTest test History
Distro Tests - CDH 5.12 4 mins
java.lang.AssertionError: expected:<LineageRecord{start=1530274171, end=1530274506, relations=[RelationRecord{data='dataset.default.ranks', program='spark.default.SparkPageRank.PageRankSpark', accesses=[write], runs=[558ce2a2-7b95-11e8-80a8-42010ad2000b], components=[]}, RelationRecord{data='dataset.default.ranks', program='mapreduce.default.SparkPageRank.RanksCounter', accesses=[read], runs=[87aebf63-7b95-11e8-a13e-42010ad2000b], components=[]}, RelationRecord{data='dataset.default.rankscount', program='services.default.SparkPageRank.SparkPageRankService', accesses=[read], runs=[4a79cd61-7b95-11e8-b243-42010ad2000b], components=[]}, RelationRecord{data='stream.default.backlinkURLStream', program='spark.default.SparkPageRank.PageRankSpark', accesses=[read], runs=[558ce2a2-7b95-11e8-80a8-42010ad2000b], components=[]}, RelationRecord{data='dataset.default.rankscount', program='mapreduce.default.SparkPageRank.RanksCounter', accesses=[write], runs=[87aebf63-7b95-11e8-a13e-42010ad2000b], components=[]}, RelationRecord{data='dataset.default.ranks', program='services.default.SparkPageRank.SparkPageRankService', accesses=[read], runs=[4a79cd61-7b95-11e8-b243-42010ad2000b], components=[]}], programs={spark.default.SparkPageRank.PageRankSpark=ProgramRecord{entityId=program:default.SparkPageRank.-SNAPSHOT.spark.PageRankSpark}, services.default.SparkPageRank.SparkPageRankService=ProgramRecord{entityId=program:default.SparkPageRank.-SNAPSHOT.service.SparkPageRankService}, mapreduce.default.SparkPageRank.RanksCounter=ProgramRecord{entityId=program:default.SparkPageRank.-SNAPSHOT.mapreduce.RanksCounter}}, data={dataset.default.ranks=DataRecord{entityId=dataset:default.ranks}, stream.default.backlinkURLStream=DataRecord{entityId=stream:default.backlinkURLStream}, dataset.default.rankscount=DataRecord{entityId=dataset:default.rankscount}}}> but was:<LineageRecord{start=1530274171, end=1530274506, relations=[], programs={}, data={}}>
	at org.junit.Assert.fail(Assert.java:88)
	at org.junit.Assert.failNotEquals(Assert.java:743)
	at org.junit.Assert.assertEquals(Assert.java:118)
	at org.junit.Assert.assertEquals(Assert.java:144)
	at co.cask.cdap.apps.spark.sparkpagerank.SparkPageRankAppTest.testLineage(SparkPageRankAppTest.java:231)
	at co.cask.cdap.apps.spark.sparkpagerank.SparkPageRankAppTest.test(SparkPageRankAppTest.java:208)
Collapse Failed SparkPageRankAppTest test History
Distro Tests - HDP 2.6 4 mins
java.lang.AssertionError: expected:<LineageRecord{start=1530274290, end=1530274660, relations=[RelationRecord{data='dataset.default.ranks', program='mapreduce.default.SparkPageRank.RanksCounter', accesses=[read], runs=[dc2c89ef-7b95-11e8-945f-42010ad20013], components=[]}, RelationRecord{data='stream.default.backlinkURLStream', program='spark.default.SparkPageRank.PageRankSpark', accesses=[read], runs=[a0323ace-7b95-11e8-9c11-42010ad20013], components=[]}, RelationRecord{data='dataset.default.ranks', program='services.default.SparkPageRank.SparkPageRankService', accesses=[read], runs=[932e03ed-7b95-11e8-9e02-42010ad20013], components=[]}, RelationRecord{data='dataset.default.rankscount', program='services.default.SparkPageRank.SparkPageRankService', accesses=[read], runs=[932e03ed-7b95-11e8-9e02-42010ad20013], components=[]}, RelationRecord{data='dataset.default.rankscount', program='mapreduce.default.SparkPageRank.RanksCounter', accesses=[write], runs=[dc2c89ef-7b95-11e8-945f-42010ad20013], components=[]}, RelationRecord{data='dataset.default.ranks', program='spark.default.SparkPageRank.PageRankSpark', accesses=[write], runs=[a0323ace-7b95-11e8-9c11-42010ad20013], components=[]}], programs={spark.default.SparkPageRank.PageRankSpark=ProgramRecord{entityId=program:default.SparkPageRank.-SNAPSHOT.spark.PageRankSpark}, services.default.SparkPageRank.SparkPageRankService=ProgramRecord{entityId=program:default.SparkPageRank.-SNAPSHOT.service.SparkPageRankService}, mapreduce.default.SparkPageRank.RanksCounter=ProgramRecord{entityId=program:default.SparkPageRank.-SNAPSHOT.mapreduce.RanksCounter}}, data={dataset.default.ranks=DataRecord{entityId=dataset:default.ranks}, stream.default.backlinkURLStream=DataRecord{entityId=stream:default.backlinkURLStream}, dataset.default.rankscount=DataRecord{entityId=dataset:default.rankscount}}}> but was:<LineageRecord{start=1530274290, end=1530274660, relations=[], programs={}, data={}}>
	at org.junit.Assert.fail(Assert.java:88)
	at org.junit.Assert.failNotEquals(Assert.java:743)
	at org.junit.Assert.assertEquals(Assert.java:118)
	at org.junit.Assert.assertEquals(Assert.java:144)
	at co.cask.cdap.apps.spark.sparkpagerank.SparkPageRankAppTest.testLineage(SparkPageRankAppTest.java:231)
	at co.cask.cdap.apps.spark.sparkpagerank.SparkPageRankAppTest.test(SparkPageRankAppTest.java:208)
Collapse Failed WorkflowTest testKMeans History
Distro Tests - CDH 5.12 6 mins
co.cask.cdap.common.NotFoundException: 'Either the workflow or its run id or the specified key at the specified scope' was not found.
	at co.cask.cdap.client.WorkflowClient.getWorkflowTokenAtNode(WorkflowClient.java:205)
	at co.cask.cdap.test.remote.RemoteWorkflowManager.getTokenAtNode(RemoteWorkflowManager.java:83)
	at co.cask.cdap.apps.workflow.WorkflowTest.testWorkflow(WorkflowTest.java:133)
	at co.cask.cdap.apps.workflow.WorkflowTest.testKMeans(WorkflowTest.java:107)
Collapse Failed WorkflowTest testLDA History
Distro Tests - CDH 5.12 2 mins
co.cask.cdap.common.NotFoundException: 'Either the workflow or its run id or the specified key at the specified scope' was not found.
	at co.cask.cdap.client.WorkflowClient.getWorkflowTokenAtNode(WorkflowClient.java:205)
	at co.cask.cdap.test.remote.RemoteWorkflowManager.getTokenAtNode(RemoteWorkflowManager.java:83)
	at co.cask.cdap.apps.workflow.WorkflowTest.testWorkflow(WorkflowTest.java:133)
	at co.cask.cdap.apps.workflow.WorkflowTest.testWorkflow(WorkflowTest.java:112)
	at co.cask.cdap.apps.workflow.WorkflowTest.testLDA(WorkflowTest.java:92)
Collapse Failed WorkflowTest testKMeans History
Distro Tests - HDP 2.6 6 mins
co.cask.cdap.common.NotFoundException: 'Either the workflow or its run id or the specified key at the specified scope' was not found.
	at co.cask.cdap.client.WorkflowClient.getWorkflowTokenAtNode(WorkflowClient.java:205)
	at co.cask.cdap.test.remote.RemoteWorkflowManager.getTokenAtNode(RemoteWorkflowManager.java:83)
	at co.cask.cdap.apps.workflow.WorkflowTest.testWorkflow(WorkflowTest.java:133)
	at co.cask.cdap.apps.workflow.WorkflowTest.testKMeans(WorkflowTest.java:107)
Collapse Failed WorkflowTest testLDA History
Distro Tests - HDP 2.6 2 mins
co.cask.cdap.common.NotFoundException: 'Either the workflow or its run id or the specified key at the specified scope' was not found.
	at co.cask.cdap.client.WorkflowClient.getWorkflowTokenAtNode(WorkflowClient.java:205)
	at co.cask.cdap.test.remote.RemoteWorkflowManager.getTokenAtNode(RemoteWorkflowManager.java:83)
	at co.cask.cdap.apps.workflow.WorkflowTest.testWorkflow(WorkflowTest.java:133)
	at co.cask.cdap.apps.workflow.WorkflowTest.testWorkflow(WorkflowTest.java:112)
	at co.cask.cdap.apps.workflow.WorkflowTest.testLDA(WorkflowTest.java:92)
Existing test failures 1
Status Test Failing since View job Duration
java.lang.AssertionError: expected:<LineageRecord{start=1530273464, end=1530283464, relations=[RelationRecord{data='stream.default.purchaseStream', program='flows.default.PurchaseHistory.PurchaseFlow', accesses=[read], runs=[a236cf41-7b93-11e8-a17b-42010ad20013], components=[reader]}, RelationRecord{data='dataset.default.purchases', program='flows.default.PurchaseHistory.PurchaseFlow', accesses=[write], runs=[a236cf41-7b93-11e8-a17b-42010ad20013], components=[collector]}], programs={flows.default.PurchaseHistory.PurchaseFlow=ProgramRecord{entityId=program:default.PurchaseHistory.-SNAPSHOT.flow.PurchaseFlow}}, data={stream.default.purchaseStream=DataRecord{entityId=stream:default.purchaseStream}, dataset.default.purchases=DataRecord{entityId=dataset:default.purchases}}}> but was:<LineageRecord{start=1530273464, end=1530283464, relations=[], programs={}, data={}}>
	at org.junit.Assert.fail(Assert.java:88)
	at org.junit.Assert.failNotEquals(Assert.java:743)
	at org.junit.Assert.assertEquals(Assert.java:118)
	at org.junit.Assert.assertEquals(Assert.java:144)
	at co.cask.cdap.apps.metadata.PurchaseMetadataTest.testLineage(PurchaseMetadataTest.java:138)