Build #11

Build: #11 failed Scheduled with changes by Ali Anwar and Ali <alianwar@google.com>

Build result summary

Details

Completed
Duration
301 minutes
Labels
None
Revisions
CDAP Integration Tests
036ab194d7124b31c4321eab644fb82f9afa036b 036ab194d7124b31c4321eab644fb82f9afa036b
Coopr-internal
aeafcc25ed6b87d5687d19cbb62cf7f61f4e72b6 aeafcc25ed6b87d5687d19cbb62cf7f61f4e72b6
Total tests
168
Failing since
#6 (Manual run by Sreevatsan Raman)

Responsible

Code commits

CDAP Integration Tests
Author Commit Message Commit date
Ali Anwar Ali Anwar 036ab194d7124b31c4321eab644fb82f9afa036b 036ab194d7124b31c4321eab644fb82f9afa036b Merge pull request #913 from caskdata/remove-hadoop-operational-stats-tests
CDAP-13493 Remove integration tests for Hadoop operational stats.
Ali <alianwar@google.com> Ali <alianwar@google.com> 67550bebe04a7629a615fc69d968237a925683a4 67550bebe04a7629a615fc69d968237a925683a4 Fix json formatting in dsth26.json.
Ali <alianwar@google.com> Ali <alianwar@google.com> fe5675969f29e4af581805827abb4a1bccfa17c7 fe5675969f29e4af581805827abb4a1bccfa17c7 CDAP-13493 Remove integration tests for Hadoop operational stats.

Tests

New test failures 1
Status Test View job Duration
Collapse Failed ExcelInputReaderTest testExcelReaderReprocessFalse History
Distro Tests - HDP 2.6 3 mins
java.lang.RuntimeException: java.net.SocketTimeoutException: Read timed out
	at java.net.SocketInputStream.socketRead0(Native Method)
	at java.net.SocketInputStream.socketRead(SocketInputStream.java:116)
	at java.net.SocketInputStream.read(SocketInputStream.java:170)
	at java.net.SocketInputStream.read(SocketInputStream.java:141)
	at java.io.BufferedInputStream.fill(BufferedInputStream.java:246)
	at java.io.BufferedInputStream.read1(BufferedInputStream.java:286)
	at java.io.BufferedInputStream.read(BufferedInputStream.java:345)
(12 more lines...)
Existing test failures 7
Status Test Failing since View job Duration
java.util.concurrent.TimeoutException: Timeout occurred. Expected true but found false.
	at co.cask.cdap.common.utils.Tasks.waitFor(Tasks.java:70)
	at co.cask.cdap.common.utils.Tasks.waitFor(Tasks.java:91)
	at co.cask.cdap.common.utils.Tasks.waitFor(Tasks.java:130)
	at co.cask.cdap.test.AbstractProgramManager.waitForRuns(AbstractProgramManager.java:81)
	at co.cask.cdap.test.AbstractProgramManager.waitForRun(AbstractProgramManager.java:75)
	at co.cask.cdap.app.etl.batch.NormalizeTest.startWorkFlow(NormalizeTest.java:131)
	at co.cask.cdap.app.etl.batch.NormalizeTest.testNormalizeWithEmptyAttributeValue(NormalizeTest.java:218)
java.lang.RuntimeException: java.io.IOException: 500: Failed to publish message to topic topic:system.programstatusevent. Reason: Invalid payload. Empty message is only allowed for transactional message
	at co.cask.cdap.client.util.RESTClient.execute(RESTClient.java:132)
	at co.cask.cdap.client.util.RESTClient.execute(RESTClient.java:69)
	at co.cask.cdap.client.ProgramClient.start(ProgramClient.java:132)
	at co.cask.cdap.test.remote.RemoteApplicationManager.startProgram(RemoteApplicationManager.java:140)
	at co.cask.cdap.test.AbstractProgramManager.start(AbstractProgramManager.java:56)
	at co.cask.cdap.test.AbstractProgramManager.start(AbstractProgramManager.java:51)
	at co.cask.cdap.app.etl.batch.TPFSSinkSourceTest.testStreamTPFSWithProjection(TPFSSinkSourceTest.java:96)
(1 more lines...)
java.util.concurrent.TimeoutException: Timeout occurred. Expected true but found false.
	at co.cask.cdap.common.utils.Tasks.waitFor(Tasks.java:70)
	at co.cask.cdap.common.utils.Tasks.waitFor(Tasks.java:91)
	at co.cask.cdap.common.utils.Tasks.waitFor(Tasks.java:130)
	at co.cask.cdap.test.AbstractProgramManager.waitForRuns(AbstractProgramManager.java:81)
	at co.cask.cdap.app.fileset.PermissionTest.test(PermissionTest.java:160)
java.util.concurrent.TimeoutException: Timeout occurred. Expected true but found false.
	at co.cask.cdap.common.utils.Tasks.waitFor(Tasks.java:70)
	at co.cask.cdap.common.utils.Tasks.waitFor(Tasks.java:91)
	at co.cask.cdap.common.utils.Tasks.waitFor(Tasks.java:130)
	at co.cask.cdap.test.AbstractProgramManager.waitForRuns(AbstractProgramManager.java:81)
	at co.cask.cdap.test.AbstractProgramManager.waitForRun(AbstractProgramManager.java:75)
	at co.cask.cdap.app.mapreduce.readless.ReadlessIncrementTest.testReadlessIncrementsInMapReduce(ReadlessIncrementTest.java:67)
java.util.concurrent.TimeoutException: Timeout occurred. Expected true but found false.
	at co.cask.cdap.common.utils.Tasks.waitFor(Tasks.java:70)
	at co.cask.cdap.common.utils.Tasks.waitFor(Tasks.java:91)
	at co.cask.cdap.common.utils.Tasks.waitFor(Tasks.java:130)
	at co.cask.cdap.test.AbstractProgramManager.waitForRuns(AbstractProgramManager.java:81)
	at co.cask.cdap.test.AbstractProgramManager.waitForRun(AbstractProgramManager.java:75)
	at co.cask.cdap.apps.fileset.FileSetTest.test(FileSetTest.java:97)
java.io.IOException: 409: 
	at co.cask.cdap.client.util.RESTClient.execute(RESTClient.java:132)
	at co.cask.cdap.client.util.RESTClient.execute(RESTClient.java:69)
	at co.cask.cdap.apps.fileset.PartitionCorrectorTest.test(PartitionCorrectorTest.java:65)
java.lang.AssertionError: expected:<[MetadataRecord{entityId=application:default.PurchaseHistory.-SNAPSHOT, scope=USER, properties={spKey1=spApp1}, tags=[]}, MetadataRecord{entityId=program:default.PurchaseHistory.-SNAPSHOT.service.PurchaseHistoryService, scope=USER, properties={spKey1=spValue1, spKey2=spValue2}, tags=[serviceTag1, serviceTag2]}, MetadataRecord{entityId=dataset:default.history, scope=USER, properties={}, tags=[dsTag1, dsTag2]}]> but was:<[MetadataRecord{entityId=dataset:default.history, scope=USER, properties={}, tags=[dsTag1, dsTag2]}, MetadataRecord{entityId=application:default.PurchaseHistory.-SNAPSHOT, scope=USER, properties={spKey1=spApp1}, tags=[]}, MetadataRecord{entityId=program:default.PurchaseHistory.-SNAPSHOT.service.PurchaseHistoryService, scope=USER, properties={spKey1=spValue1}, tags=[serviceTag2, serviceTag1]}]>
	at org.junit.Assert.fail(Assert.java:88)
	at org.junit.Assert.failNotEquals(Assert.java:743)
	at org.junit.Assert.assertEquals(Assert.java:118)
	at org.junit.Assert.assertEquals(Assert.java:144)
	at co.cask.cdap.apps.metadata.PurchaseMetadataTest.testLineage(PurchaseMetadataTest.java:273)
Fixed tests 23
Status Test Failing since View job Duration
Successful StreamTPFSWithProjectionTest testStreamTPFSWithProjection History
Failing since build #8 (Scheduled) Distro Tests - HDP 2.6 5 mins
Successful BatchAggregatorTest test History
Failing since build #8 (Scheduled) Distro Tests - HDP 2.6 6 mins
Successful BatchJoinerTest testJoinerMR History
Failing since build #10 (Scheduled with changes by Ali Anwar and mattwuenschel <mwuenschel@google.com>) Distro Tests - HDP 2.6 9 mins
Successful BatchJoinerTest testJoinerSpark History
Failing since build #8 (Scheduled) Distro Tests - HDP 2.6 5 mins
Successful ETLMapReduceTest testTableToTableWithValidations History
Failing since build #10 (Scheduled with changes by Ali Anwar and mattwuenschel <mwuenschel@google.com>) Distro Tests - HDP 2.6 4 mins
Successful ETLMapReduceTest testDAGSchemaChanges History
Failing since build #6 (Manual run by Sreevatsan Raman) Distro Tests - HDP 2.6 3 mins
Successful TPFSSinkSourceTest testSpark History
Failing since build #6 (Manual run by Sreevatsan Raman) Distro Tests - HDP 2.6 4 mins
Successful XMLReaderTest testInvalidNodePathWithMoveAction History
Failing since build #7 (Scheduled) Distro Tests - HDP 2.6 4 mins
Successful XMLReaderTest testPreProcessingRequired History
Failing since build #10 (Scheduled with changes by Ali Anwar and mattwuenschel <mwuenschel@google.com>) Distro Tests - HDP 2.6 4 mins
Successful DataStreamsTest testDataStreams History
Failing since build #9 (Scheduled) Distro Tests - HDP 2.6 3 mins
Successful WranglerServiceTest test History
Failing since build #10 (Scheduled with changes by Ali Anwar and mattwuenschel <mwuenschel@google.com>) Distro Tests - HDP 2.6 1 min
Successful WranglerTest testWranglerMR History
Failing since build #8 (Scheduled) Distro Tests - HDP 2.6 4 mins
Successful WranglerTest testWranglerSpark History
Failing since build #10 (Scheduled with changes by Ali Anwar and mattwuenschel <mwuenschel@google.com>) Distro Tests - HDP 2.6 3 mins
Successful ApplicationTest test History
Failing since build #9 (Scheduled) Distro Tests - HDP 2.6 2 mins
Successful ExploreTest test History
Failing since build #10 (Scheduled with changes by Ali Anwar and mattwuenschel <mwuenschel@google.com>) Distro Tests - HDP 2.6 < 1 sec
Successful PurchaseMetadataTest testLineage History
Failing since build #10 (Scheduled with changes by Ali Anwar and mattwuenschel <mwuenschel@google.com>) Distro Tests - CDH 5.12 4 mins
Successful PurchaseMetadataTest testSearchUsingSystemMetadata History
Failing since build #6 (Manual run by Sreevatsan Raman) Distro Tests - HDP 2.6 34 secs
Successful SparkPageRankAppTest test History
Failing since build #10 (Scheduled with changes by Ali Anwar and mattwuenschel <mwuenschel@google.com>) Distro Tests - HDP 2.6 5 mins
Successful WordCountTest test History
Failing since build #10 (Scheduled with changes by Ali Anwar and mattwuenschel <mwuenschel@google.com>) Distro Tests - HDP 2.6 2 mins
Successful WorkflowTest testLDA History
Failing since build #10 (Scheduled with changes by Ali Anwar and mattwuenschel <mwuenschel@google.com>) Distro Tests - CDH 5.12 7 mins
Successful WorkflowTest testKMeans History
Failing since build #10 (Scheduled with changes by Ali Anwar and mattwuenschel <mwuenschel@google.com>) Distro Tests - HDP 2.6 6 mins
Successful WorkflowTest testLDA History
Failing since build #10 (Scheduled with changes by Ali Anwar and mattwuenschel <mwuenschel@google.com>) Distro Tests - HDP 2.6 8 mins
Successful RemoteKeyValueTest test History
Failing since build #10 (Scheduled with changes by Ali Anwar and mattwuenschel <mwuenschel@google.com>) Distro Tests - HDP 2.6 56 secs

JIRA issues

IssueDescriptionStatus
Unknown Issue TypeCDAP-13493Could not obtain issue details from JIRA