Build #6

Build: #6 failed Manual run by Rohit Sinha

Stages & jobs

  1. Variables

  2. Spinup and Test

Test results

  • 32 tests in total
  • 32 tests failed
  • 32 failures are new
  • < 1 second taken in total.
New test failures 32
Status Test View job Duration
Collapse Failed AppImpersonationAuthorizationTest testDatasetInProgram History
Ambari - HDP 2.6 < 1 sec
java.lang.IllegalArgumentException: Illegal character in authority at index 7: http://${bamboo.ambari-server-ip}:11015
	at java.net.URI$Parser.fail(URI.java:2848)
	at java.net.URI$Parser.parseAuthority(URI.java:3186)
	at java.net.URI$Parser.parseHierarchical(URI.java:3097)
	at java.net.URI$Parser.parse(URI.java:3053)
	at java.net.URI.<init>(URI.java:588)
	at java.net.URI.create(URI.java:850)
	at co.cask.cdap.test.IntegrationTestBase.getClientConfig(IntegrationTestBase.java:314)
(5 more lines...)
Collapse Failed AppImpersonationAuthorizationTest testDeployApp History
Ambari - HDP 2.6 < 1 sec
java.lang.IllegalArgumentException: Illegal character in authority at index 7: http://${bamboo.ambari-server-ip}:11015
	at java.net.URI$Parser.fail(URI.java:2848)
	at java.net.URI$Parser.parseAuthority(URI.java:3186)
	at java.net.URI$Parser.parseHierarchical(URI.java:3097)
	at java.net.URI$Parser.parse(URI.java:3053)
	at java.net.URI.<init>(URI.java:588)
	at java.net.URI.create(URI.java:850)
	at co.cask.cdap.test.IntegrationTestBase.getClientConfig(IntegrationTestBase.java:314)
(5 more lines...)
Collapse Failed AppImpersonationAuthorizationTest testDeployAppUnauthorized History
Ambari - HDP 2.6 < 1 sec
java.lang.IllegalArgumentException: Illegal character in authority at index 7: http://${bamboo.ambari-server-ip}:11015
	at java.net.URI$Parser.fail(URI.java:2848)
	at java.net.URI$Parser.parseAuthority(URI.java:3186)
	at java.net.URI$Parser.parseHierarchical(URI.java:3097)
	at java.net.URI$Parser.parse(URI.java:3053)
	at java.net.URI.<init>(URI.java:588)
	at java.net.URI.create(URI.java:850)
	at co.cask.cdap.test.IntegrationTestBase.getClientConfig(IntegrationTestBase.java:314)
(5 more lines...)
Collapse Failed AppImpersonationAuthorizationTest testRunningFlowAndExploreStreams History
Ambari - HDP 2.6 < 1 sec
java.lang.IllegalArgumentException: Illegal character in authority at index 7: http://${bamboo.ambari-server-ip}:11015
	at java.net.URI$Parser.fail(URI.java:2848)
	at java.net.URI$Parser.parseAuthority(URI.java:3186)
	at java.net.URI$Parser.parseHierarchical(URI.java:3097)
	at java.net.URI$Parser.parse(URI.java:3053)
	at java.net.URI.<init>(URI.java:588)
	at java.net.URI.create(URI.java:850)
	at co.cask.cdap.test.IntegrationTestBase.getClientConfig(IntegrationTestBase.java:314)
(5 more lines...)
Collapse Failed BasicAppAuthorizationTest testDatasetInProgram History
Ambari - HDP 2.6 < 1 sec
java.lang.IllegalArgumentException: Illegal character in authority at index 7: http://${bamboo.ambari-server-ip}:11015
	at java.net.URI$Parser.fail(URI.java:2848)
	at java.net.URI$Parser.parseAuthority(URI.java:3186)
	at java.net.URI$Parser.parseHierarchical(URI.java:3097)
	at java.net.URI$Parser.parse(URI.java:3053)
	at java.net.URI.<init>(URI.java:588)
	at java.net.URI.create(URI.java:850)
	at co.cask.cdap.test.IntegrationTestBase.getClientConfig(IntegrationTestBase.java:314)
(4 more lines...)
Collapse Failed BasicAppAuthorizationTest testDeployAppUnauthorized History
Ambari - HDP 2.6 < 1 sec
java.lang.IllegalArgumentException: Illegal character in authority at index 7: http://${bamboo.ambari-server-ip}:11015
	at java.net.URI$Parser.fail(URI.java:2848)
	at java.net.URI$Parser.parseAuthority(URI.java:3186)
	at java.net.URI$Parser.parseHierarchical(URI.java:3097)
	at java.net.URI$Parser.parse(URI.java:3053)
	at java.net.URI.<init>(URI.java:588)
	at java.net.URI.create(URI.java:850)
	at co.cask.cdap.test.IntegrationTestBase.getClientConfig(IntegrationTestBase.java:314)
(4 more lines...)
Collapse Failed BasicAppAuthorizationTest testRunningFlowAndExploreStreams History
Ambari - HDP 2.6 < 1 sec
java.lang.IllegalArgumentException: Illegal character in authority at index 7: http://${bamboo.ambari-server-ip}:11015
	at java.net.URI$Parser.fail(URI.java:2848)
	at java.net.URI$Parser.parseAuthority(URI.java:3186)
	at java.net.URI$Parser.parseHierarchical(URI.java:3097)
	at java.net.URI$Parser.parse(URI.java:3053)
	at java.net.URI.<init>(URI.java:588)
	at java.net.URI.create(URI.java:850)
	at co.cask.cdap.test.IntegrationTestBase.getClientConfig(IntegrationTestBase.java:314)
(4 more lines...)
Collapse Failed BasicAppAuthorizationTest testDeployApp History
Ambari - HDP 2.6 < 1 sec
java.lang.IllegalArgumentException: Illegal character in authority at index 7: http://${bamboo.ambari-server-ip}:11015
	at java.net.URI$Parser.fail(URI.java:2848)
	at java.net.URI$Parser.parseAuthority(URI.java:3186)
	at java.net.URI$Parser.parseHierarchical(URI.java:3097)
	at java.net.URI$Parser.parse(URI.java:3053)
	at java.net.URI.<init>(URI.java:588)
	at java.net.URI.create(URI.java:850)
	at co.cask.cdap.test.IntegrationTestBase.getClientConfig(IntegrationTestBase.java:314)
(4 more lines...)
Collapse Failed BasicAuthorizationTest testNamespacePrivileges History
Ambari - HDP 2.6 < 1 sec
java.lang.IllegalArgumentException: Illegal character in authority at index 7: http://${bamboo.ambari-server-ip}:11015
	at java.net.URI$Parser.fail(URI.java:2848)
	at java.net.URI$Parser.parseAuthority(URI.java:3186)
	at java.net.URI$Parser.parseHierarchical(URI.java:3097)
	at java.net.URI$Parser.parse(URI.java:3053)
	at java.net.URI.<init>(URI.java:588)
	at java.net.URI.create(URI.java:850)
	at co.cask.cdap.test.IntegrationTestBase.getClientConfig(IntegrationTestBase.java:314)
(4 more lines...)
Collapse Failed BasicAuthorizationTest testPrivilegesAndVisibility History
Ambari - HDP 2.6 < 1 sec
java.lang.IllegalArgumentException: Illegal character in authority at index 7: http://${bamboo.ambari-server-ip}:11015
	at java.net.URI$Parser.fail(URI.java:2848)
	at java.net.URI$Parser.parseAuthority(URI.java:3186)
	at java.net.URI$Parser.parseHierarchical(URI.java:3097)
	at java.net.URI$Parser.parse(URI.java:3053)
	at java.net.URI.<init>(URI.java:588)
	at java.net.URI.create(URI.java:850)
	at co.cask.cdap.test.IntegrationTestBase.getClientConfig(IntegrationTestBase.java:314)
(4 more lines...)
Collapse Failed BasicAuthorizationTest testStreamPrivileges History
Ambari - HDP 2.6 < 1 sec
java.lang.IllegalArgumentException: Illegal character in authority at index 7: http://${bamboo.ambari-server-ip}:11015
	at java.net.URI$Parser.fail(URI.java:2848)
	at java.net.URI$Parser.parseAuthority(URI.java:3186)
	at java.net.URI$Parser.parseHierarchical(URI.java:3097)
	at java.net.URI$Parser.parse(URI.java:3053)
	at java.net.URI.<init>(URI.java:588)
	at java.net.URI.create(URI.java:850)
	at co.cask.cdap.test.IntegrationTestBase.getClientConfig(IntegrationTestBase.java:314)
(4 more lines...)
Collapse Failed BasicAuthorizationTest testDatasetPrivileges History
Ambari - HDP 2.6 < 1 sec
java.lang.IllegalArgumentException: Illegal character in authority at index 7: http://${bamboo.ambari-server-ip}:11015
	at java.net.URI$Parser.fail(URI.java:2848)
	at java.net.URI$Parser.parseAuthority(URI.java:3186)
	at java.net.URI$Parser.parseHierarchical(URI.java:3097)
	at java.net.URI$Parser.parse(URI.java:3053)
	at java.net.URI.<init>(URI.java:588)
	at java.net.URI.create(URI.java:850)
	at co.cask.cdap.test.IntegrationTestBase.getClientConfig(IntegrationTestBase.java:314)
(4 more lines...)
Collapse Failed BasicAuthorizationTest testDeleteNamespaceWithDifferentClients History
Ambari - HDP 2.6 < 1 sec
java.lang.IllegalArgumentException: Illegal character in authority at index 7: http://${bamboo.ambari-server-ip}:11015
	at java.net.URI$Parser.fail(URI.java:2848)
	at java.net.URI$Parser.parseAuthority(URI.java:3186)
	at java.net.URI$Parser.parseHierarchical(URI.java:3097)
	at java.net.URI$Parser.parse(URI.java:3053)
	at java.net.URI.<init>(URI.java:588)
	at java.net.URI.create(URI.java:850)
	at co.cask.cdap.test.IntegrationTestBase.getClientConfig(IntegrationTestBase.java:314)
(4 more lines...)
Collapse Failed CustomMappingAppAuthorizationTest testDatasetInProgram History
Ambari - HDP 2.6 < 1 sec
java.lang.IllegalArgumentException: Illegal character in authority at index 7: http://${bamboo.ambari-server-ip}:11015
	at java.net.URI$Parser.fail(URI.java:2848)
	at java.net.URI$Parser.parseAuthority(URI.java:3186)
	at java.net.URI$Parser.parseHierarchical(URI.java:3097)
	at java.net.URI$Parser.parse(URI.java:3053)
	at java.net.URI.<init>(URI.java:588)
	at java.net.URI.create(URI.java:850)
	at co.cask.cdap.test.IntegrationTestBase.getClientConfig(IntegrationTestBase.java:314)
(5 more lines...)
Collapse Failed CustomMappingAppAuthorizationTest testDeployApp History
Ambari - HDP 2.6 < 1 sec
java.lang.IllegalArgumentException: Illegal character in authority at index 7: http://${bamboo.ambari-server-ip}:11015
	at java.net.URI$Parser.fail(URI.java:2848)
	at java.net.URI$Parser.parseAuthority(URI.java:3186)
	at java.net.URI$Parser.parseHierarchical(URI.java:3097)
	at java.net.URI$Parser.parse(URI.java:3053)
	at java.net.URI.<init>(URI.java:588)
	at java.net.URI.create(URI.java:850)
	at co.cask.cdap.test.IntegrationTestBase.getClientConfig(IntegrationTestBase.java:314)
(5 more lines...)
Collapse Failed CustomMappingAppAuthorizationTest testRunningFlowAndExploreStreams History
Ambari - HDP 2.6 < 1 sec
java.lang.IllegalArgumentException: Illegal character in authority at index 7: http://${bamboo.ambari-server-ip}:11015
	at java.net.URI$Parser.fail(URI.java:2848)
	at java.net.URI$Parser.parseAuthority(URI.java:3186)
	at java.net.URI$Parser.parseHierarchical(URI.java:3097)
	at java.net.URI$Parser.parse(URI.java:3053)
	at java.net.URI.<init>(URI.java:588)
	at java.net.URI.create(URI.java:850)
	at co.cask.cdap.test.IntegrationTestBase.getClientConfig(IntegrationTestBase.java:314)
(5 more lines...)
Collapse Failed CustomMappingAppAuthorizationTest testDeployAppUnauthorized History
Ambari - HDP 2.6 < 1 sec
java.lang.IllegalArgumentException: Illegal character in authority at index 7: http://${bamboo.ambari-server-ip}:11015
	at java.net.URI$Parser.fail(URI.java:2848)
	at java.net.URI$Parser.parseAuthority(URI.java:3186)
	at java.net.URI$Parser.parseHierarchical(URI.java:3097)
	at java.net.URI$Parser.parse(URI.java:3053)
	at java.net.URI.<init>(URI.java:588)
	at java.net.URI.create(URI.java:850)
	at co.cask.cdap.test.IntegrationTestBase.getClientConfig(IntegrationTestBase.java:314)
(5 more lines...)
Collapse Failed CustomMappingBasicAuthorizationTest testNamespacePrivileges History
Ambari - HDP 2.6 < 1 sec
java.lang.IllegalArgumentException: Illegal character in authority at index 7: http://${bamboo.ambari-server-ip}:11015
	at java.net.URI$Parser.fail(URI.java:2848)
	at java.net.URI$Parser.parseAuthority(URI.java:3186)
	at java.net.URI$Parser.parseHierarchical(URI.java:3097)
	at java.net.URI$Parser.parse(URI.java:3053)
	at java.net.URI.<init>(URI.java:588)
	at java.net.URI.create(URI.java:850)
	at co.cask.cdap.test.IntegrationTestBase.getClientConfig(IntegrationTestBase.java:314)
(5 more lines...)
Collapse Failed CustomMappingBasicAuthorizationTest testStreamPrivileges History
Ambari - HDP 2.6 < 1 sec
java.lang.IllegalArgumentException: Illegal character in authority at index 7: http://${bamboo.ambari-server-ip}:11015
	at java.net.URI$Parser.fail(URI.java:2848)
	at java.net.URI$Parser.parseAuthority(URI.java:3186)
	at java.net.URI$Parser.parseHierarchical(URI.java:3097)
	at java.net.URI$Parser.parse(URI.java:3053)
	at java.net.URI.<init>(URI.java:588)
	at java.net.URI.create(URI.java:850)
	at co.cask.cdap.test.IntegrationTestBase.getClientConfig(IntegrationTestBase.java:314)
(5 more lines...)
Collapse Failed CustomMappingBasicAuthorizationTest testDeleteNamespaceWithDifferentClients History
Ambari - HDP 2.6 < 1 sec
java.lang.IllegalArgumentException: Illegal character in authority at index 7: http://${bamboo.ambari-server-ip}:11015
	at java.net.URI$Parser.fail(URI.java:2848)
	at java.net.URI$Parser.parseAuthority(URI.java:3186)
	at java.net.URI$Parser.parseHierarchical(URI.java:3097)
	at java.net.URI$Parser.parse(URI.java:3053)
	at java.net.URI.<init>(URI.java:588)
	at java.net.URI.create(URI.java:850)
	at co.cask.cdap.test.IntegrationTestBase.getClientConfig(IntegrationTestBase.java:314)
(5 more lines...)
Collapse Failed CustomMappingBasicAuthorizationTest testPrivilegesAndVisibility History
Ambari - HDP 2.6 < 1 sec
java.lang.IllegalArgumentException: Illegal character in authority at index 7: http://${bamboo.ambari-server-ip}:11015
	at java.net.URI$Parser.fail(URI.java:2848)
	at java.net.URI$Parser.parseAuthority(URI.java:3186)
	at java.net.URI$Parser.parseHierarchical(URI.java:3097)
	at java.net.URI$Parser.parse(URI.java:3053)
	at java.net.URI.<init>(URI.java:588)
	at java.net.URI.create(URI.java:850)
	at co.cask.cdap.test.IntegrationTestBase.getClientConfig(IntegrationTestBase.java:314)
(5 more lines...)
Collapse Failed CustomMappingBasicAuthorizationTest testDatasetPrivileges History
Ambari - HDP 2.6 < 1 sec
java.lang.IllegalArgumentException: Illegal character in authority at index 7: http://${bamboo.ambari-server-ip}:11015
	at java.net.URI$Parser.fail(URI.java:2848)
	at java.net.URI$Parser.parseAuthority(URI.java:3186)
	at java.net.URI$Parser.parseHierarchical(URI.java:3097)
	at java.net.URI$Parser.parse(URI.java:3053)
	at java.net.URI.<init>(URI.java:588)
	at java.net.URI.create(URI.java:850)
	at co.cask.cdap.test.IntegrationTestBase.getClientConfig(IntegrationTestBase.java:314)
(5 more lines...)
Collapse Failed NamespaceImpersonationAppAuthorizationTest testDeployApp History
Ambari - HDP 2.6 < 1 sec
java.lang.IllegalArgumentException: Illegal character in authority at index 7: http://${bamboo.ambari-server-ip}:11015
	at java.net.URI$Parser.fail(URI.java:2848)
	at java.net.URI$Parser.parseAuthority(URI.java:3186)
	at java.net.URI$Parser.parseHierarchical(URI.java:3097)
	at java.net.URI$Parser.parse(URI.java:3053)
	at java.net.URI.<init>(URI.java:588)
	at java.net.URI.create(URI.java:850)
	at co.cask.cdap.test.IntegrationTestBase.getClientConfig(IntegrationTestBase.java:314)
(5 more lines...)
Collapse Failed NamespaceImpersonationAppAuthorizationTest testRunningFlowAndExploreStreams History
Ambari - HDP 2.6 < 1 sec
java.lang.IllegalArgumentException: Illegal character in authority at index 7: http://${bamboo.ambari-server-ip}:11015
	at java.net.URI$Parser.fail(URI.java:2848)
	at java.net.URI$Parser.parseAuthority(URI.java:3186)
	at java.net.URI$Parser.parseHierarchical(URI.java:3097)
	at java.net.URI$Parser.parse(URI.java:3053)
	at java.net.URI.<init>(URI.java:588)
	at java.net.URI.create(URI.java:850)
	at co.cask.cdap.test.IntegrationTestBase.getClientConfig(IntegrationTestBase.java:314)
(5 more lines...)
Collapse Failed NamespaceImpersonationAppAuthorizationTest testDeployAppUnauthorized History
Ambari - HDP 2.6 < 1 sec
java.lang.IllegalArgumentException: Illegal character in authority at index 7: http://${bamboo.ambari-server-ip}:11015
	at java.net.URI$Parser.fail(URI.java:2848)
	at java.net.URI$Parser.parseAuthority(URI.java:3186)
	at java.net.URI$Parser.parseHierarchical(URI.java:3097)
	at java.net.URI$Parser.parse(URI.java:3053)
	at java.net.URI.<init>(URI.java:588)
	at java.net.URI.create(URI.java:850)
	at co.cask.cdap.test.IntegrationTestBase.getClientConfig(IntegrationTestBase.java:314)
(5 more lines...)
Collapse Failed NamespaceImpersonationAppAuthorizationTest testDatasetInProgram History
Ambari - HDP 2.6 < 1 sec
java.lang.IllegalArgumentException: Illegal character in authority at index 7: http://${bamboo.ambari-server-ip}:11015
	at java.net.URI$Parser.fail(URI.java:2848)
	at java.net.URI$Parser.parseAuthority(URI.java:3186)
	at java.net.URI$Parser.parseHierarchical(URI.java:3097)
	at java.net.URI$Parser.parse(URI.java:3053)
	at java.net.URI.<init>(URI.java:588)
	at java.net.URI.create(URI.java:850)
	at co.cask.cdap.test.IntegrationTestBase.getClientConfig(IntegrationTestBase.java:314)
(5 more lines...)
Collapse Failed NamespaceImpersonationBasicAuthorizationTest testNamespacePrivileges History
Ambari - HDP 2.6 < 1 sec
java.lang.IllegalArgumentException: Illegal character in authority at index 7: http://${bamboo.ambari-server-ip}:11015
	at java.net.URI$Parser.fail(URI.java:2848)
	at java.net.URI$Parser.parseAuthority(URI.java:3186)
	at java.net.URI$Parser.parseHierarchical(URI.java:3097)
	at java.net.URI$Parser.parse(URI.java:3053)
	at java.net.URI.<init>(URI.java:588)
	at java.net.URI.create(URI.java:850)
	at co.cask.cdap.test.IntegrationTestBase.getClientConfig(IntegrationTestBase.java:314)
(5 more lines...)
Collapse Failed NamespaceImpersonationBasicAuthorizationTest testDeleteNamespaceWithDifferentClients History
Ambari - HDP 2.6 < 1 sec
java.lang.IllegalArgumentException: Illegal character in authority at index 7: http://${bamboo.ambari-server-ip}:11015
	at java.net.URI$Parser.fail(URI.java:2848)
	at java.net.URI$Parser.parseAuthority(URI.java:3186)
	at java.net.URI$Parser.parseHierarchical(URI.java:3097)
	at java.net.URI$Parser.parse(URI.java:3053)
	at java.net.URI.<init>(URI.java:588)
	at java.net.URI.create(URI.java:850)
	at co.cask.cdap.test.IntegrationTestBase.getClientConfig(IntegrationTestBase.java:314)
(5 more lines...)
Collapse Failed NamespaceImpersonationBasicAuthorizationTest testPrivilegesAndVisibility History
Ambari - HDP 2.6 < 1 sec
java.lang.IllegalArgumentException: Illegal character in authority at index 7: http://${bamboo.ambari-server-ip}:11015
	at java.net.URI$Parser.fail(URI.java:2848)
	at java.net.URI$Parser.parseAuthority(URI.java:3186)
	at java.net.URI$Parser.parseHierarchical(URI.java:3097)
	at java.net.URI$Parser.parse(URI.java:3053)
	at java.net.URI.<init>(URI.java:588)
	at java.net.URI.create(URI.java:850)
	at co.cask.cdap.test.IntegrationTestBase.getClientConfig(IntegrationTestBase.java:314)
(5 more lines...)
Collapse Failed NamespaceImpersonationBasicAuthorizationTest testDatasetPrivileges History
Ambari - HDP 2.6 < 1 sec
java.lang.IllegalArgumentException: Illegal character in authority at index 7: http://${bamboo.ambari-server-ip}:11015
	at java.net.URI$Parser.fail(URI.java:2848)
	at java.net.URI$Parser.parseAuthority(URI.java:3186)
	at java.net.URI$Parser.parseHierarchical(URI.java:3097)
	at java.net.URI$Parser.parse(URI.java:3053)
	at java.net.URI.<init>(URI.java:588)
	at java.net.URI.create(URI.java:850)
	at co.cask.cdap.test.IntegrationTestBase.getClientConfig(IntegrationTestBase.java:314)
(5 more lines...)
Collapse Failed NamespaceImpersonationBasicAuthorizationTest testStreamPrivileges History
Ambari - HDP 2.6 < 1 sec
java.lang.IllegalArgumentException: Illegal character in authority at index 7: http://${bamboo.ambari-server-ip}:11015
	at java.net.URI$Parser.fail(URI.java:2848)
	at java.net.URI$Parser.parseAuthority(URI.java:3186)
	at java.net.URI$Parser.parseHierarchical(URI.java:3097)
	at java.net.URI$Parser.parse(URI.java:3053)
	at java.net.URI.<init>(URI.java:588)
	at java.net.URI.create(URI.java:850)
	at co.cask.cdap.test.IntegrationTestBase.getClientConfig(IntegrationTestBase.java:314)
(5 more lines...)
Collapse Failed NamespaceImpersonationBasicAuthorizationTest testCreateNamespaceWithDifferentOwners History
Ambari - HDP 2.6 < 1 sec
java.lang.IllegalArgumentException: Illegal character in authority at index 7: http://${bamboo.ambari-server-ip}:11015
	at java.net.URI$Parser.fail(URI.java:2848)
	at java.net.URI$Parser.parseAuthority(URI.java:3186)
	at java.net.URI$Parser.parseHierarchical(URI.java:3097)
	at java.net.URI$Parser.parse(URI.java:3053)
	at java.net.URI.<init>(URI.java:588)
	at java.net.URI.create(URI.java:850)
	at co.cask.cdap.test.IntegrationTestBase.getClientConfig(IntegrationTestBase.java:314)
(5 more lines...)