Build #1

Build: #1 failed

Job: Ambari - HDP 2.6 failed

Stages & jobs

  1. Variables

  2. Spinup and Test

Job result summary

Completed
Duration
103 minutes
Agent
bamboo-agent03
Revisions
caskdata/cdap-integration-tests
33ca06a919bc191bb2b52d458ad4b6d7ef17737b 33ca06a919bc191bb2b52d458ad4b6d7ef17737b
caskdata/coopr-internal
8c30f34a0a3a4a7388f084f40fda79fc52ae5386 8c30f34a0a3a4a7388f084f40fda79fc52ae5386
Total tests
32

Tests

  • 32 tests in total
  • 32 tests failed
  • 32 failures are new
  • 35 minutes taken in total.
New test failures 32
Status Test Duration
Collapse Failed AppImpersonationAuthorizationTest testDatasetInProgram History
1 min
java.io.IOException: 503: No endpoint strategy found for request GET /v3/config/cdap HTTP/1.1
	at co.cask.cdap.client.util.RESTClient.execute(RESTClient.java:132)
	at co.cask.cdap.client.util.RESTClient.execute(RESTClient.java:74)
	at co.cask.cdap.client.MetaClient.getConfig(MetaClient.java:81)
	at co.cask.cdap.client.MetaClient.getCDAPConfig(MetaClient.java:71)
	at co.cask.cdap.security.AuthorizationTestBase.verifyAndSetUpAuthz(AuthorizationTestBase.java:91)
	at co.cask.cdap.security.AuthorizationTestBase.setUp(AuthorizationTestBase.java:84)
	at sun.reflect.NativeMethodAccessorImpl.invoke0(Native Method)
(34 more lines...)
Collapse Failed AppImpersonationAuthorizationTest testDeployApp History
1 min
java.io.IOException: 503: No endpoint strategy found for request GET /v3/config/cdap HTTP/1.1
	at co.cask.cdap.client.util.RESTClient.execute(RESTClient.java:132)
	at co.cask.cdap.client.util.RESTClient.execute(RESTClient.java:74)
	at co.cask.cdap.client.MetaClient.getConfig(MetaClient.java:81)
	at co.cask.cdap.client.MetaClient.getCDAPConfig(MetaClient.java:71)
	at co.cask.cdap.security.AuthorizationTestBase.verifyAndSetUpAuthz(AuthorizationTestBase.java:91)
	at co.cask.cdap.security.AuthorizationTestBase.setUp(AuthorizationTestBase.java:84)
	at sun.reflect.NativeMethodAccessorImpl.invoke0(Native Method)
(34 more lines...)
Collapse Failed AppImpersonationAuthorizationTest testDeployAppUnauthorized History
1 min
java.io.IOException: 503: No endpoint strategy found for request GET /v3/config/cdap HTTP/1.1
	at co.cask.cdap.client.util.RESTClient.execute(RESTClient.java:132)
	at co.cask.cdap.client.util.RESTClient.execute(RESTClient.java:74)
	at co.cask.cdap.client.MetaClient.getConfig(MetaClient.java:81)
	at co.cask.cdap.client.MetaClient.getCDAPConfig(MetaClient.java:71)
	at co.cask.cdap.security.AuthorizationTestBase.verifyAndSetUpAuthz(AuthorizationTestBase.java:91)
	at co.cask.cdap.security.AuthorizationTestBase.setUp(AuthorizationTestBase.java:84)
	at sun.reflect.NativeMethodAccessorImpl.invoke0(Native Method)
(34 more lines...)
Collapse Failed AppImpersonationAuthorizationTest testRunningFlowAndExploreStreams History
1 min
java.io.IOException: 503: No endpoint strategy found for request GET /v3/config/cdap HTTP/1.1
	at co.cask.cdap.client.util.RESTClient.execute(RESTClient.java:132)
	at co.cask.cdap.client.util.RESTClient.execute(RESTClient.java:74)
	at co.cask.cdap.client.MetaClient.getConfig(MetaClient.java:81)
	at co.cask.cdap.client.MetaClient.getCDAPConfig(MetaClient.java:71)
	at co.cask.cdap.security.AuthorizationTestBase.verifyAndSetUpAuthz(AuthorizationTestBase.java:91)
	at co.cask.cdap.security.AuthorizationTestBase.setUp(AuthorizationTestBase.java:84)
	at sun.reflect.NativeMethodAccessorImpl.invoke0(Native Method)
(34 more lines...)
Collapse Failed BasicAppAuthorizationTest testDatasetInProgram History
1 min
java.io.IOException: 503: No endpoint strategy found for request GET /v3/config/cdap HTTP/1.1
	at co.cask.cdap.client.util.RESTClient.execute(RESTClient.java:132)
	at co.cask.cdap.client.util.RESTClient.execute(RESTClient.java:74)
	at co.cask.cdap.client.MetaClient.getConfig(MetaClient.java:81)
	at co.cask.cdap.client.MetaClient.getCDAPConfig(MetaClient.java:71)
	at co.cask.cdap.security.AuthorizationTestBase.verifyAndSetUpAuthz(AuthorizationTestBase.java:91)
	at co.cask.cdap.security.AuthorizationTestBase.setUp(AuthorizationTestBase.java:84)
	at sun.reflect.NativeMethodAccessorImpl.invoke0(Native Method)
(34 more lines...)
Collapse Failed BasicAppAuthorizationTest testDeployApp History
1 min
java.io.IOException: 503: No endpoint strategy found for request GET /v3/config/cdap HTTP/1.1
	at co.cask.cdap.client.util.RESTClient.execute(RESTClient.java:132)
	at co.cask.cdap.client.util.RESTClient.execute(RESTClient.java:74)
	at co.cask.cdap.client.MetaClient.getConfig(MetaClient.java:81)
	at co.cask.cdap.client.MetaClient.getCDAPConfig(MetaClient.java:71)
	at co.cask.cdap.security.AuthorizationTestBase.verifyAndSetUpAuthz(AuthorizationTestBase.java:91)
	at co.cask.cdap.security.AuthorizationTestBase.setUp(AuthorizationTestBase.java:84)
	at sun.reflect.NativeMethodAccessorImpl.invoke0(Native Method)
(34 more lines...)
Collapse Failed BasicAppAuthorizationTest testDeployAppUnauthorized History
1 min
java.io.IOException: 503: No endpoint strategy found for request GET /v3/config/cdap HTTP/1.1
	at co.cask.cdap.client.util.RESTClient.execute(RESTClient.java:132)
	at co.cask.cdap.client.util.RESTClient.execute(RESTClient.java:74)
	at co.cask.cdap.client.MetaClient.getConfig(MetaClient.java:81)
	at co.cask.cdap.client.MetaClient.getCDAPConfig(MetaClient.java:71)
	at co.cask.cdap.security.AuthorizationTestBase.verifyAndSetUpAuthz(AuthorizationTestBase.java:91)
	at co.cask.cdap.security.AuthorizationTestBase.setUp(AuthorizationTestBase.java:84)
	at sun.reflect.NativeMethodAccessorImpl.invoke0(Native Method)
(34 more lines...)
Collapse Failed BasicAppAuthorizationTest testRunningFlowAndExploreStreams History
1 min
java.io.IOException: 503: No endpoint strategy found for request GET /v3/config/cdap HTTP/1.1
	at co.cask.cdap.client.util.RESTClient.execute(RESTClient.java:132)
	at co.cask.cdap.client.util.RESTClient.execute(RESTClient.java:74)
	at co.cask.cdap.client.MetaClient.getConfig(MetaClient.java:81)
	at co.cask.cdap.client.MetaClient.getCDAPConfig(MetaClient.java:71)
	at co.cask.cdap.security.AuthorizationTestBase.verifyAndSetUpAuthz(AuthorizationTestBase.java:91)
	at co.cask.cdap.security.AuthorizationTestBase.setUp(AuthorizationTestBase.java:84)
	at sun.reflect.NativeMethodAccessorImpl.invoke0(Native Method)
(34 more lines...)
Collapse Failed BasicAuthorizationTest testDatasetPrivileges History
1 min
java.io.IOException: 503: No endpoint strategy found for request GET /v3/config/cdap HTTP/1.1
	at co.cask.cdap.client.util.RESTClient.execute(RESTClient.java:132)
	at co.cask.cdap.client.util.RESTClient.execute(RESTClient.java:74)
	at co.cask.cdap.client.MetaClient.getConfig(MetaClient.java:81)
	at co.cask.cdap.client.MetaClient.getCDAPConfig(MetaClient.java:71)
	at co.cask.cdap.security.AuthorizationTestBase.verifyAndSetUpAuthz(AuthorizationTestBase.java:91)
	at co.cask.cdap.security.AuthorizationTestBase.setUp(AuthorizationTestBase.java:84)
	at sun.reflect.NativeMethodAccessorImpl.invoke0(Native Method)
(34 more lines...)
Collapse Failed BasicAuthorizationTest testDeleteNamespaceWithDifferentClients History
1 min
java.io.IOException: 503: No endpoint strategy found for request GET /v3/config/cdap HTTP/1.1
	at co.cask.cdap.client.util.RESTClient.execute(RESTClient.java:132)
	at co.cask.cdap.client.util.RESTClient.execute(RESTClient.java:74)
	at co.cask.cdap.client.MetaClient.getConfig(MetaClient.java:81)
	at co.cask.cdap.client.MetaClient.getCDAPConfig(MetaClient.java:71)
	at co.cask.cdap.security.AuthorizationTestBase.verifyAndSetUpAuthz(AuthorizationTestBase.java:91)
	at co.cask.cdap.security.AuthorizationTestBase.setUp(AuthorizationTestBase.java:84)
	at sun.reflect.NativeMethodAccessorImpl.invoke0(Native Method)
(34 more lines...)
Collapse Failed BasicAuthorizationTest testNamespacePrivileges History
1 min
java.io.IOException: 503: No endpoint strategy found for request GET /v3/config/cdap HTTP/1.1
	at co.cask.cdap.client.util.RESTClient.execute(RESTClient.java:132)
	at co.cask.cdap.client.util.RESTClient.execute(RESTClient.java:74)
	at co.cask.cdap.client.MetaClient.getConfig(MetaClient.java:81)
	at co.cask.cdap.client.MetaClient.getCDAPConfig(MetaClient.java:71)
	at co.cask.cdap.security.AuthorizationTestBase.verifyAndSetUpAuthz(AuthorizationTestBase.java:91)
	at co.cask.cdap.security.AuthorizationTestBase.setUp(AuthorizationTestBase.java:84)
	at sun.reflect.NativeMethodAccessorImpl.invoke0(Native Method)
(34 more lines...)
Collapse Failed BasicAuthorizationTest testPrivilegesAndVisibility History
1 min
java.io.IOException: 503: No endpoint strategy found for request GET /v3/config/cdap HTTP/1.1
	at co.cask.cdap.client.util.RESTClient.execute(RESTClient.java:132)
	at co.cask.cdap.client.util.RESTClient.execute(RESTClient.java:74)
	at co.cask.cdap.client.MetaClient.getConfig(MetaClient.java:81)
	at co.cask.cdap.client.MetaClient.getCDAPConfig(MetaClient.java:71)
	at co.cask.cdap.security.AuthorizationTestBase.verifyAndSetUpAuthz(AuthorizationTestBase.java:91)
	at co.cask.cdap.security.AuthorizationTestBase.setUp(AuthorizationTestBase.java:84)
	at sun.reflect.NativeMethodAccessorImpl.invoke0(Native Method)
(34 more lines...)
Collapse Failed BasicAuthorizationTest testStreamPrivileges History
1 min
java.io.IOException: 503: No endpoint strategy found for request GET /v3/config/cdap HTTP/1.1
	at co.cask.cdap.client.util.RESTClient.execute(RESTClient.java:132)
	at co.cask.cdap.client.util.RESTClient.execute(RESTClient.java:74)
	at co.cask.cdap.client.MetaClient.getConfig(MetaClient.java:81)
	at co.cask.cdap.client.MetaClient.getCDAPConfig(MetaClient.java:71)
	at co.cask.cdap.security.AuthorizationTestBase.verifyAndSetUpAuthz(AuthorizationTestBase.java:91)
	at co.cask.cdap.security.AuthorizationTestBase.setUp(AuthorizationTestBase.java:84)
	at sun.reflect.NativeMethodAccessorImpl.invoke0(Native Method)
(34 more lines...)
Collapse Failed CustomMappingAppAuthorizationTest testDatasetInProgram History
1 min
java.io.IOException: 503: No endpoint strategy found for request GET /v3/config/cdap HTTP/1.1
	at co.cask.cdap.client.util.RESTClient.execute(RESTClient.java:132)
	at co.cask.cdap.client.util.RESTClient.execute(RESTClient.java:74)
	at co.cask.cdap.client.MetaClient.getConfig(MetaClient.java:81)
	at co.cask.cdap.client.MetaClient.getCDAPConfig(MetaClient.java:71)
	at co.cask.cdap.security.AuthorizationTestBase.verifyAndSetUpAuthz(AuthorizationTestBase.java:91)
	at co.cask.cdap.security.AuthorizationTestBase.setUp(AuthorizationTestBase.java:84)
	at sun.reflect.NativeMethodAccessorImpl.invoke0(Native Method)
(34 more lines...)
Collapse Failed CustomMappingAppAuthorizationTest testDeployApp History
1 min
java.io.IOException: 503: No endpoint strategy found for request GET /v3/config/cdap HTTP/1.1
	at co.cask.cdap.client.util.RESTClient.execute(RESTClient.java:132)
	at co.cask.cdap.client.util.RESTClient.execute(RESTClient.java:74)
	at co.cask.cdap.client.MetaClient.getConfig(MetaClient.java:81)
	at co.cask.cdap.client.MetaClient.getCDAPConfig(MetaClient.java:71)
	at co.cask.cdap.security.AuthorizationTestBase.verifyAndSetUpAuthz(AuthorizationTestBase.java:91)
	at co.cask.cdap.security.AuthorizationTestBase.setUp(AuthorizationTestBase.java:84)
	at sun.reflect.NativeMethodAccessorImpl.invoke0(Native Method)
(34 more lines...)
Collapse Failed CustomMappingAppAuthorizationTest testDeployAppUnauthorized History
1 min
java.io.IOException: 503: No endpoint strategy found for request GET /v3/config/cdap HTTP/1.1
	at co.cask.cdap.client.util.RESTClient.execute(RESTClient.java:132)
	at co.cask.cdap.client.util.RESTClient.execute(RESTClient.java:74)
	at co.cask.cdap.client.MetaClient.getConfig(MetaClient.java:81)
	at co.cask.cdap.client.MetaClient.getCDAPConfig(MetaClient.java:71)
	at co.cask.cdap.security.AuthorizationTestBase.verifyAndSetUpAuthz(AuthorizationTestBase.java:91)
	at co.cask.cdap.security.AuthorizationTestBase.setUp(AuthorizationTestBase.java:84)
	at sun.reflect.NativeMethodAccessorImpl.invoke0(Native Method)
(34 more lines...)
Collapse Failed CustomMappingAppAuthorizationTest testRunningFlowAndExploreStreams History
1 min
java.io.IOException: 503: No endpoint strategy found for request GET /v3/config/cdap HTTP/1.1
	at co.cask.cdap.client.util.RESTClient.execute(RESTClient.java:132)
	at co.cask.cdap.client.util.RESTClient.execute(RESTClient.java:74)
	at co.cask.cdap.client.MetaClient.getConfig(MetaClient.java:81)
	at co.cask.cdap.client.MetaClient.getCDAPConfig(MetaClient.java:71)
	at co.cask.cdap.security.AuthorizationTestBase.verifyAndSetUpAuthz(AuthorizationTestBase.java:91)
	at co.cask.cdap.security.AuthorizationTestBase.setUp(AuthorizationTestBase.java:84)
	at sun.reflect.GeneratedMethodAccessor1.invoke(Unknown Source)
(33 more lines...)
Collapse Failed CustomMappingBasicAuthorizationTest testDatasetPrivileges History
1 min
java.io.IOException: 503: No endpoint strategy found for request GET /v3/config/cdap HTTP/1.1
	at co.cask.cdap.client.util.RESTClient.execute(RESTClient.java:132)
	at co.cask.cdap.client.util.RESTClient.execute(RESTClient.java:74)
	at co.cask.cdap.client.MetaClient.getConfig(MetaClient.java:81)
	at co.cask.cdap.client.MetaClient.getCDAPConfig(MetaClient.java:71)
	at co.cask.cdap.security.AuthorizationTestBase.verifyAndSetUpAuthz(AuthorizationTestBase.java:91)
	at co.cask.cdap.security.AuthorizationTestBase.setUp(AuthorizationTestBase.java:84)
	at sun.reflect.GeneratedMethodAccessor1.invoke(Unknown Source)
(33 more lines...)
Collapse Failed CustomMappingBasicAuthorizationTest testDeleteNamespaceWithDifferentClients History
1 min
java.io.IOException: 503: No endpoint strategy found for request GET /v3/config/cdap HTTP/1.1
	at co.cask.cdap.client.util.RESTClient.execute(RESTClient.java:132)
	at co.cask.cdap.client.util.RESTClient.execute(RESTClient.java:74)
	at co.cask.cdap.client.MetaClient.getConfig(MetaClient.java:81)
	at co.cask.cdap.client.MetaClient.getCDAPConfig(MetaClient.java:71)
	at co.cask.cdap.security.AuthorizationTestBase.verifyAndSetUpAuthz(AuthorizationTestBase.java:91)
	at co.cask.cdap.security.AuthorizationTestBase.setUp(AuthorizationTestBase.java:84)
	at sun.reflect.GeneratedMethodAccessor1.invoke(Unknown Source)
(33 more lines...)
Collapse Failed CustomMappingBasicAuthorizationTest testNamespacePrivileges History
1 min
java.io.IOException: 503: No endpoint strategy found for request GET /v3/config/cdap HTTP/1.1
	at co.cask.cdap.client.util.RESTClient.execute(RESTClient.java:132)
	at co.cask.cdap.client.util.RESTClient.execute(RESTClient.java:74)
	at co.cask.cdap.client.MetaClient.getConfig(MetaClient.java:81)
	at co.cask.cdap.client.MetaClient.getCDAPConfig(MetaClient.java:71)
	at co.cask.cdap.security.AuthorizationTestBase.verifyAndSetUpAuthz(AuthorizationTestBase.java:91)
	at co.cask.cdap.security.AuthorizationTestBase.setUp(AuthorizationTestBase.java:84)
	at sun.reflect.GeneratedMethodAccessor1.invoke(Unknown Source)
(33 more lines...)
Collapse Failed CustomMappingBasicAuthorizationTest testPrivilegesAndVisibility History
1 min
java.io.IOException: 503: No endpoint strategy found for request GET /v3/config/cdap HTTP/1.1
	at co.cask.cdap.client.util.RESTClient.execute(RESTClient.java:132)
	at co.cask.cdap.client.util.RESTClient.execute(RESTClient.java:74)
	at co.cask.cdap.client.MetaClient.getConfig(MetaClient.java:81)
	at co.cask.cdap.client.MetaClient.getCDAPConfig(MetaClient.java:71)
	at co.cask.cdap.security.AuthorizationTestBase.verifyAndSetUpAuthz(AuthorizationTestBase.java:91)
	at co.cask.cdap.security.AuthorizationTestBase.setUp(AuthorizationTestBase.java:84)
	at sun.reflect.GeneratedMethodAccessor1.invoke(Unknown Source)
(33 more lines...)
Collapse Failed CustomMappingBasicAuthorizationTest testStreamPrivileges History
1 min
java.io.IOException: 503: No endpoint strategy found for request GET /v3/config/cdap HTTP/1.1
	at co.cask.cdap.client.util.RESTClient.execute(RESTClient.java:132)
	at co.cask.cdap.client.util.RESTClient.execute(RESTClient.java:74)
	at co.cask.cdap.client.MetaClient.getConfig(MetaClient.java:81)
	at co.cask.cdap.client.MetaClient.getCDAPConfig(MetaClient.java:71)
	at co.cask.cdap.security.AuthorizationTestBase.verifyAndSetUpAuthz(AuthorizationTestBase.java:91)
	at co.cask.cdap.security.AuthorizationTestBase.setUp(AuthorizationTestBase.java:84)
	at sun.reflect.GeneratedMethodAccessor1.invoke(Unknown Source)
(33 more lines...)
Collapse Failed NamespaceImpersonationAppAuthorizationTest testDatasetInProgram History
1 min
java.io.IOException: 503: No endpoint strategy found for request GET /v3/config/cdap HTTP/1.1
	at co.cask.cdap.client.util.RESTClient.execute(RESTClient.java:132)
	at co.cask.cdap.client.util.RESTClient.execute(RESTClient.java:74)
	at co.cask.cdap.client.MetaClient.getConfig(MetaClient.java:81)
	at co.cask.cdap.client.MetaClient.getCDAPConfig(MetaClient.java:71)
	at co.cask.cdap.security.AuthorizationTestBase.verifyAndSetUpAuthz(AuthorizationTestBase.java:91)
	at co.cask.cdap.security.AuthorizationTestBase.setUp(AuthorizationTestBase.java:84)
	at sun.reflect.GeneratedMethodAccessor1.invoke(Unknown Source)
(33 more lines...)
Collapse Failed NamespaceImpersonationAppAuthorizationTest testDeployApp History
1 min
java.io.IOException: 503: No endpoint strategy found for request GET /v3/config/cdap HTTP/1.1
	at co.cask.cdap.client.util.RESTClient.execute(RESTClient.java:132)
	at co.cask.cdap.client.util.RESTClient.execute(RESTClient.java:74)
	at co.cask.cdap.client.MetaClient.getConfig(MetaClient.java:81)
	at co.cask.cdap.client.MetaClient.getCDAPConfig(MetaClient.java:71)
	at co.cask.cdap.security.AuthorizationTestBase.verifyAndSetUpAuthz(AuthorizationTestBase.java:91)
	at co.cask.cdap.security.AuthorizationTestBase.setUp(AuthorizationTestBase.java:84)
	at sun.reflect.GeneratedMethodAccessor1.invoke(Unknown Source)
(33 more lines...)
Collapse Failed NamespaceImpersonationAppAuthorizationTest testDeployAppUnauthorized History
1 min
java.io.IOException: 503: No endpoint strategy found for request GET /v3/config/cdap HTTP/1.1
	at co.cask.cdap.client.util.RESTClient.execute(RESTClient.java:132)
	at co.cask.cdap.client.util.RESTClient.execute(RESTClient.java:74)
	at co.cask.cdap.client.MetaClient.getConfig(MetaClient.java:81)
	at co.cask.cdap.client.MetaClient.getCDAPConfig(MetaClient.java:71)
	at co.cask.cdap.security.AuthorizationTestBase.verifyAndSetUpAuthz(AuthorizationTestBase.java:91)
	at co.cask.cdap.security.AuthorizationTestBase.setUp(AuthorizationTestBase.java:84)
	at sun.reflect.GeneratedMethodAccessor1.invoke(Unknown Source)
(33 more lines...)
Collapse Failed NamespaceImpersonationAppAuthorizationTest testRunningFlowAndExploreStreams History
1 min
java.io.IOException: 503: No endpoint strategy found for request GET /v3/config/cdap HTTP/1.1
	at co.cask.cdap.client.util.RESTClient.execute(RESTClient.java:132)
	at co.cask.cdap.client.util.RESTClient.execute(RESTClient.java:74)
	at co.cask.cdap.client.MetaClient.getConfig(MetaClient.java:81)
	at co.cask.cdap.client.MetaClient.getCDAPConfig(MetaClient.java:71)
	at co.cask.cdap.security.AuthorizationTestBase.verifyAndSetUpAuthz(AuthorizationTestBase.java:91)
	at co.cask.cdap.security.AuthorizationTestBase.setUp(AuthorizationTestBase.java:84)
	at sun.reflect.GeneratedMethodAccessor1.invoke(Unknown Source)
(33 more lines...)
Collapse Failed NamespaceImpersonationBasicAuthorizationTest testCreateNamespaceWithDifferentOwners History
1 min
java.io.IOException: 503: No endpoint strategy found for request GET /v3/config/cdap HTTP/1.1
	at co.cask.cdap.client.util.RESTClient.execute(RESTClient.java:132)
	at co.cask.cdap.client.util.RESTClient.execute(RESTClient.java:74)
	at co.cask.cdap.client.MetaClient.getConfig(MetaClient.java:81)
	at co.cask.cdap.client.MetaClient.getCDAPConfig(MetaClient.java:71)
	at co.cask.cdap.security.AuthorizationTestBase.verifyAndSetUpAuthz(AuthorizationTestBase.java:91)
	at co.cask.cdap.security.AuthorizationTestBase.setUp(AuthorizationTestBase.java:84)
	at sun.reflect.GeneratedMethodAccessor1.invoke(Unknown Source)
(33 more lines...)
Collapse Failed NamespaceImpersonationBasicAuthorizationTest testDatasetPrivileges History
1 min
java.io.IOException: 503: No endpoint strategy found for request GET /v3/config/cdap HTTP/1.1
	at co.cask.cdap.client.util.RESTClient.execute(RESTClient.java:132)
	at co.cask.cdap.client.util.RESTClient.execute(RESTClient.java:74)
	at co.cask.cdap.client.MetaClient.getConfig(MetaClient.java:81)
	at co.cask.cdap.client.MetaClient.getCDAPConfig(MetaClient.java:71)
	at co.cask.cdap.security.AuthorizationTestBase.verifyAndSetUpAuthz(AuthorizationTestBase.java:91)
	at co.cask.cdap.security.AuthorizationTestBase.setUp(AuthorizationTestBase.java:84)
	at sun.reflect.GeneratedMethodAccessor1.invoke(Unknown Source)
(33 more lines...)
Collapse Failed NamespaceImpersonationBasicAuthorizationTest testDeleteNamespaceWithDifferentClients History
1 min
java.io.IOException: 503: No endpoint strategy found for request GET /v3/config/cdap HTTP/1.1
	at co.cask.cdap.client.util.RESTClient.execute(RESTClient.java:132)
	at co.cask.cdap.client.util.RESTClient.execute(RESTClient.java:74)
	at co.cask.cdap.client.MetaClient.getConfig(MetaClient.java:81)
	at co.cask.cdap.client.MetaClient.getCDAPConfig(MetaClient.java:71)
	at co.cask.cdap.security.AuthorizationTestBase.verifyAndSetUpAuthz(AuthorizationTestBase.java:91)
	at co.cask.cdap.security.AuthorizationTestBase.setUp(AuthorizationTestBase.java:84)
	at sun.reflect.GeneratedMethodAccessor1.invoke(Unknown Source)
(33 more lines...)
Collapse Failed NamespaceImpersonationBasicAuthorizationTest testNamespacePrivileges History
1 min
java.io.IOException: 503: No endpoint strategy found for request GET /v3/config/cdap HTTP/1.1
	at co.cask.cdap.client.util.RESTClient.execute(RESTClient.java:132)
	at co.cask.cdap.client.util.RESTClient.execute(RESTClient.java:74)
	at co.cask.cdap.client.MetaClient.getConfig(MetaClient.java:81)
	at co.cask.cdap.client.MetaClient.getCDAPConfig(MetaClient.java:71)
	at co.cask.cdap.security.AuthorizationTestBase.verifyAndSetUpAuthz(AuthorizationTestBase.java:91)
	at co.cask.cdap.security.AuthorizationTestBase.setUp(AuthorizationTestBase.java:84)
	at sun.reflect.GeneratedMethodAccessor1.invoke(Unknown Source)
(33 more lines...)
Collapse Failed NamespaceImpersonationBasicAuthorizationTest testPrivilegesAndVisibility History
1 min
java.io.IOException: 503: No endpoint strategy found for request GET /v3/config/cdap HTTP/1.1
	at co.cask.cdap.client.util.RESTClient.execute(RESTClient.java:132)
	at co.cask.cdap.client.util.RESTClient.execute(RESTClient.java:74)
	at co.cask.cdap.client.MetaClient.getConfig(MetaClient.java:81)
	at co.cask.cdap.client.MetaClient.getCDAPConfig(MetaClient.java:71)
	at co.cask.cdap.security.AuthorizationTestBase.verifyAndSetUpAuthz(AuthorizationTestBase.java:91)
	at co.cask.cdap.security.AuthorizationTestBase.setUp(AuthorizationTestBase.java:84)
	at sun.reflect.GeneratedMethodAccessor1.invoke(Unknown Source)
(33 more lines...)
Collapse Failed NamespaceImpersonationBasicAuthorizationTest testStreamPrivileges History
1 min
java.io.IOException: 503: No endpoint strategy found for request GET /v3/config/cdap HTTP/1.1
	at co.cask.cdap.client.util.RESTClient.execute(RESTClient.java:132)
	at co.cask.cdap.client.util.RESTClient.execute(RESTClient.java:74)
	at co.cask.cdap.client.MetaClient.getConfig(MetaClient.java:81)
	at co.cask.cdap.client.MetaClient.getCDAPConfig(MetaClient.java:71)
	at co.cask.cdap.security.AuthorizationTestBase.verifyAndSetUpAuthz(AuthorizationTestBase.java:91)
	at co.cask.cdap.security.AuthorizationTestBase.setUp(AuthorizationTestBase.java:84)
	at sun.reflect.GeneratedMethodAccessor1.invoke(Unknown Source)
(33 more lines...)

Error summary

The build generated some errors. See the full build log for more details.

Warning: Permanently added '10.210.0.18' (RSA) to the list of known hosts.
Java HotSpot(TM) 64-Bit Server VM warning: ignoring option MaxPermSize=128m; support was removed in 8.0
Warning:  org.apache.xerces.jaxp.SAXParserImpl$JAXPSAXParser: Property 'http://www.oracle.com/xml/jaxp/properties/entityExpansionLimit' is not recognized.
Compiler warnings:
  WARNING:  'org.apache.xerces.jaxp.SAXParserImpl: Property 'http://javax.xml.XMLConstants/property/accessExternalDTD' is not recognized.'
Warning:  org.apache.xerces.parsers.SAXParser: Feature 'http://javax.xml.XMLConstants/feature/secure-processing' is not recognized.
Warning:  org.apache.xerces.parsers.SAXParser: Property 'http://javax.xml.XMLConstants/property/accessExternalDTD' is not recognized.
Warning:  org.apache.xerces.parsers.SAXParser: Property 'http://www.oracle.com/xml/jaxp/properties/entityExpansionLimit' is not recognized.
Warning:  org.apache.xerces.jaxp.SAXParserImpl$JAXPSAXParser: Property 'http://www.oracle.com/xml/jaxp/properties/entityExpansionLimit' is not recognized.
Compiler warnings:
  WARNING:  'org.apache.xerces.jaxp.SAXParserImpl: Property 'http://javax.xml.XMLConstants/property/accessExternalDTD' is not recognized.'
Warning:  org.apache.xerces.parsers.SAXParser: Feature 'http://javax.xml.XMLConstants/feature/secure-processing' is not recognized.
Warning:  org.apache.xerces.parsers.SAXParser: Property 'http://javax.xml.XMLConstants/property/accessExternalDTD' is not recognized.
Warning:  org.apache.xerces.parsers.SAXParser: Property 'http://www.oracle.com/xml/jaxp/properties/entityExpansionLimit' is not recognized.
Warning:  org.apache.xerces.jaxp.SAXParserImpl$JAXPSAXParser: Property 'http://www.oracle.com/xml/jaxp/properties/entityExpansionLimit' is not recognized.
Compiler warnings:
  WARNING:  'org.apache.xerces.jaxp.SAXParserImpl: Property 'http://javax.xml.XMLConstants/property/accessExternalDTD' is not recognized.'
Warning:  org.apache.xerces.parsers.SAXParser: Feature 'http://javax.xml.XMLConstants/feature/secure-processing' is not recognized.
Warning:  org.apache.xerces.parsers.SAXParser: Property 'http://javax.xml.XMLConstants/property/accessExternalDTD' is not recognized.
Warning:  org.apache.xerces.parsers.SAXParser: Property 'http://www.oracle.com/xml/jaxp/properties/entityExpansionLimit' is not recognized.
SLF4J: Class path contains multiple SLF4J bindings.
SLF4J: Found binding in [jar:file:/home/bamboo/.m2/repository/co/cask/cdap/cdap-cli/5.1.0-SNAPSHOT/cdap-cli-5.1.0-SNAPSHOT.jar!/org/slf4j/impl/StaticLoggerBinder.class]
SLF4J: Found binding in [jar:file:/home/bamboo/.m2/repository/co/cask/cdap/cdap-explore-jdbc/5.1.0-SNAPSHOT/cdap-explore-jdbc-5.1.0-SNAPSHOT.jar!/org/slf4j/impl/StaticLoggerBinder.class]
SLF4J: Found binding in [jar:file:/home/bamboo/.m2/repository/ch/qos/logback/logback-classic/1.0.9/logback-classic-1.0.9.jar!/org/slf4j/impl/StaticLoggerBinder.class]
SLF4J: See http://www.slf4j.org/codes.html#multiple_bindings for an explanation.
SLF4J: Actual binding is of type [ch.qos.logback.classic.util.ContextSelectorStaticBinder]