Build #12

Build: #12 failed Manual run by Rohit Sinha

Stages & jobs

  1. Variables

  2. Spinup and Test

Logs

The following logs have been generated by the jobs in this plan.
  • Expand all
  • Collapse all
Job Logs
Collapse Ambari - HDP 2.6 Spinup and Test Download or View
14-Dec-2018 09:46:13 [INFO] integration-test-core ............................. SUCCESS [4.822s]
14-Dec-2018 09:46:13 [INFO] integration-test-remote ........................... FAILURE [35:42.185s]
14-Dec-2018 09:46:13 [INFO] integration-test-standalone ....................... SKIPPED
14-Dec-2018 09:46:13 [INFO] upgrade-test ...................................... SKIPPED
14-Dec-2018 09:46:13 [INFO] long-running-test ................................. SKIPPED
14-Dec-2018 09:46:13 [INFO] ------------------------------------------------------------------------
14-Dec-2018 09:46:13 [INFO] BUILD FAILURE
14-Dec-2018 09:46:13 [INFO] ------------------------------------------------------------------------
14-Dec-2018 09:46:13 [INFO] Total time: 36:08.785s
14-Dec-2018 09:46:13 [INFO] Finished at: Fri Dec 14 09:46:13 UTC 2018
14-Dec-2018 09:46:14 [INFO] Final Memory: 113M/987M
14-Dec-2018 09:46:14 [INFO] ------------------------------------------------------------------------
14-Dec-2018 09:46:14 [ERROR] Failed to execute goal org.apache.maven.plugins:maven-surefire-plugin:2.18.1:test (default-test) on project integration-test-remote: There are test failures.
14-Dec-2018 09:46:14 [ERROR]
14-Dec-2018 09:46:14 [ERROR] Please refer to /var/bamboo/xml-data/build-dir/IT-ITNAMBAUTH-AMBH26/cdap-integration-tests/integration-test-remote/target/surefire-reports for the individual test results.
14-Dec-2018 09:46:14 [ERROR] -> [Help 1]
14-Dec-2018 09:46:14 [ERROR]
14-Dec-2018 09:46:14 [ERROR] To see the full stack trace of the errors, re-run Maven with the -e switch.
14-Dec-2018 09:46:14 [ERROR] Re-run Maven using the -X switch to enable full debug logging.
14-Dec-2018 09:46:14 [ERROR]
14-Dec-2018 09:46:14 [ERROR] For more information about the errors and possible solutions, please read the following articles:
14-Dec-2018 09:46:14 [ERROR] [Help 1] http://cwiki.apache.org/confluence/display/MAVEN/MojoFailureException
14-Dec-2018 09:46:14 [ERROR]
14-Dec-2018 09:46:14 [ERROR] After correcting the problems, you can resume the build with the command
14-Dec-2018 09:46:14 [ERROR]   mvn <goals> -rf :integration-test-remote