Build #29

Build: #29 failed

Job: Distro Tests - CDH 5.9 failed

Test results

  • 64 tests in total
  • 3 tests failed
  • 3 failures are new
  • 211 minutes taken in total.

Build 29 has the following 3 errors: 3 new failure(s) occurred since the previous build.

New test failures 3
Status Test Duration
Collapse Failed XMLReaderTest testInvalidNodePathWithMoveAction History
2 mins
java.util.concurrent.TimeoutException: Timeout occurred. Expected STOPPED but found RUNNING.
	at co.cask.cdap.common.utils.Tasks.waitFor(Tasks.java:70)
	at co.cask.cdap.common.utils.Tasks.waitFor(Tasks.java:91)
	at co.cask.cdap.client.ProgramClient.waitForStatus(ProgramClient.java:490)
	at co.cask.cdap.client.ProgramClient.stopAll(ProgramClient.java:371)
	at co.cask.cdap.test.IntegrationTestBase.doClear(IntegrationTestBase.java:413)
	at co.cask.cdap.test.IntegrationTestBase.setUp(IntegrationTestBase.java:111)
	at sun.reflect.GeneratedMethodAccessor2.invoke(Unknown Source)
(33 more lines...)
Collapse Failed XMLReaderTest testPatternWithDeleteAction History
6 mins
java.util.concurrent.TimeoutException: Timeout occurred. Expected true but found false.
	at co.cask.cdap.common.utils.Tasks.waitFor(Tasks.java:70)
	at co.cask.cdap.common.utils.Tasks.waitFor(Tasks.java:91)
	at co.cask.cdap.common.utils.Tasks.waitFor(Tasks.java:130)
	at co.cask.cdap.test.AbstractProgramManager.waitForRuns(AbstractProgramManager.java:90)
	at co.cask.cdap.test.AbstractProgramManager.waitForRun(AbstractProgramManager.java:84)
	at co.cask.cdap.app.etl.batch.XMLReaderTest.startWorkFlow(XMLReaderTest.java:151)
	at co.cask.cdap.app.etl.batch.XMLReaderTest.testPatternWithDeleteAction(XMLReaderTest.java:354)
Collapse Failed XMLReaderTest testPreProcessingRequired History
2 mins
java.util.concurrent.TimeoutException: Timeout occurred. Expected STOPPED but found RUNNING.
	at co.cask.cdap.common.utils.Tasks.waitFor(Tasks.java:70)
	at co.cask.cdap.common.utils.Tasks.waitFor(Tasks.java:91)
	at co.cask.cdap.client.ProgramClient.waitForStatus(ProgramClient.java:490)
	at co.cask.cdap.client.ProgramClient.stopAll(ProgramClient.java:371)
	at co.cask.cdap.test.IntegrationTestBase.doClear(IntegrationTestBase.java:413)
	at co.cask.cdap.test.IntegrationTestBase.setUp(IntegrationTestBase.java:111)
	at sun.reflect.GeneratedMethodAccessor2.invoke(Unknown Source)
(33 more lines...)