Build #29

Build: #29 failed

Job: Distro Tests - CDH 5.9 failed

Job result summary

Completed
Duration
319 minutes
Agent
bamboo-agent02
Revision
df613f36352f3acf50b029372a3492e16e4d0175 df613f36352f3acf50b029372a3492e16e4d0175
Total tests
64
Failing since
#28 (Scheduled – )
Fixed in
#30 (Rebuilt by Yaojie Feng)

Tests

  • 64 tests in total
  • 3 tests failed
  • 3 failures are new
  • 211 minutes taken in total.
New test failures 3
Status Test Duration
Collapse Failed XMLReaderTest testInvalidNodePathWithMoveAction History
2 mins
java.util.concurrent.TimeoutException: Timeout occurred. Expected STOPPED but found RUNNING.
	at co.cask.cdap.common.utils.Tasks.waitFor(Tasks.java:70)
	at co.cask.cdap.common.utils.Tasks.waitFor(Tasks.java:91)
	at co.cask.cdap.client.ProgramClient.waitForStatus(ProgramClient.java:490)
	at co.cask.cdap.client.ProgramClient.stopAll(ProgramClient.java:371)
	at co.cask.cdap.test.IntegrationTestBase.doClear(IntegrationTestBase.java:413)
	at co.cask.cdap.test.IntegrationTestBase.setUp(IntegrationTestBase.java:111)
	at sun.reflect.GeneratedMethodAccessor2.invoke(Unknown Source)
(33 more lines...)
Collapse Failed XMLReaderTest testPatternWithDeleteAction History
6 mins
java.util.concurrent.TimeoutException: Timeout occurred. Expected true but found false.
	at co.cask.cdap.common.utils.Tasks.waitFor(Tasks.java:70)
	at co.cask.cdap.common.utils.Tasks.waitFor(Tasks.java:91)
	at co.cask.cdap.common.utils.Tasks.waitFor(Tasks.java:130)
	at co.cask.cdap.test.AbstractProgramManager.waitForRuns(AbstractProgramManager.java:90)
	at co.cask.cdap.test.AbstractProgramManager.waitForRun(AbstractProgramManager.java:84)
	at co.cask.cdap.app.etl.batch.XMLReaderTest.startWorkFlow(XMLReaderTest.java:151)
	at co.cask.cdap.app.etl.batch.XMLReaderTest.testPatternWithDeleteAction(XMLReaderTest.java:354)
Collapse Failed XMLReaderTest testPreProcessingRequired History
2 mins
java.util.concurrent.TimeoutException: Timeout occurred. Expected STOPPED but found RUNNING.
	at co.cask.cdap.common.utils.Tasks.waitFor(Tasks.java:70)
	at co.cask.cdap.common.utils.Tasks.waitFor(Tasks.java:91)
	at co.cask.cdap.client.ProgramClient.waitForStatus(ProgramClient.java:490)
	at co.cask.cdap.client.ProgramClient.stopAll(ProgramClient.java:371)
	at co.cask.cdap.test.IntegrationTestBase.doClear(IntegrationTestBase.java:413)
	at co.cask.cdap.test.IntegrationTestBase.setUp(IntegrationTestBase.java:111)
	at sun.reflect.GeneratedMethodAccessor2.invoke(Unknown Source)
(33 more lines...)

Error summary

The build generated some errors. See the full build log for more details.

Java HotSpot(TM) 64-Bit Server VM warning: ignoring option MaxPermSize=128m; support was removed in 8.0
Warning:  org.apache.xerces.jaxp.SAXParserImpl$JAXPSAXParser: Property 'http://www.oracle.com/xml/jaxp/properties/entityExpansionLimit' is not recognized.
Compiler warnings:
  WARNING:  'org.apache.xerces.jaxp.SAXParserImpl: Property 'http://javax.xml.XMLConstants/property/accessExternalDTD' is not recognized.'
Warning:  org.apache.xerces.parsers.SAXParser: Feature 'http://javax.xml.XMLConstants/feature/secure-processing' is not recognized.
Warning:  org.apache.xerces.parsers.SAXParser: Property 'http://javax.xml.XMLConstants/property/accessExternalDTD' is not recognized.
Warning:  org.apache.xerces.parsers.SAXParser: Property 'http://www.oracle.com/xml/jaxp/properties/entityExpansionLimit' is not recognized.
Warning:  org.apache.xerces.jaxp.SAXParserImpl$JAXPSAXParser: Property 'http://www.oracle.com/xml/jaxp/properties/entityExpansionLimit' is not recognized.
Compiler warnings:
  WARNING:  'org.apache.xerces.jaxp.SAXParserImpl: Property 'http://javax.xml.XMLConstants/property/accessExternalDTD' is not recognized.'
Warning:  org.apache.xerces.parsers.SAXParser: Feature 'http://javax.xml.XMLConstants/feature/secure-processing' is not recognized.
Warning:  org.apache.xerces.parsers.SAXParser: Property 'http://javax.xml.XMLConstants/property/accessExternalDTD' is not recognized.
Warning:  org.apache.xerces.parsers.SAXParser: Property 'http://www.oracle.com/xml/jaxp/properties/entityExpansionLimit' is not recognized.
Warning:  org.apache.xerces.jaxp.SAXParserImpl$JAXPSAXParser: Property 'http://www.oracle.com/xml/jaxp/properties/entityExpansionLimit' is not recognized.
Compiler warnings:
  WARNING:  'org.apache.xerces.jaxp.SAXParserImpl: Property 'http://javax.xml.XMLConstants/property/accessExternalDTD' is not recognized.'
Warning:  org.apache.xerces.parsers.SAXParser: Feature 'http://javax.xml.XMLConstants/feature/secure-processing' is not recognized.
Warning:  org.apache.xerces.parsers.SAXParser: Property 'http://javax.xml.XMLConstants/property/accessExternalDTD' is not recognized.
Warning:  org.apache.xerces.parsers.SAXParser: Property 'http://www.oracle.com/xml/jaxp/properties/entityExpansionLimit' is not recognized.
SLF4J: Class path contains multiple SLF4J bindings.
SLF4J: Found binding in [jar:file:/home/bamboo/.m2/repository/co/cask/cdap/cdap-cli/4.3.2/cdap-cli-4.3.2.jar!/org/slf4j/impl/StaticLoggerBinder.class]
SLF4J: Found binding in [jar:file:/home/bamboo/.m2/repository/co/cask/cdap/cdap-explore-jdbc/4.3.2/cdap-explore-jdbc-4.3.2.jar!/org/slf4j/impl/StaticLoggerBinder.class]
SLF4J: Found binding in [jar:file:/home/bamboo/.m2/repository/ch/qos/logback/logback-classic/1.0.9/logback-classic-1.0.9.jar!/org/slf4j/impl/StaticLoggerBinder.class]
SLF4J: See http://www.slf4j.org/codes.html#multiple_bindings for an explanation.
SLF4J: Actual binding is of type [ch.qos.logback.classic.util.ContextSelectorStaticBinder]