Build #29

Build: #29 failed

Job: Distro Tests - CDH 5.14 failed

Build log

The build generated 105,994 lines of output.The output is too long and has been truncated to the last 1,000 lines. Download or view full build log

11-Nov-2018 11:34:27 2018-11-11 11:34:27,581 - INFO  [main:c.c.c.t.AudiTestBase$1@134] - Received response: [200] Response Body: []
11-Nov-2018 11:34:27 2018-11-11 11:34:27,632 - INFO  [main:c.c.c.t.AudiTestBase$1@125] - Making request: GET http://10.210.0.45:11015/v3/namespaces/default/apps/XMLInvalidNodePathTest/versions/-SNAPSHOT/workflows/DataPipelineWorkflow/runs?status=COMPLETED&start=0&end=9223372036854775807&limit=2147483647
11-Nov-2018 11:34:27 2018-11-11 11:34:27,724 - INFO  [main:c.c.c.t.AudiTestBase$1@134] - Received response: [200] Response Body: []
11-Nov-2018 11:34:27 2018-11-11 11:34:27,774 - INFO  [main:c.c.c.t.AudiTestBase$1@125] - Making request: GET http://10.210.0.45:11015/v3/namespaces/default/apps/XMLInvalidNodePathTest/versions/-SNAPSHOT/workflows/DataPipelineWorkflow/runs?status=COMPLETED&start=0&end=9223372036854775807&limit=2147483647
11-Nov-2018 11:34:27 2018-11-11 11:34:27,866 - INFO  [main:c.c.c.t.AudiTestBase$1@134] - Received response: [200] Response Body: []
11-Nov-2018 11:34:27 2018-11-11 11:34:27,917 - INFO  [main:c.c.c.t.AudiTestBase$1@125] - Making request: GET http://10.210.0.45:11015/v3/namespaces/default/apps/XMLInvalidNodePathTest/versions/-SNAPSHOT/workflows/DataPipelineWorkflow/runs?status=COMPLETED&start=0&end=9223372036854775807&limit=2147483647
11-Nov-2018 11:34:28 2018-11-11 11:34:28,007 - INFO  [main:c.c.c.t.AudiTestBase$1@134] - Received response: [200] Response Body: []
11-Nov-2018 11:34:28 2018-11-11 11:34:28,058 - INFO  [main:c.c.c.t.AudiTestBase$1@125] - Making request: GET http://10.210.0.45:11015/v3/namespaces/default/apps/XMLInvalidNodePathTest/versions/-SNAPSHOT/workflows/DataPipelineWorkflow/runs?status=COMPLETED&start=0&end=9223372036854775807&limit=2147483647
11-Nov-2018 11:34:28 2018-11-11 11:34:28,147 - INFO  [main:c.c.c.t.AudiTestBase$1@134] - Received response: [200] Response Body: []
11-Nov-2018 11:34:28 2018-11-11 11:34:28,198 - INFO  [main:c.c.c.t.AudiTestBase$1@125] - Making request: GET http://10.210.0.45:11015/v3/namespaces/default/apps/XMLInvalidNodePathTest/versions/-SNAPSHOT/workflows/DataPipelineWorkflow/runs?status=COMPLETED&start=0&end=9223372036854775807&limit=2147483647
11-Nov-2018 11:34:28 2018-11-11 11:34:28,289 - INFO  [main:c.c.c.t.AudiTestBase$1@134] - Received response: [200] Response Body: []
11-Nov-2018 11:34:28 2018-11-11 11:34:28,340 - INFO  [main:c.c.c.t.AudiTestBase$1@125] - Making request: GET http://10.210.0.45:11015/v3/namespaces/default/apps/XMLInvalidNodePathTest/versions/-SNAPSHOT/workflows/DataPipelineWorkflow/runs?status=COMPLETED&start=0&end=9223372036854775807&limit=2147483647
11-Nov-2018 11:34:28 2018-11-11 11:34:28,431 - INFO  [main:c.c.c.t.AudiTestBase$1@134] - Received response: [200] Response Body: []
11-Nov-2018 11:34:28 2018-11-11 11:34:28,481 - INFO  [main:c.c.c.t.AudiTestBase$1@125] - Making request: GET http://10.210.0.45:11015/v3/namespaces/default/apps/XMLInvalidNodePathTest/versions/-SNAPSHOT/workflows/DataPipelineWorkflow/runs?status=COMPLETED&start=0&end=9223372036854775807&limit=2147483647
11-Nov-2018 11:34:28 2018-11-11 11:34:28,578 - INFO  [main:c.c.c.t.AudiTestBase$1@134] - Received response: [200] Response Body: []
11-Nov-2018 11:34:28 2018-11-11 11:34:28,628 - INFO  [main:c.c.c.t.AudiTestBase$1@125] - Making request: GET http://10.210.0.45:11015/v3/namespaces/default/apps/XMLInvalidNodePathTest/versions/-SNAPSHOT/workflows/DataPipelineWorkflow/runs?status=COMPLETED&start=0&end=9223372036854775807&limit=2147483647
11-Nov-2018 11:34:28 2018-11-11 11:34:28,717 - INFO  [main:c.c.c.t.AudiTestBase$1@134] - Received response: [200] Response Body: []
11-Nov-2018 11:34:28 2018-11-11 11:34:28,768 - INFO  [main:c.c.c.t.AudiTestBase$1@125] - Making request: GET http://10.210.0.45:11015/v3/namespaces/default/apps/XMLInvalidNodePathTest/versions/-SNAPSHOT/workflows/DataPipelineWorkflow/runs?status=COMPLETED&start=0&end=9223372036854775807&limit=2147483647
11-Nov-2018 11:34:28 2018-11-11 11:34:28,863 - INFO  [main:c.c.c.t.AudiTestBase$1@134] - Received response: [200] Response Body: []
11-Nov-2018 11:34:28 2018-11-11 11:34:28,913 - INFO  [main:c.c.c.t.AudiTestBase$1@125] - Making request: GET http://10.210.0.45:11015/v3/namespaces/default/apps/XMLInvalidNodePathTest/versions/-SNAPSHOT/workflows/DataPipelineWorkflow/runs?status=COMPLETED&start=0&end=9223372036854775807&limit=2147483647
11-Nov-2018 11:34:29 2018-11-11 11:34:29,003 - INFO  [main:c.c.c.t.AudiTestBase$1@134] - Received response: [200] Response Body: []
11-Nov-2018 11:34:29 2018-11-11 11:34:29,054 - INFO  [main:c.c.c.t.AudiTestBase$1@125] - Making request: GET http://10.210.0.45:11015/v3/namespaces/default/apps/XMLInvalidNodePathTest/versions/-SNAPSHOT/workflows/DataPipelineWorkflow/runs?status=COMPLETED&start=0&end=9223372036854775807&limit=2147483647
11-Nov-2018 11:34:29 2018-11-11 11:34:29,144 - INFO  [main:c.c.c.t.AudiTestBase$1@134] - Received response: [200] Response Body: []
11-Nov-2018 11:34:29 2018-11-11 11:34:29,194 - INFO  [main:c.c.c.t.AudiTestBase$1@125] - Making request: GET http://10.210.0.45:11015/v3/namespaces/default/apps/XMLInvalidNodePathTest/versions/-SNAPSHOT/workflows/DataPipelineWorkflow/runs?status=COMPLETED&start=0&end=9223372036854775807&limit=2147483647
11-Nov-2018 11:34:29 2018-11-11 11:34:29,284 - INFO  [main:c.c.c.t.AudiTestBase$1@134] - Received response: [200] Response Body: []
11-Nov-2018 11:34:29 2018-11-11 11:34:29,335 - INFO  [main:c.c.c.t.AudiTestBase$1@125] - Making request: GET http://10.210.0.45:11015/v3/namespaces/default/apps/XMLInvalidNodePathTest/versions/-SNAPSHOT/workflows/DataPipelineWorkflow/runs?status=COMPLETED&start=0&end=9223372036854775807&limit=2147483647
11-Nov-2018 11:34:29 2018-11-11 11:34:29,426 - INFO  [main:c.c.c.t.AudiTestBase$1@134] - Received response: [200] Response Body: []
11-Nov-2018 11:34:29 2018-11-11 11:34:29,477 - INFO  [main:c.c.c.t.AudiTestBase$1@125] - Making request: GET http://10.210.0.45:11015/v3/namespaces/default/apps/XMLInvalidNodePathTest/versions/-SNAPSHOT/workflows/DataPipelineWorkflow/runs?status=COMPLETED&start=0&end=9223372036854775807&limit=2147483647
11-Nov-2018 11:34:29 2018-11-11 11:34:29,566 - INFO  [main:c.c.c.t.AudiTestBase$1@134] - Received response: [200] Response Body: []
11-Nov-2018 11:34:29 2018-11-11 11:34:29,617 - INFO  [main:c.c.c.t.AudiTestBase$1@125] - Making request: GET http://10.210.0.45:11015/v3/namespaces/default/apps/XMLInvalidNodePathTest/versions/-SNAPSHOT/workflows/DataPipelineWorkflow/runs?status=COMPLETED&start=0&end=9223372036854775807&limit=2147483647
11-Nov-2018 11:34:29 2018-11-11 11:34:29,707 - INFO  [main:c.c.c.t.AudiTestBase$1@134] - Received response: [200] Response Body: []
11-Nov-2018 11:34:29 2018-11-11 11:34:29,758 - INFO  [main:c.c.c.t.AudiTestBase$1@125] - Making request: GET http://10.210.0.45:11015/v3/namespaces/default/apps/XMLInvalidNodePathTest/versions/-SNAPSHOT/workflows/DataPipelineWorkflow/runs?status=COMPLETED&start=0&end=9223372036854775807&limit=2147483647
11-Nov-2018 11:34:29 2018-11-11 11:34:29,849 - INFO  [main:c.c.c.t.AudiTestBase$1@134] - Received response: [200] Response Body: []
11-Nov-2018 11:34:29 2018-11-11 11:34:29,900 - INFO  [main:c.c.c.t.AudiTestBase$1@125] - Making request: GET http://10.210.0.45:11015/v3/namespaces/default/apps/XMLInvalidNodePathTest/versions/-SNAPSHOT/workflows/DataPipelineWorkflow/runs?status=COMPLETED&start=0&end=9223372036854775807&limit=2147483647
11-Nov-2018 11:34:29 2018-11-11 11:34:29,990 - INFO  [main:c.c.c.t.AudiTestBase$1@134] - Received response: [200] Response Body: []
11-Nov-2018 11:34:30 2018-11-11 11:34:30,040 - INFO  [main:c.c.c.t.AudiTestBase$1@125] - Making request: GET http://10.210.0.45:11015/v3/namespaces/default/apps/XMLInvalidNodePathTest/versions/-SNAPSHOT/workflows/DataPipelineWorkflow/runs?status=COMPLETED&start=0&end=9223372036854775807&limit=2147483647
11-Nov-2018 11:34:30 2018-11-11 11:34:30,131 - INFO  [main:c.c.c.t.AudiTestBase$1@134] - Received response: [200] Response Body: []
11-Nov-2018 11:34:30 2018-11-11 11:34:30,182 - INFO  [main:c.c.c.t.AudiTestBase$1@125] - Making request: GET http://10.210.0.45:11015/v3/namespaces/default/apps/XMLInvalidNodePathTest/versions/-SNAPSHOT/workflows/DataPipelineWorkflow/runs?status=COMPLETED&start=0&end=9223372036854775807&limit=2147483647
11-Nov-2018 11:34:30 2018-11-11 11:34:30,272 - INFO  [main:c.c.c.t.AudiTestBase$1@134] - Received response: [200] Response Body: []
11-Nov-2018 11:34:30 2018-11-11 11:34:30,322 - INFO  [main:c.c.c.t.AudiTestBase$1@125] - Making request: GET http://10.210.0.45:11015/v3/namespaces/default/apps/XMLInvalidNodePathTest/versions/-SNAPSHOT/workflows/DataPipelineWorkflow/runs?status=COMPLETED&start=0&end=9223372036854775807&limit=2147483647
11-Nov-2018 11:34:30 2018-11-11 11:34:30,412 - INFO  [main:c.c.c.t.AudiTestBase$1@134] - Received response: [200] Response Body: []
11-Nov-2018 11:34:30 2018-11-11 11:34:30,462 - INFO  [main:c.c.c.t.AudiTestBase$1@125] - Making request: GET http://10.210.0.45:11015/v3/namespaces/default/apps/XMLInvalidNodePathTest/versions/-SNAPSHOT/workflows/DataPipelineWorkflow/runs?status=COMPLETED&start=0&end=9223372036854775807&limit=2147483647
11-Nov-2018 11:34:30 2018-11-11 11:34:30,552 - INFO  [main:c.c.c.t.AudiTestBase$1@134] - Received response: [200] Response Body: []
11-Nov-2018 11:34:30 2018-11-11 11:34:30,602 - INFO  [main:c.c.c.t.AudiTestBase$1@125] - Making request: GET http://10.210.0.45:11015/v3/namespaces/default/apps/XMLInvalidNodePathTest/versions/-SNAPSHOT/workflows/DataPipelineWorkflow/runs?status=COMPLETED&start=0&end=9223372036854775807&limit=2147483647
11-Nov-2018 11:34:30 2018-11-11 11:34:30,693 - INFO  [main:c.c.c.t.AudiTestBase$1@134] - Received response: [200] Response Body: []
11-Nov-2018 11:34:30 2018-11-11 11:34:30,743 - INFO  [main:c.c.c.t.AudiTestBase$1@125] - Making request: GET http://10.210.0.45:11015/v3/namespaces/default/apps/XMLInvalidNodePathTest/versions/-SNAPSHOT/workflows/DataPipelineWorkflow/runs?status=COMPLETED&start=0&end=9223372036854775807&limit=2147483647
11-Nov-2018 11:34:30 2018-11-11 11:34:30,836 - INFO  [main:c.c.c.t.AudiTestBase$1@134] - Received response: [200] Response Body: []
11-Nov-2018 11:34:30 2018-11-11 11:34:30,887 - INFO  [main:c.c.c.t.AudiTestBase$1@125] - Making request: GET http://10.210.0.45:11015/v3/namespaces/default/apps/XMLInvalidNodePathTest/versions/-SNAPSHOT/workflows/DataPipelineWorkflow/runs?status=COMPLETED&start=0&end=9223372036854775807&limit=2147483647
11-Nov-2018 11:34:30 2018-11-11 11:34:30,976 - INFO  [main:c.c.c.t.AudiTestBase$1@134] - Received response: [200] Response Body: []
11-Nov-2018 11:34:31 2018-11-11 11:34:31,026 - INFO  [main:c.c.c.t.AudiTestBase$1@125] - Making request: GET http://10.210.0.45:11015/v3/namespaces/default/apps/XMLInvalidNodePathTest/versions/-SNAPSHOT/workflows/DataPipelineWorkflow/runs?status=COMPLETED&start=0&end=9223372036854775807&limit=2147483647
11-Nov-2018 11:34:31 2018-11-11 11:34:31,116 - INFO  [main:c.c.c.t.AudiTestBase$1@134] - Received response: [200] Response Body: []
11-Nov-2018 11:34:31 2018-11-11 11:34:31,167 - INFO  [main:c.c.c.t.AudiTestBase$1@125] - Making request: GET http://10.210.0.45:11015/v3/namespaces/default/apps/XMLInvalidNodePathTest/versions/-SNAPSHOT/workflows/DataPipelineWorkflow/runs?status=COMPLETED&start=0&end=9223372036854775807&limit=2147483647
11-Nov-2018 11:34:31 2018-11-11 11:34:31,256 - INFO  [main:c.c.c.t.AudiTestBase$1@134] - Received response: [200] Response Body: []
11-Nov-2018 11:34:31 2018-11-11 11:34:31,307 - INFO  [main:c.c.c.t.AudiTestBase$1@125] - Making request: GET http://10.210.0.45:11015/v3/namespaces/default/apps/XMLInvalidNodePathTest/versions/-SNAPSHOT/workflows/DataPipelineWorkflow/runs?status=COMPLETED&start=0&end=9223372036854775807&limit=2147483647
11-Nov-2018 11:34:31 2018-11-11 11:34:31,396 - INFO  [main:c.c.c.t.AudiTestBase$1@134] - Received response: [200] Response Body: []
11-Nov-2018 11:34:31 2018-11-11 11:34:31,447 - INFO  [main:c.c.c.t.AudiTestBase$1@125] - Making request: GET http://10.210.0.45:11015/v3/namespaces/default/apps/XMLInvalidNodePathTest/versions/-SNAPSHOT/workflows/DataPipelineWorkflow/runs?status=COMPLETED&start=0&end=9223372036854775807&limit=2147483647
11-Nov-2018 11:34:31 2018-11-11 11:34:31,539 - INFO  [main:c.c.c.t.AudiTestBase$1@134] - Received response: [200] Response Body: []
11-Nov-2018 11:34:31 2018-11-11 11:34:31,590 - INFO  [main:c.c.c.t.AudiTestBase$1@125] - Making request: GET http://10.210.0.45:11015/v3/namespaces/default/apps/XMLInvalidNodePathTest/versions/-SNAPSHOT/workflows/DataPipelineWorkflow/runs?status=COMPLETED&start=0&end=9223372036854775807&limit=2147483647
11-Nov-2018 11:34:31 2018-11-11 11:34:31,678 - INFO  [main:c.c.c.t.AudiTestBase$1@134] - Received response: [200] Response Body: []
11-Nov-2018 11:34:31 2018-11-11 11:34:31,729 - INFO  [main:c.c.c.t.AudiTestBase$1@125] - Making request: GET http://10.210.0.45:11015/v3/namespaces/default/apps/XMLInvalidNodePathTest/versions/-SNAPSHOT/workflows/DataPipelineWorkflow/runs?status=COMPLETED&start=0&end=9223372036854775807&limit=2147483647
11-Nov-2018 11:34:31 2018-11-11 11:34:31,819 - INFO  [main:c.c.c.t.AudiTestBase$1@134] - Received response: [200] Response Body: []
11-Nov-2018 11:34:31 2018-11-11 11:34:31,870 - INFO  [main:c.c.c.t.AudiTestBase$1@125] - Making request: GET http://10.210.0.45:11015/v3/namespaces/default/apps/XMLInvalidNodePathTest/versions/-SNAPSHOT/workflows/DataPipelineWorkflow/runs?status=COMPLETED&start=0&end=9223372036854775807&limit=2147483647
11-Nov-2018 11:34:31 2018-11-11 11:34:31,959 - INFO  [main:c.c.c.t.AudiTestBase$1@134] - Received response: [200] Response Body: []
11-Nov-2018 11:34:32 2018-11-11 11:34:32,009 - INFO  [main:c.c.c.t.AudiTestBase$1@125] - Making request: GET http://10.210.0.45:11015/v3/namespaces/default/apps/XMLInvalidNodePathTest/versions/-SNAPSHOT/workflows/DataPipelineWorkflow/runs?status=COMPLETED&start=0&end=9223372036854775807&limit=2147483647
11-Nov-2018 11:34:32 2018-11-11 11:34:32,099 - INFO  [main:c.c.c.t.AudiTestBase$1@134] - Received response: [200] Response Body: []
11-Nov-2018 11:34:32 2018-11-11 11:34:32,150 - INFO  [main:c.c.c.t.AudiTestBase$1@125] - Making request: GET http://10.210.0.45:11015/v3/namespaces/default/apps/XMLInvalidNodePathTest/versions/-SNAPSHOT/workflows/DataPipelineWorkflow/runs?status=COMPLETED&start=0&end=9223372036854775807&limit=2147483647
11-Nov-2018 11:34:32 2018-11-11 11:34:32,238 - INFO  [main:c.c.c.t.AudiTestBase$1@134] - Received response: [200] Response Body: []
11-Nov-2018 11:34:32 2018-11-11 11:34:32,288 - INFO  [main:c.c.c.t.AudiTestBase$1@125] - Making request: GET http://10.210.0.45:11015/v3/namespaces/default/apps/XMLInvalidNodePathTest/versions/-SNAPSHOT/workflows/DataPipelineWorkflow/runs?status=COMPLETED&start=0&end=9223372036854775807&limit=2147483647
11-Nov-2018 11:34:32 2018-11-11 11:34:32,381 - INFO  [main:c.c.c.t.AudiTestBase$1@134] - Received response: [200] Response Body: []
11-Nov-2018 11:34:32 2018-11-11 11:34:32,432 - INFO  [main:c.c.c.t.AudiTestBase$1@125] - Making request: GET http://10.210.0.45:11015/v3/namespaces/default/apps/XMLInvalidNodePathTest/versions/-SNAPSHOT/workflows/DataPipelineWorkflow/runs?status=COMPLETED&start=0&end=9223372036854775807&limit=2147483647
11-Nov-2018 11:34:32 2018-11-11 11:34:32,522 - INFO  [main:c.c.c.t.AudiTestBase$1@134] - Received response: [200] Response Body: []
11-Nov-2018 11:34:32 2018-11-11 11:34:32,572 - INFO  [main:c.c.c.t.AudiTestBase$1@125] - Making request: GET http://10.210.0.45:11015/v3/namespaces/default/apps/XMLInvalidNodePathTest/versions/-SNAPSHOT/workflows/DataPipelineWorkflow/runs?status=COMPLETED&start=0&end=9223372036854775807&limit=2147483647
11-Nov-2018 11:34:32 2018-11-11 11:34:32,661 - INFO  [main:c.c.c.t.AudiTestBase$1@134] - Received response: [200] Response Body: []
11-Nov-2018 11:34:32 2018-11-11 11:34:32,712 - INFO  [main:c.c.c.t.AudiTestBase$1@125] - Making request: GET http://10.210.0.45:11015/v3/namespaces/default/apps/XMLInvalidNodePathTest/versions/-SNAPSHOT/workflows/DataPipelineWorkflow/runs?status=COMPLETED&start=0&end=9223372036854775807&limit=2147483647
11-Nov-2018 11:34:32 2018-11-11 11:34:32,801 - INFO  [main:c.c.c.t.AudiTestBase$1@134] - Received response: [200] Response Body: []
11-Nov-2018 11:34:32 2018-11-11 11:34:32,852 - INFO  [main:c.c.c.t.AudiTestBase$1@125] - Making request: GET http://10.210.0.45:11015/v3/namespaces/default/apps/XMLInvalidNodePathTest/versions/-SNAPSHOT/workflows/DataPipelineWorkflow/runs?status=COMPLETED&start=0&end=9223372036854775807&limit=2147483647
11-Nov-2018 11:34:32 2018-11-11 11:34:32,941 - INFO  [main:c.c.c.t.AudiTestBase$1@134] - Received response: [200] Response Body: []
11-Nov-2018 11:34:32 2018-11-11 11:34:32,991 - INFO  [main:c.c.c.t.AudiTestBase$1@125] - Making request: GET http://10.210.0.45:11015/v3/namespaces/default/apps/XMLInvalidNodePathTest/versions/-SNAPSHOT/workflows/DataPipelineWorkflow/runs?status=COMPLETED&start=0&end=9223372036854775807&limit=2147483647
11-Nov-2018 11:34:33 2018-11-11 11:34:33,081 - INFO  [main:c.c.c.t.AudiTestBase$1@134] - Received response: [200] Response Body: []
11-Nov-2018 11:34:33 2018-11-11 11:34:33,132 - INFO  [main:c.c.c.t.AudiTestBase$1@125] - Making request: GET http://10.210.0.45:11015/v3/namespaces/default/apps/XMLInvalidNodePathTest/versions/-SNAPSHOT/workflows/DataPipelineWorkflow/runs?status=COMPLETED&start=0&end=9223372036854775807&limit=2147483647
11-Nov-2018 11:34:33 2018-11-11 11:34:33,222 - INFO  [main:c.c.c.t.AudiTestBase$1@134] - Received response: [200] Response Body: []
11-Nov-2018 11:34:33 2018-11-11 11:34:33,273 - INFO  [main:c.c.c.t.AudiTestBase$1@125] - Making request: GET http://10.210.0.45:11015/v3/namespaces/default/apps/XMLInvalidNodePathTest/versions/-SNAPSHOT/workflows/DataPipelineWorkflow/runs?status=COMPLETED&start=0&end=9223372036854775807&limit=2147483647
11-Nov-2018 11:34:33 2018-11-11 11:34:33,363 - INFO  [main:c.c.c.t.AudiTestBase$1@134] - Received response: [200] Response Body: []
11-Nov-2018 11:34:33 2018-11-11 11:34:33,413 - INFO  [main:c.c.c.t.AudiTestBase$1@125] - Making request: GET http://10.210.0.45:11015/v3/namespaces/default/apps/XMLInvalidNodePathTest/versions/-SNAPSHOT/workflows/DataPipelineWorkflow/runs?status=COMPLETED&start=0&end=9223372036854775807&limit=2147483647
11-Nov-2018 11:34:33 2018-11-11 11:34:33,503 - INFO  [main:c.c.c.t.AudiTestBase$1@134] - Received response: [200] Response Body: []
11-Nov-2018 11:34:33 2018-11-11 11:34:33,554 - INFO  [main:c.c.c.t.AudiTestBase$1@125] - Making request: GET http://10.210.0.45:11015/v3/namespaces/default/apps/XMLInvalidNodePathTest/versions/-SNAPSHOT/workflows/DataPipelineWorkflow/runs?status=COMPLETED&start=0&end=9223372036854775807&limit=2147483647
11-Nov-2018 11:34:33 2018-11-11 11:34:33,644 - INFO  [main:c.c.c.t.AudiTestBase$1@134] - Received response: [200] Response Body: []
11-Nov-2018 11:34:33 2018-11-11 11:34:33,695 - INFO  [main:c.c.c.t.AudiTestBase$1@125] - Making request: GET http://10.210.0.45:11015/v3/namespaces/default/apps/XMLInvalidNodePathTest/versions/-SNAPSHOT/workflows/DataPipelineWorkflow/runs?status=COMPLETED&start=0&end=9223372036854775807&limit=2147483647
11-Nov-2018 11:34:33 2018-11-11 11:34:33,786 - INFO  [main:c.c.c.t.AudiTestBase$1@134] - Received response: [200] Response Body: []
11-Nov-2018 11:34:33 2018-11-11 11:34:33,836 - INFO  [main:c.c.c.t.AudiTestBase$1@125] - Making request: GET http://10.210.0.45:11015/v3/namespaces/default/apps/XMLInvalidNodePathTest/versions/-SNAPSHOT/workflows/DataPipelineWorkflow/runs?status=COMPLETED&start=0&end=9223372036854775807&limit=2147483647
11-Nov-2018 11:34:33 2018-11-11 11:34:33,925 - INFO  [main:c.c.c.t.AudiTestBase$1@134] - Received response: [200] Response Body: []
11-Nov-2018 11:34:33 2018-11-11 11:34:33,976 - INFO  [main:c.c.c.t.AudiTestBase$1@125] - Making request: GET http://10.210.0.45:11015/v3/namespaces/default/apps/XMLInvalidNodePathTest/versions/-SNAPSHOT/workflows/DataPipelineWorkflow/runs?status=COMPLETED&start=0&end=9223372036854775807&limit=2147483647
11-Nov-2018 11:34:34 2018-11-11 11:34:34,064 - INFO  [main:c.c.c.t.AudiTestBase$1@134] - Received response: [200] Response Body: []
11-Nov-2018 11:34:34 2018-11-11 11:34:34,115 - INFO  [main:c.c.c.t.AudiTestBase$1@125] - Making request: GET http://10.210.0.45:11015/v3/namespaces/default/apps/XMLInvalidNodePathTest/versions/-SNAPSHOT/workflows/DataPipelineWorkflow/runs?status=COMPLETED&start=0&end=9223372036854775807&limit=2147483647
11-Nov-2018 11:34:34 2018-11-11 11:34:34,205 - INFO  [main:c.c.c.t.AudiTestBase$1@134] - Received response: [200] Response Body: []
11-Nov-2018 11:34:34 2018-11-11 11:34:34,256 - INFO  [main:c.c.c.t.AudiTestBase$1@125] - Making request: GET http://10.210.0.45:11015/v3/namespaces/default/apps/XMLInvalidNodePathTest/versions/-SNAPSHOT/workflows/DataPipelineWorkflow/runs?status=COMPLETED&start=0&end=9223372036854775807&limit=2147483647
11-Nov-2018 11:34:34 2018-11-11 11:34:34,345 - INFO  [main:c.c.c.t.AudiTestBase$1@134] - Received response: [200] Response Body: []
11-Nov-2018 11:34:34 2018-11-11 11:34:34,396 - INFO  [main:c.c.c.t.AudiTestBase$1@125] - Making request: GET http://10.210.0.45:11015/v3/namespaces/default/apps/XMLInvalidNodePathTest/versions/-SNAPSHOT/workflows/DataPipelineWorkflow/runs?status=COMPLETED&start=0&end=9223372036854775807&limit=2147483647
11-Nov-2018 11:34:34 2018-11-11 11:34:34,486 - INFO  [main:c.c.c.t.AudiTestBase$1@134] - Received response: [200] Response Body: []
11-Nov-2018 11:34:34 2018-11-11 11:34:34,536 - INFO  [main:c.c.c.t.AudiTestBase$1@125] - Making request: GET http://10.210.0.45:11015/v3/namespaces/default/apps/XMLInvalidNodePathTest/versions/-SNAPSHOT/workflows/DataPipelineWorkflow/runs?status=COMPLETED&start=0&end=9223372036854775807&limit=2147483647
11-Nov-2018 11:34:34 2018-11-11 11:34:34,625 - INFO  [main:c.c.c.t.AudiTestBase$1@134] - Received response: [200] Response Body: []
11-Nov-2018 11:34:34 2018-11-11 11:34:34,676 - INFO  [main:c.c.c.t.AudiTestBase$1@125] - Making request: GET http://10.210.0.45:11015/v3/namespaces/default/apps/XMLInvalidNodePathTest/versions/-SNAPSHOT/workflows/DataPipelineWorkflow/runs?status=COMPLETED&start=0&end=9223372036854775807&limit=2147483647
11-Nov-2018 11:34:34 2018-11-11 11:34:34,763 - INFO  [main:c.c.c.t.AudiTestBase$1@134] - Received response: [200] Response Body: []
11-Nov-2018 11:34:34 2018-11-11 11:34:34,814 - INFO  [main:c.c.c.t.AudiTestBase$1@125] - Making request: GET http://10.210.0.45:11015/v3/namespaces/default/apps/XMLInvalidNodePathTest/versions/-SNAPSHOT/workflows/DataPipelineWorkflow/runs?status=COMPLETED&start=0&end=9223372036854775807&limit=2147483647
11-Nov-2018 11:34:34 2018-11-11 11:34:34,902 - INFO  [main:c.c.c.t.AudiTestBase$1@134] - Received response: [200] Response Body: []
11-Nov-2018 11:34:34 2018-11-11 11:34:34,953 - INFO  [main:c.c.c.t.AudiTestBase$1@125] - Making request: GET http://10.210.0.45:11015/v3/namespaces/default/apps/XMLInvalidNodePathTest/versions/-SNAPSHOT/workflows/DataPipelineWorkflow/runs?status=COMPLETED&start=0&end=9223372036854775807&limit=2147483647
11-Nov-2018 11:34:35 2018-11-11 11:34:35,045 - INFO  [main:c.c.c.t.AudiTestBase$1@134] - Received response: [200] Response Body: []
11-Nov-2018 11:34:35 2018-11-11 11:34:35,096 - INFO  [main:c.c.c.t.AudiTestBase$1@125] - Making request: GET http://10.210.0.45:11015/v3/namespaces/default/apps/XMLInvalidNodePathTest/versions/-SNAPSHOT/workflows/DataPipelineWorkflow/runs?status=COMPLETED&start=0&end=9223372036854775807&limit=2147483647
11-Nov-2018 11:34:35 2018-11-11 11:34:35,184 - INFO  [main:c.c.c.t.AudiTestBase$1@134] - Received response: [200] Response Body: []
11-Nov-2018 11:34:35 2018-11-11 11:34:35,235 - INFO  [main:c.c.c.t.AudiTestBase$1@125] - Making request: GET http://10.210.0.45:11015/v3/namespaces/default/apps/XMLInvalidNodePathTest/versions/-SNAPSHOT/workflows/DataPipelineWorkflow/runs?status=COMPLETED&start=0&end=9223372036854775807&limit=2147483647
11-Nov-2018 11:34:35 2018-11-11 11:34:35,324 - INFO  [main:c.c.c.t.AudiTestBase$1@134] - Received response: [200] Response Body: []
11-Nov-2018 11:34:35 2018-11-11 11:34:35,374 - INFO  [main:c.c.c.t.AudiTestBase$1@125] - Making request: GET http://10.210.0.45:11015/v3/namespaces/default/apps/XMLInvalidNodePathTest/versions/-SNAPSHOT/workflows/DataPipelineWorkflow/runs?status=COMPLETED&start=0&end=9223372036854775807&limit=2147483647
11-Nov-2018 11:34:35 2018-11-11 11:34:35,462 - INFO  [main:c.c.c.t.AudiTestBase$1@134] - Received response: [200] Response Body: []
11-Nov-2018 11:34:35 2018-11-11 11:34:35,513 - INFO  [main:c.c.c.t.AudiTestBase$1@125] - Making request: GET http://10.210.0.45:11015/v3/namespaces/default/apps/XMLInvalidNodePathTest/versions/-SNAPSHOT/workflows/DataPipelineWorkflow/runs?status=COMPLETED&start=0&end=9223372036854775807&limit=2147483647
11-Nov-2018 11:34:35 2018-11-11 11:34:35,602 - INFO  [main:c.c.c.t.AudiTestBase$1@134] - Received response: [200] Response Body: []
11-Nov-2018 11:34:35 2018-11-11 11:34:35,652 - INFO  [main:c.c.c.t.AudiTestBase$1@125] - Making request: GET http://10.210.0.45:11015/v3/namespaces/default/apps/XMLInvalidNodePathTest/versions/-SNAPSHOT/workflows/DataPipelineWorkflow/runs?status=COMPLETED&start=0&end=9223372036854775807&limit=2147483647
11-Nov-2018 11:34:35 2018-11-11 11:34:35,740 - INFO  [main:c.c.c.t.AudiTestBase$1@134] - Received response: [200] Response Body: []
11-Nov-2018 11:34:35 2018-11-11 11:34:35,791 - INFO  [main:c.c.c.t.AudiTestBase$1@125] - Making request: GET http://10.210.0.45:11015/v3/namespaces/default/apps/XMLInvalidNodePathTest/versions/-SNAPSHOT/workflows/DataPipelineWorkflow/runs?status=COMPLETED&start=0&end=9223372036854775807&limit=2147483647
11-Nov-2018 11:34:35 2018-11-11 11:34:35,878 - INFO  [main:c.c.c.t.AudiTestBase$1@134] - Received response: [200] Response Body: []
11-Nov-2018 11:34:35 2018-11-11 11:34:35,929 - INFO  [main:c.c.c.t.AudiTestBase$1@125] - Making request: GET http://10.210.0.45:11015/v3/namespaces/default/apps/XMLInvalidNodePathTest/versions/-SNAPSHOT/workflows/DataPipelineWorkflow/runs?status=COMPLETED&start=0&end=9223372036854775807&limit=2147483647
11-Nov-2018 11:34:36 2018-11-11 11:34:36,016 - INFO  [main:c.c.c.t.AudiTestBase$1@134] - Received response: [200] Response Body: []
11-Nov-2018 11:34:36 2018-11-11 11:34:36,067 - INFO  [main:c.c.c.t.AudiTestBase$1@125] - Making request: GET http://10.210.0.45:11015/v3/namespaces/default/apps/XMLInvalidNodePathTest/versions/-SNAPSHOT/workflows/DataPipelineWorkflow/runs?status=COMPLETED&start=0&end=9223372036854775807&limit=2147483647
11-Nov-2018 11:34:36 2018-11-11 11:34:36,156 - INFO  [main:c.c.c.t.AudiTestBase$1@134] - Received response: [200] Response Body: []
11-Nov-2018 11:34:36 2018-11-11 11:34:36,207 - INFO  [main:c.c.c.t.AudiTestBase$1@125] - Making request: GET http://10.210.0.45:11015/v3/namespaces/default/apps/XMLInvalidNodePathTest/versions/-SNAPSHOT/workflows/DataPipelineWorkflow/runs?status=COMPLETED&start=0&end=9223372036854775807&limit=2147483647
11-Nov-2018 11:34:36 2018-11-11 11:34:36,294 - INFO  [main:c.c.c.t.AudiTestBase$1@134] - Received response: [200] Response Body: []
11-Nov-2018 11:34:36 2018-11-11 11:34:36,345 - INFO  [main:c.c.c.t.AudiTestBase$1@125] - Making request: GET http://10.210.0.45:11015/v3/namespaces/default/apps/XMLInvalidNodePathTest/versions/-SNAPSHOT/workflows/DataPipelineWorkflow/runs?status=COMPLETED&start=0&end=9223372036854775807&limit=2147483647
11-Nov-2018 11:34:36 2018-11-11 11:34:36,434 - INFO  [main:c.c.c.t.AudiTestBase$1@134] - Received response: [200] Response Body: []
11-Nov-2018 11:34:36 2018-11-11 11:34:36,484 - INFO  [main:c.c.c.t.AudiTestBase$1@125] - Making request: GET http://10.210.0.45:11015/v3/namespaces/default/apps/XMLInvalidNodePathTest/versions/-SNAPSHOT/workflows/DataPipelineWorkflow/runs?status=COMPLETED&start=0&end=9223372036854775807&limit=2147483647
11-Nov-2018 11:34:36 2018-11-11 11:34:36,573 - INFO  [main:c.c.c.t.AudiTestBase$1@134] - Received response: [200] Response Body: []
11-Nov-2018 11:34:36 2018-11-11 11:34:36,624 - INFO  [main:c.c.c.t.AudiTestBase$1@125] - Making request: GET http://10.210.0.45:11015/v3/namespaces/default/apps/XMLInvalidNodePathTest/versions/-SNAPSHOT/workflows/DataPipelineWorkflow/runs?status=COMPLETED&start=0&end=9223372036854775807&limit=2147483647
11-Nov-2018 11:34:36 2018-11-11 11:34:36,711 - INFO  [main:c.c.c.t.AudiTestBase$1@134] - Received response: [200] Response Body: []
11-Nov-2018 11:34:36 2018-11-11 11:34:36,762 - INFO  [main:c.c.c.t.AudiTestBase$1@125] - Making request: GET http://10.210.0.45:11015/v3/namespaces/default/apps/XMLInvalidNodePathTest/versions/-SNAPSHOT/workflows/DataPipelineWorkflow/runs?status=COMPLETED&start=0&end=9223372036854775807&limit=2147483647
11-Nov-2018 11:34:36 2018-11-11 11:34:36,850 - INFO  [main:c.c.c.t.AudiTestBase$1@134] - Received response: [200] Response Body: []
11-Nov-2018 11:34:36 2018-11-11 11:34:36,900 - INFO  [main:c.c.c.t.AudiTestBase$1@125] - Making request: GET http://10.210.0.45:11015/v3/namespaces/default/apps/XMLInvalidNodePathTest/versions/-SNAPSHOT/workflows/DataPipelineWorkflow/runs?status=COMPLETED&start=0&end=9223372036854775807&limit=2147483647
11-Nov-2018 11:34:36 2018-11-11 11:34:36,988 - INFO  [main:c.c.c.t.AudiTestBase$1@134] - Received response: [200] Response Body: []
11-Nov-2018 11:34:37 2018-11-11 11:34:37,039 - INFO  [main:c.c.c.t.AudiTestBase$1@125] - Making request: GET http://10.210.0.45:11015/v3/namespaces/default/apps/XMLInvalidNodePathTest/versions/-SNAPSHOT/workflows/DataPipelineWorkflow/runs?status=COMPLETED&start=0&end=9223372036854775807&limit=2147483647
11-Nov-2018 11:34:37 2018-11-11 11:34:37,126 - INFO  [main:c.c.c.t.AudiTestBase$1@134] - Received response: [200] Response Body: []
11-Nov-2018 11:34:37 2018-11-11 11:34:37,176 - INFO  [main:c.c.c.t.AudiTestBase$1@125] - Making request: GET http://10.210.0.45:11015/v3/namespaces/default/apps/XMLInvalidNodePathTest/versions/-SNAPSHOT/workflows/DataPipelineWorkflow/runs?status=COMPLETED&start=0&end=9223372036854775807&limit=2147483647
11-Nov-2018 11:34:37 2018-11-11 11:34:37,264 - INFO  [main:c.c.c.t.AudiTestBase$1@134] - Received response: [200] Response Body: []
11-Nov-2018 11:34:37 2018-11-11 11:34:37,315 - INFO  [main:c.c.c.t.AudiTestBase$1@125] - Making request: GET http://10.210.0.45:11015/v3/namespaces/default/apps/XMLInvalidNodePathTest/versions/-SNAPSHOT/workflows/DataPipelineWorkflow/runs?status=COMPLETED&start=0&end=9223372036854775807&limit=2147483647
11-Nov-2018 11:34:37 2018-11-11 11:34:37,404 - INFO  [main:c.c.c.t.AudiTestBase$1@134] - Received response: [200] Response Body: []
11-Nov-2018 11:34:37 2018-11-11 11:34:37,455 - INFO  [main:c.c.c.t.AudiTestBase$1@125] - Making request: GET http://10.210.0.45:11015/v3/namespaces/default/apps/XMLInvalidNodePathTest/versions/-SNAPSHOT/workflows/DataPipelineWorkflow/runs?status=COMPLETED&start=0&end=9223372036854775807&limit=2147483647
11-Nov-2018 11:34:37 2018-11-11 11:34:37,544 - INFO  [main:c.c.c.t.AudiTestBase$1@134] - Received response: [200] Response Body: []
11-Nov-2018 11:34:37 2018-11-11 11:34:37,594 - INFO  [main:c.c.c.t.AudiTestBase$1@125] - Making request: GET http://10.210.0.45:11015/v3/namespaces/default/apps/XMLInvalidNodePathTest/versions/-SNAPSHOT/workflows/DataPipelineWorkflow/runs?status=COMPLETED&start=0&end=9223372036854775807&limit=2147483647
11-Nov-2018 11:34:37 2018-11-11 11:34:37,684 - INFO  [main:c.c.c.t.AudiTestBase$1@134] - Received response: [200] Response Body: []
11-Nov-2018 11:34:37 2018-11-11 11:34:37,735 - INFO  [main:c.c.c.t.AudiTestBase$1@125] - Making request: GET http://10.210.0.45:11015/v3/namespaces/default/apps/XMLInvalidNodePathTest/versions/-SNAPSHOT/workflows/DataPipelineWorkflow/runs?status=COMPLETED&start=0&end=9223372036854775807&limit=2147483647
11-Nov-2018 11:34:37 2018-11-11 11:34:37,822 - INFO  [main:c.c.c.t.AudiTestBase$1@134] - Received response: [200] Response Body: []
11-Nov-2018 11:34:37 2018-11-11 11:34:37,873 - INFO  [main:c.c.c.t.AudiTestBase$1@125] - Making request: GET http://10.210.0.45:11015/v3/namespaces/default/apps/XMLInvalidNodePathTest/versions/-SNAPSHOT/workflows/DataPipelineWorkflow/runs?status=COMPLETED&start=0&end=9223372036854775807&limit=2147483647
11-Nov-2018 11:34:37 2018-11-11 11:34:37,962 - INFO  [main:c.c.c.t.AudiTestBase$1@134] - Received response: [200] Response Body: []
11-Nov-2018 11:34:38 2018-11-11 11:34:38,013 - INFO  [main:c.c.c.t.AudiTestBase$1@125] - Making request: GET http://10.210.0.45:11015/v3/namespaces/default/apps/XMLInvalidNodePathTest/versions/-SNAPSHOT/workflows/DataPipelineWorkflow/runs?status=COMPLETED&start=0&end=9223372036854775807&limit=2147483647
11-Nov-2018 11:34:38 2018-11-11 11:34:38,101 - INFO  [main:c.c.c.t.AudiTestBase$1@134] - Received response: [200] Response Body: []
11-Nov-2018 11:34:38 2018-11-11 11:34:38,152 - INFO  [main:c.c.c.t.AudiTestBase$1@125] - Making request: GET http://10.210.0.45:11015/v3/namespaces/default/apps/XMLInvalidNodePathTest/versions/-SNAPSHOT/workflows/DataPipelineWorkflow/runs?status=COMPLETED&start=0&end=9223372036854775807&limit=2147483647
11-Nov-2018 11:34:38 2018-11-11 11:34:38,240 - INFO  [main:c.c.c.t.AudiTestBase$1@134] - Received response: [200] Response Body: []
11-Nov-2018 11:34:38 2018-11-11 11:34:38,291 - INFO  [main:c.c.c.t.AudiTestBase$1@125] - Making request: GET http://10.210.0.45:11015/v3/namespaces/default/apps/XMLInvalidNodePathTest/versions/-SNAPSHOT/workflows/DataPipelineWorkflow/runs?status=COMPLETED&start=0&end=9223372036854775807&limit=2147483647
11-Nov-2018 11:34:38 2018-11-11 11:34:38,379 - INFO  [main:c.c.c.t.AudiTestBase$1@134] - Received response: [200] Response Body: []
11-Nov-2018 11:34:38 2018-11-11 11:34:38,430 - INFO  [main:c.c.c.t.AudiTestBase$1@125] - Making request: GET http://10.210.0.45:11015/v3/namespaces/default/apps/XMLInvalidNodePathTest/versions/-SNAPSHOT/workflows/DataPipelineWorkflow/runs?status=COMPLETED&start=0&end=9223372036854775807&limit=2147483647
11-Nov-2018 11:34:38 2018-11-11 11:34:38,518 - INFO  [main:c.c.c.t.AudiTestBase$1@134] - Received response: [200] Response Body: []
11-Nov-2018 11:34:38 2018-11-11 11:34:38,569 - INFO  [main:c.c.c.t.AudiTestBase$1@125] - Making request: GET http://10.210.0.45:11015/v3/namespaces/default/apps/XMLInvalidNodePathTest/versions/-SNAPSHOT/workflows/DataPipelineWorkflow/runs?status=COMPLETED&start=0&end=9223372036854775807&limit=2147483647
11-Nov-2018 11:34:38 2018-11-11 11:34:38,657 - INFO  [main:c.c.c.t.AudiTestBase$1@134] - Received response: [200] Response Body: []
11-Nov-2018 11:34:38 2018-11-11 11:34:38,707 - INFO  [main:c.c.c.t.AudiTestBase$1@125] - Making request: GET http://10.210.0.45:11015/v3/namespaces/default/apps/XMLInvalidNodePathTest/versions/-SNAPSHOT/workflows/DataPipelineWorkflow/runs?status=COMPLETED&start=0&end=9223372036854775807&limit=2147483647
11-Nov-2018 11:34:38 2018-11-11 11:34:38,796 - INFO  [main:c.c.c.t.AudiTestBase$1@134] - Received response: [200] Response Body: []
11-Nov-2018 11:34:38 2018-11-11 11:34:38,847 - INFO  [main:c.c.c.t.AudiTestBase$1@125] - Making request: GET http://10.210.0.45:11015/v3/namespaces/default/apps/XMLInvalidNodePathTest/versions/-SNAPSHOT/workflows/DataPipelineWorkflow/runs?status=COMPLETED&start=0&end=9223372036854775807&limit=2147483647
11-Nov-2018 11:34:38 2018-11-11 11:34:38,937 - INFO  [main:c.c.c.t.AudiTestBase$1@134] - Received response: [200] Response Body: []
11-Nov-2018 11:34:38 2018-11-11 11:34:38,987 - INFO  [main:c.c.c.t.AudiTestBase$1@125] - Making request: GET http://10.210.0.45:11015/v3/namespaces/default/apps/XMLInvalidNodePathTest/versions/-SNAPSHOT/workflows/DataPipelineWorkflow/runs?status=COMPLETED&start=0&end=9223372036854775807&limit=2147483647
11-Nov-2018 11:34:39 2018-11-11 11:34:39,075 - INFO  [main:c.c.c.t.AudiTestBase$1@134] - Received response: [200] Response Body: []
11-Nov-2018 11:34:39 2018-11-11 11:34:39,125 - INFO  [main:c.c.c.t.AudiTestBase$1@125] - Making request: GET http://10.210.0.45:11015/v3/namespaces/default/apps/XMLInvalidNodePathTest/versions/-SNAPSHOT/workflows/DataPipelineWorkflow/runs?status=COMPLETED&start=0&end=9223372036854775807&limit=2147483647
11-Nov-2018 11:34:39 2018-11-11 11:34:39,214 - INFO  [main:c.c.c.t.AudiTestBase$1@134] - Received response: [200] Response Body: []
11-Nov-2018 11:34:39 2018-11-11 11:34:39,264 - INFO  [main:c.c.c.t.AudiTestBase$1@125] - Making request: GET http://10.210.0.45:11015/v3/namespaces/default/apps/XMLInvalidNodePathTest/versions/-SNAPSHOT/workflows/DataPipelineWorkflow/runs?status=COMPLETED&start=0&end=9223372036854775807&limit=2147483647
11-Nov-2018 11:34:39 2018-11-11 11:34:39,353 - INFO  [main:c.c.c.t.AudiTestBase$1@134] - Received response: [200] Response Body: []
11-Nov-2018 11:34:39 2018-11-11 11:34:39,404 - INFO  [main:c.c.c.t.AudiTestBase$1@125] - Making request: GET http://10.210.0.45:11015/v3/namespaces/default/apps/XMLInvalidNodePathTest/versions/-SNAPSHOT/workflows/DataPipelineWorkflow/runs?status=COMPLETED&start=0&end=9223372036854775807&limit=2147483647
11-Nov-2018 11:34:39 2018-11-11 11:34:39,492 - INFO  [main:c.c.c.t.AudiTestBase$1@134] - Received response: [200] Response Body: []
11-Nov-2018 11:34:39 2018-11-11 11:34:39,543 - INFO  [main:c.c.c.t.AudiTestBase$1@125] - Making request: GET http://10.210.0.45:11015/v3/namespaces/default/apps/XMLInvalidNodePathTest/versions/-SNAPSHOT/workflows/DataPipelineWorkflow/runs?status=COMPLETED&start=0&end=9223372036854775807&limit=2147483647
11-Nov-2018 11:34:39 2018-11-11 11:34:39,631 - INFO  [main:c.c.c.t.AudiTestBase$1@134] - Received response: [200] Response Body: []
11-Nov-2018 11:34:39 2018-11-11 11:34:39,682 - INFO  [main:c.c.c.t.AudiTestBase$1@125] - Making request: GET http://10.210.0.45:11015/v3/namespaces/default/apps/XMLInvalidNodePathTest/versions/-SNAPSHOT/workflows/DataPipelineWorkflow/runs?status=COMPLETED&start=0&end=9223372036854775807&limit=2147483647
11-Nov-2018 11:34:39 2018-11-11 11:34:39,770 - INFO  [main:c.c.c.t.AudiTestBase$1@134] - Received response: [200] Response Body: []
11-Nov-2018 11:34:39 2018-11-11 11:34:39,822 - INFO  [main:c.c.c.t.AudiTestBase$1@125] - Making request: GET http://10.210.0.45:11015/v3/namespaces/default/apps/XMLInvalidNodePathTest/versions/-SNAPSHOT/workflows/DataPipelineWorkflow/runs?status=COMPLETED&start=0&end=9223372036854775807&limit=2147483647
11-Nov-2018 11:34:39 2018-11-11 11:34:39,911 - INFO  [main:c.c.c.t.AudiTestBase$1@134] - Received response: [200] Response Body: []
11-Nov-2018 11:34:39 2018-11-11 11:34:39,961 - INFO  [main:c.c.c.t.AudiTestBase$1@125] - Making request: GET http://10.210.0.45:11015/v3/namespaces/default/apps/XMLInvalidNodePathTest/versions/-SNAPSHOT/workflows/DataPipelineWorkflow/runs?status=COMPLETED&start=0&end=9223372036854775807&limit=2147483647
11-Nov-2018 11:34:40 2018-11-11 11:34:40,051 - INFO  [main:c.c.c.t.AudiTestBase$1@134] - Received response: [200] Response Body: []
11-Nov-2018 11:34:40 2018-11-11 11:34:40,101 - INFO  [main:c.c.c.t.AudiTestBase$1@125] - Making request: GET http://10.210.0.45:11015/v3/namespaces/default/apps/XMLInvalidNodePathTest/versions/-SNAPSHOT/workflows/DataPipelineWorkflow/runs?status=COMPLETED&start=0&end=9223372036854775807&limit=2147483647
11-Nov-2018 11:34:40 2018-11-11 11:34:40,190 - INFO  [main:c.c.c.t.AudiTestBase$1@134] - Received response: [200] Response Body: []
11-Nov-2018 11:34:40 2018-11-11 11:34:40,241 - INFO  [main:c.c.c.t.AudiTestBase$1@125] - Making request: GET http://10.210.0.45:11015/v3/namespaces/default/apps/XMLInvalidNodePathTest/versions/-SNAPSHOT/workflows/DataPipelineWorkflow/runs?status=COMPLETED&start=0&end=9223372036854775807&limit=2147483647
11-Nov-2018 11:34:40 2018-11-11 11:34:40,330 - INFO  [main:c.c.c.t.AudiTestBase$1@134] - Received response: [200] Response Body: []
11-Nov-2018 11:34:40 2018-11-11 11:34:40,380 - INFO  [main:c.c.c.t.AudiTestBase$1@125] - Making request: GET http://10.210.0.45:11015/v3/namespaces/default/apps/XMLInvalidNodePathTest/versions/-SNAPSHOT/workflows/DataPipelineWorkflow/runs?status=COMPLETED&start=0&end=9223372036854775807&limit=2147483647
11-Nov-2018 11:34:40 2018-11-11 11:34:40,469 - INFO  [main:c.c.c.t.AudiTestBase$1@134] - Received response: [200] Response Body: []
11-Nov-2018 11:34:40 2018-11-11 11:34:40,520 - INFO  [main:c.c.c.t.AudiTestBase$1@125] - Making request: GET http://10.210.0.45:11015/v3/namespaces/default/apps/XMLInvalidNodePathTest/versions/-SNAPSHOT/workflows/DataPipelineWorkflow/runs?status=COMPLETED&start=0&end=9223372036854775807&limit=2147483647
11-Nov-2018 11:34:40 2018-11-11 11:34:40,609 - INFO  [main:c.c.c.t.AudiTestBase$1@134] - Received response: [200] Response Body: []
11-Nov-2018 11:34:40 2018-11-11 11:34:40,660 - INFO  [main:c.c.c.t.AudiTestBase$1@125] - Making request: GET http://10.210.0.45:11015/v3/namespaces/default/apps/XMLInvalidNodePathTest/versions/-SNAPSHOT/workflows/DataPipelineWorkflow/runs?status=COMPLETED&start=0&end=9223372036854775807&limit=2147483647
11-Nov-2018 11:34:40 2018-11-11 11:34:40,747 - INFO  [main:c.c.c.t.AudiTestBase$1@134] - Received response: [200] Response Body: []
11-Nov-2018 11:34:40 2018-11-11 11:34:40,798 - INFO  [main:c.c.c.t.AudiTestBase$1@125] - Making request: GET http://10.210.0.45:11015/v3/namespaces/default/apps/XMLInvalidNodePathTest/versions/-SNAPSHOT/workflows/DataPipelineWorkflow/runs?status=COMPLETED&start=0&end=9223372036854775807&limit=2147483647
11-Nov-2018 11:34:40 2018-11-11 11:34:40,886 - INFO  [main:c.c.c.t.AudiTestBase$1@134] - Received response: [200] Response Body: []
11-Nov-2018 11:34:40 2018-11-11 11:34:40,937 - INFO  [main:c.c.c.t.AudiTestBase$1@125] - Making request: GET http://10.210.0.45:11015/v3/namespaces/default/apps/XMLInvalidNodePathTest/versions/-SNAPSHOT/workflows/DataPipelineWorkflow/runs?status=COMPLETED&start=0&end=9223372036854775807&limit=2147483647
11-Nov-2018 11:34:41 2018-11-11 11:34:41,026 - INFO  [main:c.c.c.t.AudiTestBase$1@134] - Received response: [200] Response Body: []
11-Nov-2018 11:34:41 2018-11-11 11:34:41,077 - INFO  [main:c.c.c.t.AudiTestBase$1@125] - Making request: GET http://10.210.0.45:11015/v3/namespaces/default/apps/XMLInvalidNodePathTest/versions/-SNAPSHOT/workflows/DataPipelineWorkflow/runs?status=COMPLETED&start=0&end=9223372036854775807&limit=2147483647
11-Nov-2018 11:34:41 2018-11-11 11:34:41,168 - INFO  [main:c.c.c.t.AudiTestBase$1@134] - Received response: [200] Response Body: []
11-Nov-2018 11:34:41 2018-11-11 11:34:41,218 - INFO  [main:c.c.c.t.AudiTestBase$1@125] - Making request: GET http://10.210.0.45:11015/v3/namespaces/default/apps/XMLInvalidNodePathTest/versions/-SNAPSHOT/workflows/DataPipelineWorkflow/runs?status=COMPLETED&start=0&end=9223372036854775807&limit=2147483647
11-Nov-2018 11:34:41 2018-11-11 11:34:41,308 - INFO  [main:c.c.c.t.AudiTestBase$1@134] - Received response: [200] Response Body: []
11-Nov-2018 11:34:41 2018-11-11 11:34:41,359 - INFO  [main:c.c.c.t.AudiTestBase$1@125] - Making request: GET http://10.210.0.45:11015/v3/namespaces/default/apps/XMLInvalidNodePathTest/versions/-SNAPSHOT/workflows/DataPipelineWorkflow/runs?status=COMPLETED&start=0&end=9223372036854775807&limit=2147483647
11-Nov-2018 11:34:41 2018-11-11 11:34:41,447 - INFO  [main:c.c.c.t.AudiTestBase$1@134] - Received response: [200] Response Body: []
11-Nov-2018 11:34:41 2018-11-11 11:34:41,498 - INFO  [main:c.c.c.t.AudiTestBase$1@125] - Making request: GET http://10.210.0.45:11015/v3/namespaces/default/apps/XMLInvalidNodePathTest/versions/-SNAPSHOT/workflows/DataPipelineWorkflow/runs?status=COMPLETED&start=0&end=9223372036854775807&limit=2147483647
11-Nov-2018 11:34:41 2018-11-11 11:34:41,586 - INFO  [main:c.c.c.t.AudiTestBase$1@134] - Received response: [200] Response Body: []
11-Nov-2018 11:34:41 2018-11-11 11:34:41,637 - INFO  [main:c.c.c.t.AudiTestBase$1@125] - Making request: GET http://10.210.0.45:11015/v3/namespaces/default/apps/XMLInvalidNodePathTest/versions/-SNAPSHOT/workflows/DataPipelineWorkflow/runs?status=COMPLETED&start=0&end=9223372036854775807&limit=2147483647
11-Nov-2018 11:34:41 2018-11-11 11:34:41,725 - INFO  [main:c.c.c.t.AudiTestBase$1@134] - Received response: [200] Response Body: []
11-Nov-2018 11:34:41 2018-11-11 11:34:41,776 - INFO  [main:c.c.c.t.AudiTestBase$1@125] - Making request: GET http://10.210.0.45:11015/v3/namespaces/default/apps/XMLInvalidNodePathTest/versions/-SNAPSHOT/workflows/DataPipelineWorkflow/runs?status=COMPLETED&start=0&end=9223372036854775807&limit=2147483647
11-Nov-2018 11:34:41 2018-11-11 11:34:41,864 - INFO  [main:c.c.c.t.AudiTestBase$1@134] - Received response: [200] Response Body: []
11-Nov-2018 11:34:41 2018-11-11 11:34:41,914 - INFO  [main:c.c.c.t.AudiTestBase$1@125] - Making request: GET http://10.210.0.45:11015/v3/namespaces/default/apps/XMLInvalidNodePathTest/versions/-SNAPSHOT/workflows/DataPipelineWorkflow/runs?status=COMPLETED&start=0&end=9223372036854775807&limit=2147483647
11-Nov-2018 11:34:42 2018-11-11 11:34:42,003 - INFO  [main:c.c.c.t.AudiTestBase$1@134] - Received response: [200] Response Body: []
11-Nov-2018 11:34:42 2018-11-11 11:34:42,054 - INFO  [main:c.c.c.t.AudiTestBase$1@125] - Making request: GET http://10.210.0.45:11015/v3/namespaces/default/apps/XMLInvalidNodePathTest/versions/-SNAPSHOT/workflows/DataPipelineWorkflow/runs?status=COMPLETED&start=0&end=9223372036854775807&limit=2147483647
11-Nov-2018 11:34:42 2018-11-11 11:34:42,142 - INFO  [main:c.c.c.t.AudiTestBase$1@134] - Received response: [200] Response Body: []
11-Nov-2018 11:34:42 2018-11-11 11:34:42,193 - INFO  [main:c.c.c.t.AudiTestBase$1@125] - Making request: GET http://10.210.0.45:11015/v3/namespaces/default/apps/XMLInvalidNodePathTest/versions/-SNAPSHOT/workflows/DataPipelineWorkflow/runs?status=COMPLETED&start=0&end=9223372036854775807&limit=2147483647
11-Nov-2018 11:34:42 2018-11-11 11:34:42,281 - INFO  [main:c.c.c.t.AudiTestBase$1@134] - Received response: [200] Response Body: []
11-Nov-2018 11:34:42 2018-11-11 11:34:42,331 - INFO  [main:c.c.c.t.AudiTestBase$1@125] - Making request: GET http://10.210.0.45:11015/v3/namespaces/default/apps/XMLInvalidNodePathTest/versions/-SNAPSHOT/workflows/DataPipelineWorkflow/runs?status=COMPLETED&start=0&end=9223372036854775807&limit=2147483647
11-Nov-2018 11:34:42 2018-11-11 11:34:42,421 - INFO  [main:c.c.c.t.AudiTestBase$1@134] - Received response: [200] Response Body: []
11-Nov-2018 11:34:42 2018-11-11 11:34:42,471 - INFO  [main:c.c.c.t.AudiTestBase$1@125] - Making request: GET http://10.210.0.45:11015/v3/namespaces/default/apps/XMLInvalidNodePathTest/versions/-SNAPSHOT/workflows/DataPipelineWorkflow/runs?status=COMPLETED&start=0&end=9223372036854775807&limit=2147483647
11-Nov-2018 11:34:42 2018-11-11 11:34:42,560 - INFO  [main:c.c.c.t.AudiTestBase$1@134] - Received response: [200] Response Body: []
11-Nov-2018 11:34:42 2018-11-11 11:34:42,610 - INFO  [main:c.c.c.t.AudiTestBase$1@125] - Making request: GET http://10.210.0.45:11015/v3/namespaces/default/apps/XMLInvalidNodePathTest/versions/-SNAPSHOT/workflows/DataPipelineWorkflow/runs?status=COMPLETED&start=0&end=9223372036854775807&limit=2147483647
11-Nov-2018 11:34:42 2018-11-11 11:34:42,698 - INFO  [main:c.c.c.t.AudiTestBase$1@134] - Received response: [200] Response Body: []
11-Nov-2018 11:34:42 2018-11-11 11:34:42,749 - INFO  [main:c.c.c.t.AudiTestBase$1@125] - Making request: GET http://10.210.0.45:11015/v3/namespaces/default/apps/XMLInvalidNodePathTest/versions/-SNAPSHOT/workflows/DataPipelineWorkflow/runs?status=COMPLETED&start=0&end=9223372036854775807&limit=2147483647
11-Nov-2018 11:34:42 2018-11-11 11:34:42,837 - INFO  [main:c.c.c.t.AudiTestBase$1@134] - Received response: [200] Response Body: []
11-Nov-2018 11:34:42 2018-11-11 11:34:42,888 - INFO  [main:c.c.c.t.AudiTestBase$1@125] - Making request: GET http://10.210.0.45:11015/v3/namespaces/default/apps/XMLInvalidNodePathTest/versions/-SNAPSHOT/workflows/DataPipelineWorkflow/runs?status=COMPLETED&start=0&end=9223372036854775807&limit=2147483647
11-Nov-2018 11:34:42 2018-11-11 11:34:42,975 - INFO  [main:c.c.c.t.AudiTestBase$1@134] - Received response: [200] Response Body: []
11-Nov-2018 11:34:43 2018-11-11 11:34:43,026 - INFO  [main:c.c.c.t.AudiTestBase$1@125] - Making request: GET http://10.210.0.45:11015/v3/namespaces/default/apps/XMLInvalidNodePathTest/versions/-SNAPSHOT/workflows/DataPipelineWorkflow/runs?status=COMPLETED&start=0&end=9223372036854775807&limit=2147483647
11-Nov-2018 11:34:43 2018-11-11 11:34:43,114 - INFO  [main:c.c.c.t.AudiTestBase$1@134] - Received response: [200] Response Body: []
11-Nov-2018 11:34:43 2018-11-11 11:34:43,165 - INFO  [main:c.c.c.t.AudiTestBase$1@125] - Making request: GET http://10.210.0.45:11015/v3/namespaces/default/apps/XMLInvalidNodePathTest/versions/-SNAPSHOT/workflows/DataPipelineWorkflow/runs?status=COMPLETED&start=0&end=9223372036854775807&limit=2147483647
11-Nov-2018 11:34:43 2018-11-11 11:34:43,253 - INFO  [main:c.c.c.t.AudiTestBase$1@134] - Received response: [200] Response Body: []
11-Nov-2018 11:34:43 2018-11-11 11:34:43,304 - INFO  [main:c.c.c.t.AudiTestBase$1@125] - Making request: GET http://10.210.0.45:11015/v3/namespaces/default/apps/XMLInvalidNodePathTest/versions/-SNAPSHOT/workflows/DataPipelineWorkflow/runs?status=COMPLETED&start=0&end=9223372036854775807&limit=2147483647
11-Nov-2018 11:34:43 2018-11-11 11:34:43,392 - INFO  [main:c.c.c.t.AudiTestBase$1@134] - Received response: [200] Response Body: []
11-Nov-2018 11:34:43 2018-11-11 11:34:43,442 - INFO  [main:c.c.c.t.AudiTestBase$1@125] - Making request: GET http://10.210.0.45:11015/v3/namespaces/default/apps/XMLInvalidNodePathTest/versions/-SNAPSHOT/workflows/DataPipelineWorkflow/runs?status=COMPLETED&start=0&end=9223372036854775807&limit=2147483647
11-Nov-2018 11:34:43 2018-11-11 11:34:43,531 - INFO  [main:c.c.c.t.AudiTestBase$1@134] - Received response: [200] Response Body: []
11-Nov-2018 11:34:43 2018-11-11 11:34:43,582 - INFO  [main:c.c.c.t.AudiTestBase$1@125] - Making request: GET http://10.210.0.45:11015/v3/namespaces/default/apps/XMLInvalidNodePathTest/versions/-SNAPSHOT/workflows/DataPipelineWorkflow/runs?status=COMPLETED&start=0&end=9223372036854775807&limit=2147483647
11-Nov-2018 11:34:43 2018-11-11 11:34:43,670 - INFO  [main:c.c.c.t.AudiTestBase$1@134] - Received response: [200] Response Body: []
11-Nov-2018 11:34:43 2018-11-11 11:34:43,721 - INFO  [main:c.c.c.t.AudiTestBase$1@125] - Making request: GET http://10.210.0.45:11015/v3/namespaces/default/apps/XMLInvalidNodePathTest/versions/-SNAPSHOT/workflows/DataPipelineWorkflow/runs?status=COMPLETED&start=0&end=9223372036854775807&limit=2147483647
11-Nov-2018 11:34:43 2018-11-11 11:34:43,809 - INFO  [main:c.c.c.t.AudiTestBase$1@134] - Received response: [200] Response Body: []
11-Nov-2018 11:34:43 2018-11-11 11:34:43,860 - INFO  [main:c.c.c.t.AudiTestBase$1@125] - Making request: GET http://10.210.0.45:11015/v3/namespaces/default/apps/XMLInvalidNodePathTest/versions/-SNAPSHOT/workflows/DataPipelineWorkflow/runs?status=COMPLETED&start=0&end=9223372036854775807&limit=2147483647
11-Nov-2018 11:34:43 2018-11-11 11:34:43,948 - INFO  [main:c.c.c.t.AudiTestBase$1@134] - Received response: [200] Response Body: []
11-Nov-2018 11:34:44 2018-11-11 11:34:43,999 - INFO  [main:c.c.c.t.AudiTestBase$1@125] - Making request: GET http://10.210.0.45:11015/v3/namespaces/default/apps/XMLInvalidNodePathTest/versions/-SNAPSHOT/workflows/DataPipelineWorkflow/runs?status=COMPLETED&start=0&end=9223372036854775807&limit=2147483647
11-Nov-2018 11:34:44 2018-11-11 11:34:44,086 - INFO  [main:c.c.c.t.AudiTestBase$1@134] - Received response: [200] Response Body: []
11-Nov-2018 11:34:44 2018-11-11 11:34:44,137 - INFO  [main:c.c.c.t.AudiTestBase$1@125] - Making request: GET http://10.210.0.45:11015/v3/namespaces/default/apps/XMLInvalidNodePathTest/versions/-SNAPSHOT/workflows/DataPipelineWorkflow/runs?status=COMPLETED&start=0&end=9223372036854775807&limit=2147483647
11-Nov-2018 11:34:44 2018-11-11 11:34:44,227 - INFO  [main:c.c.c.t.AudiTestBase$1@134] - Received response: [200] Response Body: []
11-Nov-2018 11:34:44 2018-11-11 11:34:44,278 - INFO  [main:c.c.c.t.AudiTestBase$1@125] - Making request: GET http://10.210.0.45:11015/v3/namespaces/default/apps/XMLInvalidNodePathTest/versions/-SNAPSHOT/workflows/DataPipelineWorkflow/runs?status=COMPLETED&start=0&end=9223372036854775807&limit=2147483647
11-Nov-2018 11:34:44 2018-11-11 11:34:44,367 - INFO  [main:c.c.c.t.AudiTestBase$1@134] - Received response: [200] Response Body: []
11-Nov-2018 11:34:44 2018-11-11 11:34:44,418 - INFO  [main:c.c.c.t.AudiTestBase$1@125] - Making request: GET http://10.210.0.45:11015/v3/namespaces/default/apps/XMLInvalidNodePathTest/versions/-SNAPSHOT/workflows/DataPipelineWorkflow/runs?status=COMPLETED&start=0&end=9223372036854775807&limit=2147483647
11-Nov-2018 11:34:44 2018-11-11 11:34:44,507 - INFO  [main:c.c.c.t.AudiTestBase$1@134] - Received response: [200] Response Body: []
11-Nov-2018 11:34:44 2018-11-11 11:34:44,557 - INFO  [main:c.c.c.t.AudiTestBase$1@125] - Making request: GET http://10.210.0.45:11015/v3/namespaces/default/apps/XMLInvalidNodePathTest/versions/-SNAPSHOT/workflows/DataPipelineWorkflow/runs?status=COMPLETED&start=0&end=9223372036854775807&limit=2147483647
11-Nov-2018 11:34:44 2018-11-11 11:34:44,646 - INFO  [main:c.c.c.t.AudiTestBase$1@134] - Received response: [200] Response Body: []
11-Nov-2018 11:34:44 2018-11-11 11:34:44,697 - INFO  [main:c.c.c.t.AudiTestBase$1@125] - Making request: GET http://10.210.0.45:11015/v3/namespaces/default/apps/XMLInvalidNodePathTest/versions/-SNAPSHOT/workflows/DataPipelineWorkflow/runs?status=COMPLETED&start=0&end=9223372036854775807&limit=2147483647
11-Nov-2018 11:34:44 2018-11-11 11:34:44,786 - INFO  [main:c.c.c.t.AudiTestBase$1@134] - Received response: [200] Response Body: []
11-Nov-2018 11:34:44 2018-11-11 11:34:44,837 - INFO  [main:c.c.c.t.AudiTestBase$1@125] - Making request: GET http://10.210.0.45:11015/v3/namespaces/default/apps/XMLInvalidNodePathTest/versions/-SNAPSHOT/workflows/DataPipelineWorkflow/runs?status=COMPLETED&start=0&end=9223372036854775807&limit=2147483647
11-Nov-2018 11:34:44 2018-11-11 11:34:44,924 - INFO  [main:c.c.c.t.AudiTestBase$1@134] - Received response: [200] Response Body: []
11-Nov-2018 11:34:44 2018-11-11 11:34:44,975 - INFO  [main:c.c.c.t.AudiTestBase$1@125] - Making request: GET http://10.210.0.45:11015/v3/namespaces/default/apps/XMLInvalidNodePathTest/versions/-SNAPSHOT/workflows/DataPipelineWorkflow/runs?status=COMPLETED&start=0&end=9223372036854775807&limit=2147483647
11-Nov-2018 11:34:45 2018-11-11 11:34:45,068 - INFO  [main:c.c.c.t.AudiTestBase$1@134] - Received response: [200] Response Body: []
11-Nov-2018 11:34:45 2018-11-11 11:34:45,119 - INFO  [main:c.c.c.t.AudiTestBase$1@125] - Making request: GET http://10.210.0.45:11015/v3/namespaces/default/apps/XMLInvalidNodePathTest/versions/-SNAPSHOT/workflows/DataPipelineWorkflow/runs?status=COMPLETED&start=0&end=9223372036854775807&limit=2147483647
11-Nov-2018 11:34:45 2018-11-11 11:34:45,207 - INFO  [main:c.c.c.t.AudiTestBase$1@134] - Received response: [200] Response Body: []
11-Nov-2018 11:34:45 2018-11-11 11:34:45,258 - INFO  [main:c.c.c.t.AudiTestBase$1@125] - Making request: GET http://10.210.0.45:11015/v3/namespaces/default/apps/XMLInvalidNodePathTest/versions/-SNAPSHOT/workflows/DataPipelineWorkflow/runs?status=COMPLETED&start=0&end=9223372036854775807&limit=2147483647
11-Nov-2018 11:34:45 2018-11-11 11:34:45,347 - INFO  [main:c.c.c.t.AudiTestBase$1@134] - Received response: [200] Response Body: []
11-Nov-2018 11:34:45 2018-11-11 11:34:45,397 - INFO  [main:c.c.c.t.AudiTestBase$1@125] - Making request: GET http://10.210.0.45:11015/v3/namespaces/default/apps/XMLInvalidNodePathTest/versions/-SNAPSHOT/workflows/DataPipelineWorkflow/runs?status=COMPLETED&start=0&end=9223372036854775807&limit=2147483647
11-Nov-2018 11:34:45 2018-11-11 11:34:45,485 - INFO  [main:c.c.c.t.AudiTestBase$1@134] - Received response: [200] Response Body: []
11-Nov-2018 11:34:45 2018-11-11 11:34:45,536 - INFO  [main:c.c.c.t.AudiTestBase$1@125] - Making request: GET http://10.210.0.45:11015/v3/namespaces/default/apps/XMLInvalidNodePathTest/versions/-SNAPSHOT/workflows/DataPipelineWorkflow/runs?status=COMPLETED&start=0&end=9223372036854775807&limit=2147483647
11-Nov-2018 11:34:45 2018-11-11 11:34:45,623 - INFO  [main:c.c.c.t.AudiTestBase$1@134] - Received response: [200] Response Body: []
11-Nov-2018 11:34:45 2018-11-11 11:34:45,674 - INFO  [main:c.c.c.t.AudiTestBase$1@125] - Making request: GET http://10.210.0.45:11015/v3/namespaces/default/apps/XMLInvalidNodePathTest/versions/-SNAPSHOT/workflows/DataPipelineWorkflow/runs?status=COMPLETED&start=0&end=9223372036854775807&limit=2147483647
11-Nov-2018 11:34:45 2018-11-11 11:34:45,761 - INFO  [main:c.c.c.t.AudiTestBase$1@134] - Received response: [200] Response Body: []
11-Nov-2018 11:34:45 2018-11-11 11:34:45,811 - INFO  [main:c.c.c.t.AudiTestBase$1@125] - Making request: GET http://10.210.0.45:11015/v3/namespaces/default/apps/XMLInvalidNodePathTest/versions/-SNAPSHOT/workflows/DataPipelineWorkflow/runs?status=COMPLETED&start=0&end=9223372036854775807&limit=2147483647
11-Nov-2018 11:34:45 2018-11-11 11:34:45,899 - INFO  [main:c.c.c.t.AudiTestBase$1@134] - Received response: [200] Response Body: []
11-Nov-2018 11:34:45 2018-11-11 11:34:45,949 - INFO  [main:c.c.c.t.AudiTestBase$1@125] - Making request: GET http://10.210.0.45:11015/v3/namespaces/default/apps/XMLInvalidNodePathTest/versions/-SNAPSHOT/workflows/DataPipelineWorkflow/runs?status=COMPLETED&start=0&end=9223372036854775807&limit=2147483647
11-Nov-2018 11:34:46 2018-11-11 11:34:46,037 - INFO  [main:c.c.c.t.AudiTestBase$1@134] - Received response: [200] Response Body: []
11-Nov-2018 11:34:46 2018-11-11 11:34:46,088 - INFO  [main:c.c.c.t.AudiTestBase$1@125] - Making request: GET http://10.210.0.45:11015/v3/namespaces/default/apps/XMLInvalidNodePathTest/versions/-SNAPSHOT/workflows/DataPipelineWorkflow/runs?status=COMPLETED&start=0&end=9223372036854775807&limit=2147483647
11-Nov-2018 11:34:46 2018-11-11 11:34:46,176 - INFO  [main:c.c.c.t.AudiTestBase$1@134] - Received response: [200] Response Body: []
11-Nov-2018 11:34:46 2018-11-11 11:34:46,227 - INFO  [main:c.c.c.t.AudiTestBase$1@125] - Making request: GET http://10.210.0.45:11015/v3/namespaces/default/apps/XMLInvalidNodePathTest/versions/-SNAPSHOT/workflows/DataPipelineWorkflow/runs?status=COMPLETED&start=0&end=9223372036854775807&limit=2147483647
11-Nov-2018 11:34:46 2018-11-11 11:34:46,314 - INFO  [main:c.c.c.t.AudiTestBase$1@134] - Received response: [200] Response Body: []
11-Nov-2018 11:34:46 2018-11-11 11:34:46,365 - INFO  [main:c.c.c.t.AudiTestBase$1@125] - Making request: GET http://10.210.0.45:11015/v3/namespaces/default/apps/XMLInvalidNodePathTest/versions/-SNAPSHOT/workflows/DataPipelineWorkflow/runs?status=COMPLETED&start=0&end=9223372036854775807&limit=2147483647
11-Nov-2018 11:34:46 2018-11-11 11:34:46,452 - INFO  [main:c.c.c.t.AudiTestBase$1@134] - Received response: [200] Response Body: []
11-Nov-2018 11:34:46 2018-11-11 11:34:46,503 - INFO  [main:c.c.c.t.AudiTestBase$1@125] - Making request: GET http://10.210.0.45:11015/v3/namespaces/default/apps/XMLInvalidNodePathTest/versions/-SNAPSHOT/workflows/DataPipelineWorkflow/runs?status=COMPLETED&start=0&end=9223372036854775807&limit=2147483647
11-Nov-2018 11:34:46 2018-11-11 11:34:46,590 - INFO  [main:c.c.c.t.AudiTestBase$1@134] - Received response: [200] Response Body: []
11-Nov-2018 11:34:46 2018-11-11 11:34:46,641 - INFO  [main:c.c.c.t.AudiTestBase$1@125] - Making request: GET http://10.210.0.45:11015/v3/namespaces/default/apps/XMLInvalidNodePathTest/versions/-SNAPSHOT/workflows/DataPipelineWorkflow/runs?status=COMPLETED&start=0&end=9223372036854775807&limit=2147483647
11-Nov-2018 11:34:46 2018-11-11 11:34:46,735 - INFO  [main:c.c.c.t.AudiTestBase$1@134] - Received response: [200] Response Body: []
11-Nov-2018 11:34:46 2018-11-11 11:34:46,786 - INFO  [main:c.c.c.t.AudiTestBase$1@125] - Making request: GET http://10.210.0.45:11015/v3/namespaces/default/apps/XMLInvalidNodePathTest/versions/-SNAPSHOT/workflows/DataPipelineWorkflow/runs?status=COMPLETED&start=0&end=9223372036854775807&limit=2147483647
11-Nov-2018 11:34:46 2018-11-11 11:34:46,874 - INFO  [main:c.c.c.t.AudiTestBase$1@134] - Received response: [200] Response Body: []
11-Nov-2018 11:34:46 2018-11-11 11:34:46,925 - INFO  [main:c.c.c.t.AudiTestBase$1@125] - Making request: GET http://10.210.0.45:11015/v3/namespaces/default/apps/XMLInvalidNodePathTest/versions/-SNAPSHOT/workflows/DataPipelineWorkflow/runs?status=COMPLETED&start=0&end=9223372036854775807&limit=2147483647
11-Nov-2018 11:34:47 2018-11-11 11:34:47,012 - INFO  [main:c.c.c.t.AudiTestBase$1@134] - Received response: [200] Response Body: []
11-Nov-2018 11:34:47 2018-11-11 11:34:47,063 - INFO  [main:c.c.c.t.AudiTestBase$1@125] - Making request: GET http://10.210.0.45:11015/v3/namespaces/default/apps/XMLInvalidNodePathTest/versions/-SNAPSHOT/workflows/DataPipelineWorkflow/runs?status=COMPLETED&start=0&end=9223372036854775807&limit=2147483647
11-Nov-2018 11:34:47 2018-11-11 11:34:47,152 - INFO  [main:c.c.c.t.AudiTestBase$1@134] - Received response: [200] Response Body: []
11-Nov-2018 11:34:47 2018-11-11 11:34:47,203 - INFO  [main:c.c.c.t.AudiTestBase$1@125] - Making request: GET http://10.210.0.45:11015/v3/namespaces/default/apps/XMLInvalidNodePathTest/versions/-SNAPSHOT/workflows/DataPipelineWorkflow/runs?status=COMPLETED&start=0&end=9223372036854775807&limit=2147483647
11-Nov-2018 11:34:47 2018-11-11 11:34:47,293 - INFO  [main:c.c.c.t.AudiTestBase$1@134] - Received response: [200] Response Body: []
11-Nov-2018 11:34:47 2018-11-11 11:34:47,343 - INFO  [main:c.c.c.t.AudiTestBase$1@125] - Making request: GET http://10.210.0.45:11015/v3/namespaces/default/apps/XMLInvalidNodePathTest/versions/-SNAPSHOT/workflows/DataPipelineWorkflow/runs?status=COMPLETED&start=0&end=9223372036854775807&limit=2147483647
11-Nov-2018 11:34:47 2018-11-11 11:34:47,431 - INFO  [main:c.c.c.t.AudiTestBase$1@134] - Received response: [200] Response Body: []
11-Nov-2018 11:34:47 2018-11-11 11:34:47,482 - INFO  [main:c.c.c.t.AudiTestBase$1@125] - Making request: GET http://10.210.0.45:11015/v3/namespaces/default/apps/XMLInvalidNodePathTest/versions/-SNAPSHOT/workflows/DataPipelineWorkflow/runs?status=COMPLETED&start=0&end=9223372036854775807&limit=2147483647
11-Nov-2018 11:34:47 2018-11-11 11:34:47,569 - INFO  [main:c.c.c.t.AudiTestBase$1@134] - Received response: [200] Response Body: []
11-Nov-2018 11:34:47 2018-11-11 11:34:47,620 - INFO  [main:c.c.c.t.AudiTestBase$1@125] - Making request: GET http://10.210.0.45:11015/v3/namespaces/default/apps/XMLInvalidNodePathTest/versions/-SNAPSHOT/workflows/DataPipelineWorkflow/runs?status=COMPLETED&start=0&end=9223372036854775807&limit=2147483647
11-Nov-2018 11:34:47 2018-11-11 11:34:47,708 - INFO  [main:c.c.c.t.AudiTestBase$1@134] - Received response: [200] Response Body: []
11-Nov-2018 11:34:47 2018-11-11 11:34:47,759 - INFO  [main:c.c.c.t.AudiTestBase$1@125] - Making request: GET http://10.210.0.45:11015/v3/namespaces/default/apps/XMLInvalidNodePathTest/versions/-SNAPSHOT/workflows/DataPipelineWorkflow/runs?status=COMPLETED&start=0&end=9223372036854775807&limit=2147483647
11-Nov-2018 11:34:47 2018-11-11 11:34:47,848 - INFO  [main:c.c.c.t.AudiTestBase$1@134] - Received response: [200] Response Body: []
11-Nov-2018 11:34:47 2018-11-11 11:34:47,899 - INFO  [main:c.c.c.t.AudiTestBase$1@125] - Making request: GET http://10.210.0.45:11015/v3/namespaces/default/apps/XMLInvalidNodePathTest/versions/-SNAPSHOT/workflows/DataPipelineWorkflow/runs?status=COMPLETED&start=0&end=9223372036854775807&limit=2147483647
11-Nov-2018 11:34:47 2018-11-11 11:34:47,988 - INFO  [main:c.c.c.t.AudiTestBase$1@134] - Received response: [200] Response Body: []
11-Nov-2018 11:34:48 2018-11-11 11:34:48,038 - INFO  [main:c.c.c.t.AudiTestBase$1@125] - Making request: GET http://10.210.0.45:11015/v3/namespaces/default/apps/XMLInvalidNodePathTest/versions/-SNAPSHOT/workflows/DataPipelineWorkflow/runs?status=COMPLETED&start=0&end=9223372036854775807&limit=2147483647
11-Nov-2018 11:34:48 2018-11-11 11:34:48,127 - INFO  [main:c.c.c.t.AudiTestBase$1@134] - Received response: [200] Response Body: []
11-Nov-2018 11:34:48 2018-11-11 11:34:48,178 - INFO  [main:c.c.c.t.AudiTestBase$1@125] - Making request: GET http://10.210.0.45:11015/v3/namespaces/default/apps/XMLInvalidNodePathTest/versions/-SNAPSHOT/workflows/DataPipelineWorkflow/runs?status=COMPLETED&start=0&end=9223372036854775807&limit=2147483647
11-Nov-2018 11:34:48 2018-11-11 11:34:48,266 - INFO  [main:c.c.c.t.AudiTestBase$1@134] - Received response: [200] Response Body: []
11-Nov-2018 11:34:48 2018-11-11 11:34:48,317 - INFO  [main:c.c.c.t.AudiTestBase$1@125] - Making request: GET http://10.210.0.45:11015/v3/namespaces/default/apps/XMLInvalidNodePathTest/versions/-SNAPSHOT/workflows/DataPipelineWorkflow/runs?status=COMPLETED&start=0&end=9223372036854775807&limit=2147483647
11-Nov-2018 11:34:48 2018-11-11 11:34:48,405 - INFO  [main:c.c.c.t.AudiTestBase$1@134] - Received response: [200] Response Body: []
11-Nov-2018 11:34:48 2018-11-11 11:34:48,456 - INFO  [main:c.c.c.t.AudiTestBase$1@125] - Making request: GET http://10.210.0.45:11015/v3/namespaces/default/apps/XMLInvalidNodePathTest/versions/-SNAPSHOT/workflows/DataPipelineWorkflow/runs?status=COMPLETED&start=0&end=9223372036854775807&limit=2147483647
11-Nov-2018 11:34:48 2018-11-11 11:34:48,544 - INFO  [main:c.c.c.t.AudiTestBase$1@134] - Received response: [200] Response Body: []
11-Nov-2018 11:34:48 2018-11-11 11:34:48,594 - INFO  [main:c.c.c.t.AudiTestBase$1@125] - Making request: GET http://10.210.0.45:11015/v3/namespaces/default/apps/XMLInvalidNodePathTest/versions/-SNAPSHOT/workflows/DataPipelineWorkflow/runs?status=COMPLETED&start=0&end=9223372036854775807&limit=2147483647
11-Nov-2018 11:34:48 2018-11-11 11:34:48,703 - INFO  [main:c.c.c.t.AudiTestBase$1@134] - Received response: [200] Response Body: []
11-Nov-2018 11:34:48 2018-11-11 11:34:48,753 - INFO  [main:c.c.c.t.AudiTestBase$1@125] - Making request: GET http://10.210.0.45:11015/v3/namespaces/default/apps/XMLInvalidNodePathTest/versions/-SNAPSHOT/workflows/DataPipelineWorkflow/runs?status=COMPLETED&start=0&end=9223372036854775807&limit=2147483647
11-Nov-2018 11:34:48 2018-11-11 11:34:48,843 - INFO  [main:c.c.c.t.AudiTestBase$1@134] - Received response: [200] Response Body: []
11-Nov-2018 11:34:48 2018-11-11 11:34:48,894 - INFO  [main:c.c.c.t.AudiTestBase$1@125] - Making request: GET http://10.210.0.45:11015/v3/namespaces/default/apps/XMLInvalidNodePathTest/versions/-SNAPSHOT/workflows/DataPipelineWorkflow/runs?status=COMPLETED&start=0&end=9223372036854775807&limit=2147483647
11-Nov-2018 11:34:48 2018-11-11 11:34:48,985 - INFO  [main:c.c.c.t.AudiTestBase$1@134] - Received response: [200] Response Body: []
11-Nov-2018 11:34:49 2018-11-11 11:34:49,036 - INFO  [main:c.c.c.t.AudiTestBase$1@125] - Making request: GET http://10.210.0.45:11015/v3/namespaces/default/apps/XMLInvalidNodePathTest/versions/-SNAPSHOT/workflows/DataPipelineWorkflow/runs?status=COMPLETED&start=0&end=9223372036854775807&limit=2147483647
11-Nov-2018 11:34:49 2018-11-11 11:34:49,126 - INFO  [main:c.c.c.t.AudiTestBase$1@134] - Received response: [200] Response Body: []
11-Nov-2018 11:34:49 2018-11-11 11:34:49,177 - INFO  [main:c.c.c.t.AudiTestBase$1@125] - Making request: GET http://10.210.0.45:11015/v3/namespaces/default/apps/XMLInvalidNodePathTest/versions/-SNAPSHOT/workflows/DataPipelineWorkflow/runs?status=COMPLETED&start=0&end=9223372036854775807&limit=2147483647
11-Nov-2018 11:34:49 2018-11-11 11:34:49,266 - INFO  [main:c.c.c.t.AudiTestBase$1@134] - Received response: [200] Response Body: []
11-Nov-2018 11:34:49 2018-11-11 11:34:49,317 - INFO  [main:c.c.c.t.AudiTestBase$1@125] - Making request: GET http://10.210.0.45:11015/v3/namespaces/default/apps/XMLInvalidNodePathTest/versions/-SNAPSHOT/workflows/DataPipelineWorkflow/runs?status=COMPLETED&start=0&end=9223372036854775807&limit=2147483647
11-Nov-2018 11:34:49 2018-11-11 11:34:49,405 - INFO  [main:c.c.c.t.AudiTestBase$1@134] - Received response: [200] Response Body: []
11-Nov-2018 11:34:49 2018-11-11 11:34:49,456 - INFO  [main:c.c.c.t.AudiTestBase$1@125] - Making request: GET http://10.210.0.45:11015/v3/namespaces/default/apps/XMLInvalidNodePathTest/versions/-SNAPSHOT/workflows/DataPipelineWorkflow/runs?status=COMPLETED&start=0&end=9223372036854775807&limit=2147483647
11-Nov-2018 11:34:49 2018-11-11 11:34:49,544 - INFO  [main:c.c.c.t.AudiTestBase$1@134] - Received response: [200] Response Body: []
11-Nov-2018 11:34:49 2018-11-11 11:34:49,594 - INFO  [main:c.c.c.t.AudiTestBase$1@125] - Making request: GET http://10.210.0.45:11015/v3/namespaces/default/apps/XMLInvalidNodePathTest/versions/-SNAPSHOT/workflows/DataPipelineWorkflow/runs?status=COMPLETED&start=0&end=9223372036854775807&limit=2147483647
11-Nov-2018 11:34:49 2018-11-11 11:34:49,682 - INFO  [main:c.c.c.t.AudiTestBase$1@134] - Received response: [200] Response Body: []
11-Nov-2018 11:34:49 2018-11-11 11:34:49,733 - INFO  [main:c.c.c.t.AudiTestBase$1@125] - Making request: GET http://10.210.0.45:11015/v3/namespaces/default/apps/XMLInvalidNodePathTest/versions/-SNAPSHOT/workflows/DataPipelineWorkflow/runs?status=COMPLETED&start=0&end=9223372036854775807&limit=2147483647
11-Nov-2018 11:34:49 2018-11-11 11:34:49,821 - INFO  [main:c.c.c.t.AudiTestBase$1@134] - Received response: [200] Response Body: []
11-Nov-2018 11:34:49 2018-11-11 11:34:49,872 - INFO  [main:c.c.c.t.AudiTestBase$1@125] - Making request: GET http://10.210.0.45:11015/v3/namespaces/default/apps/XMLInvalidNodePathTest/versions/-SNAPSHOT/workflows/DataPipelineWorkflow/runs?status=COMPLETED&start=0&end=9223372036854775807&limit=2147483647
11-Nov-2018 11:34:49 2018-11-11 11:34:49,959 - INFO  [main:c.c.c.t.AudiTestBase$1@134] - Received response: [200] Response Body: []
11-Nov-2018 11:34:50 2018-11-11 11:34:50,010 - INFO  [main:c.c.c.t.AudiTestBase$1@125] - Making request: GET http://10.210.0.45:11015/v3/namespaces/default/apps/XMLInvalidNodePathTest/versions/-SNAPSHOT/workflows/DataPipelineWorkflow/runs?status=COMPLETED&start=0&end=9223372036854775807&limit=2147483647
11-Nov-2018 11:34:50 2018-11-11 11:34:50,098 - INFO  [main:c.c.c.t.AudiTestBase$1@134] - Received response: [200] Response Body: []
11-Nov-2018 11:34:50 2018-11-11 11:34:50,149 - INFO  [main:c.c.c.t.AudiTestBase$1@125] - Making request: GET http://10.210.0.45:11015/v3/namespaces/default/apps/XMLInvalidNodePathTest/versions/-SNAPSHOT/workflows/DataPipelineWorkflow/runs?status=COMPLETED&start=0&end=9223372036854775807&limit=2147483647
11-Nov-2018 11:34:50 2018-11-11 11:34:50,237 - INFO  [main:c.c.c.t.AudiTestBase$1@134] - Received response: [200] Response Body: []
11-Nov-2018 11:34:50 2018-11-11 11:34:50,288 - INFO  [main:c.c.c.t.AudiTestBase$1@125] - Making request: GET http://10.210.0.45:11015/v3/namespaces/default/apps/XMLInvalidNodePathTest/versions/-SNAPSHOT/workflows/DataPipelineWorkflow/runs?status=COMPLETED&start=0&end=9223372036854775807&limit=2147483647
11-Nov-2018 11:34:50 2018-11-11 11:34:50,375 - INFO  [main:c.c.c.t.AudiTestBase$1@134] - Received response: [200] Response Body: []
11-Nov-2018 11:34:50 2018-11-11 11:34:50,426 - INFO  [main:c.c.c.t.AudiTestBase$1@125] - Making request: GET http://10.210.0.45:11015/v3/namespaces/default/apps/XMLInvalidNodePathTest/versions/-SNAPSHOT/workflows/DataPipelineWorkflow/runs?status=COMPLETED&start=0&end=9223372036854775807&limit=2147483647
11-Nov-2018 11:34:50 2018-11-11 11:34:50,515 - INFO  [main:c.c.c.t.AudiTestBase$1@134] - Received response: [200] Response Body: []
11-Nov-2018 11:34:50 2018-11-11 11:34:50,566 - INFO  [main:c.c.c.t.AudiTestBase$1@125] - Making request: GET http://10.210.0.45:11015/v3/namespaces/default/apps/XMLInvalidNodePathTest/versions/-SNAPSHOT/workflows/DataPipelineWorkflow/runs?status=COMPLETED&start=0&end=9223372036854775807&limit=2147483647
11-Nov-2018 11:34:50 2018-11-11 11:34:50,654 - INFO  [main:c.c.c.t.AudiTestBase$1@134] - Received response: [200] Response Body: []
11-Nov-2018 11:34:50 2018-11-11 11:34:50,705 - INFO  [main:c.c.c.t.AudiTestBase$1@125] - Making request: GET http://10.210.0.45:11015/v3/namespaces/default/apps/XMLInvalidNodePathTest/versions/-SNAPSHOT/workflows/DataPipelineWorkflow/runs?status=COMPLETED&start=0&end=9223372036854775807&limit=2147483647
11-Nov-2018 11:34:50 2018-11-11 11:34:50,799 - INFO  [main:c.c.c.t.AudiTestBase$1@134] - Received response: [200] Response Body: []
11-Nov-2018 11:34:50 2018-11-11 11:34:50,849 - INFO  [main:c.c.c.t.AudiTestBase$1@125] - Making request: GET http://10.210.0.45:11015/v3/namespaces/default/apps/XMLInvalidNodePathTest/versions/-SNAPSHOT/workflows/DataPipelineWorkflow/runs?status=COMPLETED&start=0&end=9223372036854775807&limit=2147483647
11-Nov-2018 11:34:50 2018-11-11 11:34:50,937 - INFO  [main:c.c.c.t.AudiTestBase$1@134] - Received response: [200] Response Body: []
11-Nov-2018 11:34:50 2018-11-11 11:34:50,988 - INFO  [main:c.c.c.t.AudiTestBase$1@125] - Making request: GET http://10.210.0.45:11015/v3/namespaces/default/apps/XMLInvalidNodePathTest/versions/-SNAPSHOT/workflows/DataPipelineWorkflow/runs?status=COMPLETED&start=0&end=9223372036854775807&limit=2147483647
11-Nov-2018 11:34:51 2018-11-11 11:34:51,076 - INFO  [main:c.c.c.t.AudiTestBase$1@134] - Received response: [200] Response Body: []
11-Nov-2018 11:34:51 2018-11-11 11:34:51,127 - INFO  [main:c.c.c.t.AudiTestBase$1@125] - Making request: GET http://10.210.0.45:11015/v3/namespaces/default/apps/XMLInvalidNodePathTest/versions/-SNAPSHOT/workflows/DataPipelineWorkflow/runs?status=COMPLETED&start=0&end=9223372036854775807&limit=2147483647
11-Nov-2018 11:34:51 2018-11-11 11:34:51,216 - INFO  [main:c.c.c.t.AudiTestBase$1@134] - Received response: [200] Response Body: []
11-Nov-2018 11:34:51 2018-11-11 11:34:51,267 - INFO  [main:c.c.c.t.AudiTestBase$1@125] - Making request: GET http://10.210.0.45:11015/v3/namespaces/default/apps/XMLInvalidNodePathTest/versions/-SNAPSHOT/workflows/DataPipelineWorkflow/runs?status=COMPLETED&start=0&end=9223372036854775807&limit=2147483647
11-Nov-2018 11:34:51 2018-11-11 11:34:51,356 - INFO  [main:c.c.c.t.AudiTestBase$1@134] - Received response: [200] Response Body: []
11-Nov-2018 11:34:51 2018-11-11 11:34:51,407 - INFO  [main:c.c.c.t.AudiTestBase$1@125] - Making request: GET http://10.210.0.45:11015/v3/namespaces/default/apps/XMLInvalidNodePathTest/versions/-SNAPSHOT/workflows/DataPipelineWorkflow/runs?status=COMPLETED&start=0&end=9223372036854775807&limit=2147483647
11-Nov-2018 11:34:51 2018-11-11 11:34:51,496 - INFO  [main:c.c.c.t.AudiTestBase$1@134] - Received response: [200] Response Body: []
11-Nov-2018 11:34:51 2018-11-11 11:34:51,546 - INFO  [main:c.c.c.t.AudiTestBase$1@125] - Making request: GET http://10.210.0.45:11015/v3/namespaces/default/apps/XMLInvalidNodePathTest/versions/-SNAPSHOT/workflows/DataPipelineWorkflow/runs?status=COMPLETED&start=0&end=9223372036854775807&limit=2147483647
11-Nov-2018 11:34:51 2018-11-11 11:34:51,634 - INFO  [main:c.c.c.t.AudiTestBase$1@134] - Received response: [200] Response Body: []
11-Nov-2018 11:34:51 2018-11-11 11:34:51,685 - INFO  [main:c.c.c.t.AudiTestBase$1@125] - Making request: GET http://10.210.0.45:11015/v3/namespaces/default/apps/XMLInvalidNodePathTest/versions/-SNAPSHOT/workflows/DataPipelineWorkflow/runs?status=COMPLETED&start=0&end=9223372036854775807&limit=2147483647
11-Nov-2018 11:34:51 2018-11-11 11:34:51,774 - INFO  [main:c.c.c.t.AudiTestBase$1@134] - Received response: [200] Response Body: []
11-Nov-2018 11:34:51 2018-11-11 11:34:51,825 - INFO  [main:c.c.c.t.AudiTestBase$1@125] - Making request: GET http://10.210.0.45:11015/v3/namespaces/default/apps/XMLInvalidNodePathTest/versions/-SNAPSHOT/workflows/DataPipelineWorkflow/runs?status=COMPLETED&start=0&end=9223372036854775807&limit=2147483647
11-Nov-2018 11:34:51 2018-11-11 11:34:51,921 - INFO  [main:c.c.c.t.AudiTestBase$1@134] - Received response: [200] Response Body: []
11-Nov-2018 11:34:51 2018-11-11 11:34:51,972 - INFO  [main:c.c.c.t.AudiTestBase$1@125] - Making request: GET http://10.210.0.45:11015/v3/namespaces/default/apps/XMLInvalidNodePathTest/versions/-SNAPSHOT/workflows/DataPipelineWorkflow/runs?status=COMPLETED&start=0&end=9223372036854775807&limit=2147483647
11-Nov-2018 11:34:52 2018-11-11 11:34:52,059 - INFO  [main:c.c.c.t.AudiTestBase$1@134] - Received response: [200] Response Body: []
11-Nov-2018 11:34:52 2018-11-11 11:34:52,110 - INFO  [main:c.c.c.t.AudiTestBase$1@125] - Making request: GET http://10.210.0.45:11015/v3/namespaces/default/apps/XMLInvalidNodePathTest/versions/-SNAPSHOT/workflows/DataPipelineWorkflow/runs?status=COMPLETED&start=0&end=9223372036854775807&limit=2147483647
11-Nov-2018 11:34:52 2018-11-11 11:34:52,198 - INFO  [main:c.c.c.t.AudiTestBase$1@134] - Received response: [200] Response Body: []
11-Nov-2018 11:34:52 2018-11-11 11:34:52,249 - INFO  [main:c.c.c.t.AudiTestBase$1@125] - Making request: GET http://10.210.0.45:11015/v3/namespaces/default/apps/XMLInvalidNodePathTest/versions/-SNAPSHOT/workflows/DataPipelineWorkflow/runs?status=COMPLETED&start=0&end=9223372036854775807&limit=2147483647
11-Nov-2018 11:34:52 2018-11-11 11:34:52,338 - INFO  [main:c.c.c.t.AudiTestBase$1@134] - Received response: [200] Response Body: []
11-Nov-2018 11:34:52 2018-11-11 11:34:52,389 - INFO  [main:c.c.c.t.AudiTestBase$1@125] - Making request: GET http://10.210.0.45:11015/v3/namespaces/default/apps/XMLInvalidNodePathTest/versions/-SNAPSHOT/workflows/DataPipelineWorkflow/runs?status=COMPLETED&start=0&end=9223372036854775807&limit=2147483647
11-Nov-2018 11:34:52 2018-11-11 11:34:52,478 - INFO  [main:c.c.c.t.AudiTestBase$1@134] - Received response: [200] Response Body: []
11-Nov-2018 11:34:52 2018-11-11 11:34:52,529 - INFO  [main:c.c.c.t.AudiTestBase$1@125] - Making request: GET http://10.210.0.45:11015/v3/namespaces/default/apps/XMLInvalidNodePathTest/versions/-SNAPSHOT/workflows/DataPipelineWorkflow/runs?status=COMPLETED&start=0&end=9223372036854775807&limit=2147483647
11-Nov-2018 11:34:52 2018-11-11 11:34:52,616 - INFO  [main:c.c.c.t.AudiTestBase$1@134] - Received response: [200] Response Body: []
11-Nov-2018 11:34:52 2018-11-11 11:34:52,667 - INFO  [main:c.c.c.t.AudiTestBase$1@125] - Making request: GET http://10.210.0.45:11015/v3/namespaces/default/apps/XMLInvalidNodePathTest/versions/-SNAPSHOT/workflows/DataPipelineWorkflow/runs?status=COMPLETED&start=0&end=9223372036854775807&limit=2147483647
11-Nov-2018 11:34:52 2018-11-11 11:34:52,755 - INFO  [main:c.c.c.t.AudiTestBase$1@134] - Received response: [200] Response Body: []
11-Nov-2018 11:34:52 2018-11-11 11:34:52,805 - INFO  [main:c.c.c.t.AudiTestBase$1@125] - Making request: GET http://10.210.0.45:11015/v3/namespaces/default/apps/XMLInvalidNodePathTest/versions/-SNAPSHOT/workflows/DataPipelineWorkflow/runs?status=COMPLETED&start=0&end=9223372036854775807&limit=2147483647
11-Nov-2018 11:34:52 2018-11-11 11:34:52,897 - INFO  [main:c.c.c.t.AudiTestBase$1@134] - Received response: [200] Response Body: []
11-Nov-2018 11:34:52 2018-11-11 11:34:52,947 - INFO  [main:c.c.c.t.AudiTestBase$1@125] - Making request: GET http://10.210.0.45:11015/v3/namespaces/default/apps/XMLInvalidNodePathTest/versions/-SNAPSHOT/workflows/DataPipelineWorkflow/runs?status=COMPLETED&start=0&end=9223372036854775807&limit=2147483647
11-Nov-2018 11:34:53 2018-11-11 11:34:53,037 - INFO  [main:c.c.c.t.AudiTestBase$1@134] - Received response: [200] Response Body: []
11-Nov-2018 11:34:53 2018-11-11 11:34:53,087 - INFO  [main:c.c.c.t.AudiTestBase$1@125] - Making request: GET http://10.210.0.45:11015/v3/namespaces/default/apps/XMLInvalidNodePathTest/versions/-SNAPSHOT/workflows/DataPipelineWorkflow/runs?status=COMPLETED&start=0&end=9223372036854775807&limit=2147483647
11-Nov-2018 11:34:53 2018-11-11 11:34:53,174 - INFO  [main:c.c.c.t.AudiTestBase$1@134] - Received response: [200] Response Body: []
11-Nov-2018 11:34:53 2018-11-11 11:34:53,225 - INFO  [main:c.c.c.t.AudiTestBase$1@125] - Making request: GET http://10.210.0.45:11015/v3/namespaces/default/apps/XMLInvalidNodePathTest/versions/-SNAPSHOT/workflows/DataPipelineWorkflow/runs?status=COMPLETED&start=0&end=9223372036854775807&limit=2147483647
11-Nov-2018 11:34:53 2018-11-11 11:34:53,316 - INFO  [main:c.c.c.t.AudiTestBase$1@134] - Received response: [200] Response Body: []
11-Nov-2018 11:34:53 2018-11-11 11:34:53,367 - INFO  [main:c.c.c.t.AudiTestBase$1@125] - Making request: GET http://10.210.0.45:11015/v3/namespaces/default/apps/XMLInvalidNodePathTest/versions/-SNAPSHOT/workflows/DataPipelineWorkflow/runs?status=COMPLETED&start=0&end=9223372036854775807&limit=2147483647
11-Nov-2018 11:34:53 2018-11-11 11:34:53,455 - INFO  [main:c.c.c.t.AudiTestBase$1@134] - Received response: [200] Response Body: []
11-Nov-2018 11:34:53 2018-11-11 11:34:53,506 - INFO  [main:c.c.c.t.AudiTestBase$1@125] - Making request: GET http://10.210.0.45:11015/v3/namespaces/default/apps/XMLInvalidNodePathTest/versions/-SNAPSHOT/workflows/DataPipelineWorkflow/runs?status=COMPLETED&start=0&end=9223372036854775807&limit=2147483647
11-Nov-2018 11:34:53 2018-11-11 11:34:53,594 - INFO  [main:c.c.c.t.AudiTestBase$1@134] - Received response: [200] Response Body: []
11-Nov-2018 11:34:53 2018-11-11 11:34:53,644 - INFO  [main:c.c.c.t.AudiTestBase$1@125] - Making request: GET http://10.210.0.45:11015/v3/namespaces/default/apps/XMLInvalidNodePathTest/versions/-SNAPSHOT/workflows/DataPipelineWorkflow/runs?status=COMPLETED&start=0&end=9223372036854775807&limit=2147483647
11-Nov-2018 11:34:53 2018-11-11 11:34:53,732 - INFO  [main:c.c.c.t.AudiTestBase$1@134] - Received response: [200] Response Body: []
11-Nov-2018 11:34:53 2018-11-11 11:34:53,783 - INFO  [main:c.c.c.t.AudiTestBase$1@125] - Making request: GET http://10.210.0.45:11015/v3/namespaces/default/apps/XMLInvalidNodePathTest/versions/-SNAPSHOT/workflows/DataPipelineWorkflow/runs?status=COMPLETED&start=0&end=9223372036854775807&limit=2147483647
11-Nov-2018 11:34:53 2018-11-11 11:34:53,870 - INFO  [main:c.c.c.t.AudiTestBase$1@134] - Received response: [200] Response Body: []
11-Nov-2018 11:34:53 2018-11-11 11:34:53,921 - INFO  [main:c.c.c.t.AudiTestBase$1@125] - Making request: GET http://10.210.0.45:11015/v3/namespaces/default/apps/XMLInvalidNodePathTest/versions/-SNAPSHOT/workflows/DataPipelineWorkflow/runs?status=COMPLETED&start=0&end=9223372036854775807&limit=2147483647
11-Nov-2018 11:34:54 2018-11-11 11:34:54,009 - INFO  [main:c.c.c.t.AudiTestBase$1@134] - Received response: [200] Response Body: []
11-Nov-2018 11:34:54 2018-11-11 11:34:54,059 - INFO  [main:c.c.c.t.AudiTestBase$1@125] - Making request: GET http://10.210.0.45:11015/v3/namespaces/default/apps/XMLInvalidNodePathTest/versions/-SNAPSHOT/workflows/DataPipelineWorkflow/runs?status=COMPLETED&start=0&end=9223372036854775807&limit=2147483647
11-Nov-2018 11:34:54 2018-11-11 11:34:54,148 - INFO  [main:c.c.c.t.AudiTestBase$1@134] - Received response: [200] Response Body: []
11-Nov-2018 11:34:54 2018-11-11 11:34:54,199 - INFO  [main:c.c.c.t.AudiTestBase$1@125] - Making request: GET http://10.210.0.45:11015/v3/namespaces/default/apps/XMLInvalidNodePathTest/versions/-SNAPSHOT/workflows/DataPipelineWorkflow/runs?status=COMPLETED&start=0&end=9223372036854775807&limit=2147483647
11-Nov-2018 11:34:54 2018-11-11 11:34:54,291 - INFO  [main:c.c.c.t.AudiTestBase$1@134] - Received response: [200] Response Body: []
11-Nov-2018 11:34:54 2018-11-11 11:34:54,342 - INFO  [main:c.c.c.t.AudiTestBase$1@125] - Making request: GET http://10.210.0.45:11015/v3/namespaces/default/apps/XMLInvalidNodePathTest/versions/-SNAPSHOT/workflows/DataPipelineWorkflow/runs?status=COMPLETED&start=0&end=9223372036854775807&limit=2147483647
11-Nov-2018 11:34:54 2018-11-11 11:34:54,431 - INFO  [main:c.c.c.t.AudiTestBase$1@134] - Received response: [200] Response Body: []
11-Nov-2018 11:34:54 2018-11-11 11:34:54,482 - INFO  [main:c.c.c.t.AudiTestBase$1@125] - Making request: GET http://10.210.0.45:11015/v3/namespaces/default/apps/XMLInvalidNodePathTest/versions/-SNAPSHOT/workflows/DataPipelineWorkflow/runs?status=COMPLETED&start=0&end=9223372036854775807&limit=2147483647
11-Nov-2018 11:34:54 2018-11-11 11:34:54,571 - INFO  [main:c.c.c.t.AudiTestBase$1@134] - Received response: [200] Response Body: []
11-Nov-2018 11:34:54 2018-11-11 11:34:54,622 - INFO  [main:c.c.c.t.AudiTestBase$1@125] - Making request: GET http://10.210.0.45:11015/v3/namespaces/default/apps/XMLInvalidNodePathTest/versions/-SNAPSHOT/workflows/DataPipelineWorkflow/runs?status=COMPLETED&start=0&end=9223372036854775807&limit=2147483647
11-Nov-2018 11:34:54 2018-11-11 11:34:54,710 - INFO  [main:c.c.c.t.AudiTestBase$1@134] - Received response: [200] Response Body: []
11-Nov-2018 11:34:54 2018-11-11 11:34:54,761 - INFO  [main:c.c.c.t.AudiTestBase$1@125] - Making request: GET http://10.210.0.45:11015/v3/namespaces/default/apps/XMLInvalidNodePathTest/versions/-SNAPSHOT/workflows/DataPipelineWorkflow/runs?status=COMPLETED&start=0&end=9223372036854775807&limit=2147483647
11-Nov-2018 11:34:54 2018-11-11 11:34:54,851 - INFO  [main:c.c.c.t.AudiTestBase$1@134] - Received response: [200] Response Body: []
11-Nov-2018 11:34:54 2018-11-11 11:34:54,902 - INFO  [main:c.c.c.t.AudiTestBase$1@125] - Making request: GET http://10.210.0.45:11015/v3/namespaces/default/apps/XMLInvalidNodePathTest/versions/-SNAPSHOT/workflows/DataPipelineWorkflow/runs?status=COMPLETED&start=0&end=9223372036854775807&limit=2147483647
11-Nov-2018 11:34:55 2018-11-11 11:34:55,094 - INFO  [main:c.c.c.t.AudiTestBase$1@134] - Received response: [200] Response Body: []
11-Nov-2018 11:34:55 2018-11-11 11:34:55,145 - INFO  [main:c.c.c.t.AudiTestBase$1@125] - Making request: GET http://10.210.0.45:11015/v3/namespaces/default/apps/XMLInvalidNodePathTest/versions/-SNAPSHOT/workflows/DataPipelineWorkflow/runs?status=COMPLETED&start=0&end=9223372036854775807&limit=2147483647
11-Nov-2018 11:34:55 2018-11-11 11:34:55,235 - INFO  [main:c.c.c.t.AudiTestBase$1@134] - Received response: [200] Response Body: []
11-Nov-2018 11:34:55 2018-11-11 11:34:55,286 - INFO  [main:c.c.c.t.AudiTestBase$1@125] - Making request: GET http://10.210.0.45:11015/v3/namespaces/default/apps/XMLInvalidNodePathTest/versions/-SNAPSHOT/workflows/DataPipelineWorkflow/runs?status=COMPLETED&start=0&end=9223372036854775807&limit=2147483647
11-Nov-2018 11:34:55 2018-11-11 11:34:55,588 - INFO  [main:c.c.c.t.AudiTestBase$1@134] - Received response: [200] Response Body: []
11-Nov-2018 11:34:55 2018-11-11 11:34:55,639 - INFO  [main:c.c.c.t.AudiTestBase$1@125] - Making request: GET http://10.210.0.45:11015/v3/namespaces/default/apps/XMLInvalidNodePathTest/versions/-SNAPSHOT/workflows/DataPipelineWorkflow/runs?status=COMPLETED&start=0&end=9223372036854775807&limit=2147483647
11-Nov-2018 11:34:55 2018-11-11 11:34:55,727 - INFO  [main:c.c.c.t.AudiTestBase$1@134] - Received response: [200] Response Body: []
11-Nov-2018 11:34:55 2018-11-11 11:34:55,777 - INFO  [main:c.c.c.t.AudiTestBase$1@125] - Making request: GET http://10.210.0.45:11015/v3/namespaces/default/apps/XMLInvalidNodePathTest/versions/-SNAPSHOT/workflows/DataPipelineWorkflow/runs?status=COMPLETED&start=0&end=9223372036854775807&limit=2147483647
11-Nov-2018 11:34:55 2018-11-11 11:34:55,867 - INFO  [main:c.c.c.t.AudiTestBase$1@134] - Received response: [200] Response Body: []
11-Nov-2018 11:34:55 2018-11-11 11:34:55,918 - INFO  [main:c.c.c.t.AudiTestBase$1@125] - Making request: GET http://10.210.0.45:11015/v3/namespaces/default/apps/XMLInvalidNodePathTest/versions/-SNAPSHOT/workflows/DataPipelineWorkflow/runs?status=COMPLETED&start=0&end=9223372036854775807&limit=2147483647
11-Nov-2018 11:34:56 2018-11-11 11:34:56,006 - INFO  [main:c.c.c.t.AudiTestBase$1@134] - Received response: [200] Response Body: []
11-Nov-2018 11:34:56 2018-11-11 11:34:56,057 - INFO  [main:c.c.c.t.AudiTestBase$1@125] - Making request: GET http://10.210.0.45:11015/v3/namespaces/default/apps/XMLInvalidNodePathTest/versions/-SNAPSHOT/workflows/DataPipelineWorkflow/runs?status=COMPLETED&start=0&end=9223372036854775807&limit=2147483647
11-Nov-2018 11:34:56 2018-11-11 11:34:56,147 - INFO  [main:c.c.c.t.AudiTestBase$1@134] - Received response: [200] Response Body: []
11-Nov-2018 11:34:56 2018-11-11 11:34:56,197 - INFO  [main:c.c.c.t.AudiTestBase$1@125] - Making request: GET http://10.210.0.45:11015/v3/namespaces/default/apps/XMLInvalidNodePathTest/versions/-SNAPSHOT/workflows/DataPipelineWorkflow/runs?status=COMPLETED&start=0&end=9223372036854775807&limit=2147483647
11-Nov-2018 11:34:56 2018-11-11 11:34:56,286 - INFO  [main:c.c.c.t.AudiTestBase$1@134] - Received response: [200] Response Body: []
11-Nov-2018 11:34:56 2018-11-11 11:34:56,337 - INFO  [main:c.c.c.t.AudiTestBase$1@125] - Making request: GET http://10.210.0.45:11015/v3/namespaces/default/apps/XMLInvalidNodePathTest/versions/-SNAPSHOT/workflows/DataPipelineWorkflow/runs?status=COMPLETED&start=0&end=9223372036854775807&limit=2147483647
11-Nov-2018 11:34:56 2018-11-11 11:34:56,427 - INFO  [main:c.c.c.t.AudiTestBase$1@134] - Received response: [200] Response Body: []
11-Nov-2018 11:34:56 2018-11-11 11:34:56,478 - INFO  [main:c.c.c.t.AudiTestBase$1@125] - Making request: GET http://10.210.0.45:11015/v3/namespaces/default/apps/XMLInvalidNodePathTest/versions/-SNAPSHOT/workflows/DataPipelineWorkflow/runs?status=COMPLETED&start=0&end=9223372036854775807&limit=2147483647
11-Nov-2018 11:34:56 2018-11-11 11:34:56,566 - INFO  [main:c.c.c.t.AudiTestBase$1@134] - Received response: [200] Response Body: []
11-Nov-2018 11:34:56 2018-11-11 11:34:56,616 - INFO  [main:c.c.c.t.AudiTestBase$1@125] - Making request: GET http://10.210.0.45:11015/v3/namespaces/default/apps/XMLInvalidNodePathTest/versions/-SNAPSHOT/workflows/DataPipelineWorkflow/runs?status=COMPLETED&start=0&end=9223372036854775807&limit=2147483647
11-Nov-2018 11:34:56 2018-11-11 11:34:56,706 - INFO  [main:c.c.c.t.AudiTestBase$1@134] - Received response: [200] Response Body: []
11-Nov-2018 11:34:56 2018-11-11 11:34:56,757 - INFO  [main:c.c.c.t.AudiTestBase$1@125] - Making request: GET http://10.210.0.45:11015/v3/namespaces/default/apps/XMLInvalidNodePathTest/versions/-SNAPSHOT/workflows/DataPipelineWorkflow/runs?status=COMPLETED&start=0&end=9223372036854775807&limit=2147483647
11-Nov-2018 11:34:56 2018-11-11 11:34:56,844 - INFO  [main:c.c.c.t.AudiTestBase$1@134] - Received response: [200] Response Body: []
11-Nov-2018 11:34:56 2018-11-11 11:34:56,895 - INFO  [main:c.c.c.t.AudiTestBase$1@125] - Making request: GET http://10.210.0.45:11015/v3/namespaces/default/apps/XMLInvalidNodePathTest/versions/-SNAPSHOT/workflows/DataPipelineWorkflow/runs?status=COMPLETED&start=0&end=9223372036854775807&limit=2147483647
11-Nov-2018 11:34:56 2018-11-11 11:34:56,983 - INFO  [main:c.c.c.t.AudiTestBase$1@134] - Received response: [200] Response Body: []
11-Nov-2018 11:34:57 2018-11-11 11:34:57,033 - INFO  [main:c.c.c.t.AudiTestBase$1@125] - Making request: GET http://10.210.0.45:11015/v3/namespaces/default/apps/XMLInvalidNodePathTest/versions/-SNAPSHOT/workflows/DataPipelineWorkflow/runs?status=COMPLETED&start=0&end=9223372036854775807&limit=2147483647
11-Nov-2018 11:34:57 2018-11-11 11:34:57,123 - INFO  [main:c.c.c.t.AudiTestBase$1@134] - Received response: [200] Response Body: []
11-Nov-2018 11:34:57 2018-11-11 11:34:57,174 - INFO  [main:c.c.c.t.AudiTestBase$1@125] - Making request: GET http://10.210.0.45:11015/v3/namespaces/default/apps/XMLInvalidNodePathTest/versions/-SNAPSHOT/workflows/DataPipelineWorkflow/runs?status=COMPLETED&start=0&end=9223372036854775807&limit=2147483647
11-Nov-2018 11:34:57 2018-11-11 11:34:57,263 - INFO  [main:c.c.c.t.AudiTestBase$1@134] - Received response: [200] Response Body: [{"runid":"88c7ccc9-e5a5-11e8-8470-42010ad2002d","starting":1541935976,"start":1541935996,"end":1541936095,"status":"COMPLETED","properties":{"runtimeArgs":"{\"logical.start.time\":\"1541935976190\"}","phase-1":"a07496c1-e5a5-11e8-9590-42010ad20030"}}]
11-Nov-2018 11:34:57 2018-11-11 11:34:57,265 - DEBUG [main:o.a.t.i.ApplicationBundler@203] - Start creating bundle at /tmp/IT-ITN5-DSTC514/junit5369227342314227006/junit3368654032876027068/co.cask.cdap.remote.dataset.table.TableDatasetApp.fcf987a1-7bbc-414c-9e3d-78ba17813592.jar
11-Nov-2018 11:34:57 2018-11-11 11:34:57,265 - DEBUG [main:o.a.t.i.ApplicationBundler@206] - First create bundle locally at /tmp/IT-ITN5-DSTC514/co.cask.cdap.remote.dataset.table.TableDatasetApp.fcf987a1-7bbc-414c-9e3d-78ba17813592.jar1787205511705236621.tmp
11-Nov-2018 11:34:57 2018-11-11 11:34:57,284 - DEBUG [main:o.a.t.i.ApplicationBundler@218] - Copying temporary bundle to destination /tmp/IT-ITN5-DSTC514/junit5369227342314227006/junit3368654032876027068/co.cask.cdap.remote.dataset.table.TableDatasetApp.fcf987a1-7bbc-414c-9e3d-78ba17813592.jar (44604 bytes)
11-Nov-2018 11:34:57 2018-11-11 11:34:57,284 - DEBUG [main:o.a.t.i.ApplicationBundler@225] - Finished creating bundle at /tmp/IT-ITN5-DSTC514/junit5369227342314227006/junit3368654032876027068/co.cask.cdap.remote.dataset.table.TableDatasetApp.fcf987a1-7bbc-414c-9e3d-78ba17813592.jar
11-Nov-2018 11:34:57 2018-11-11 11:34:57,285 - DEBUG [main:o.a.t.i.ApplicationBundler@230] - Cleaned up local temporary file /tmp/IT-ITN5-DSTC514/co.cask.cdap.remote.dataset.table.TableDatasetApp.fcf987a1-7bbc-414c-9e3d-78ba17813592.jar1787205511705236621.tmp
11-Nov-2018 11:34:58 2018-11-11 11:34:58,265 - INFO  [main:c.c.c.t.AudiTestBase$1@125] - Making request: GET http://10.210.0.45:11015/v3/namespaces/default/apps/output-batchsink-invalid-nodepath-test/versions/-SNAPSHOT/services/DatasetService/status
11-Nov-2018 11:34:58 2018-11-11 11:34:58,362 - INFO  [main:c.c.c.t.AudiTestBase$1@134] - Received response: [200] Response Body: {"status":"STOPPED"}
11-Nov-2018 11:34:58 2018-11-11 11:34:58,362 - INFO  [main:c.c.c.t.AudiTestBase$1@125] - Making request: POST http://10.210.0.45:11015/v3/namespaces/default/apps/output-batchsink-invalid-nodepath-test/versions/-SNAPSHOT/services/DatasetService/start
11-Nov-2018 11:35:01 2018-11-11 11:35:01,709 - INFO  [main:c.c.c.t.AudiTestBase$1@134] - Received response: [200] Response Body:
11-Nov-2018 11:35:01 2018-11-11 11:35:01,710 - INFO  [main:c.c.c.t.AudiTestBase$1@125] - Making request: GET http://10.210.0.45:11015/v3/namespaces/default/apps/output-batchsink-invalid-nodepath-test/versions/-SNAPSHOT/services/DatasetService/runs?status=RUNNING&start=0&end=9223372036854775807&limit=2147483647
11-Nov-2018 11:35:01 2018-11-11 11:35:01,764 - INFO  [main:c.c.c.t.AudiTestBase$1@134] - Received response: [200] Response Body: []
11-Nov-2018 11:35:01 2018-11-11 11:35:01,814 - INFO  [main:c.c.c.t.AudiTestBase$1@125] - Making request: GET http://10.210.0.45:11015/v3/namespaces/default/apps/output-batchsink-invalid-nodepath-test/versions/-SNAPSHOT/services/DatasetService/runs?status=RUNNING&start=0&end=9223372036854775807&limit=2147483647
11-Nov-2018 11:35:01 2018-11-11 11:35:01,904 - INFO  [main:c.c.c.t.AudiTestBase$1@134] - Received response: [200] Response Body: []
11-Nov-2018 11:35:01 2018-11-11 11:35:01,955 - INFO  [main:c.c.c.t.AudiTestBase$1@125] - Making request: GET http://10.210.0.45:11015/v3/namespaces/default/apps/output-batchsink-invalid-nodepath-test/versions/-SNAPSHOT/services/DatasetService/runs?status=RUNNING&start=0&end=9223372036854775807&limit=2147483647
11-Nov-2018 11:35:02 2018-11-11 11:35:02,044 - INFO  [main:c.c.c.t.AudiTestBase$1@134] - Received response: [200] Response Body: []
11-Nov-2018 11:35:02 2018-11-11 11:35:02,095 - INFO  [main:c.c.c.t.AudiTestBase$1@125] - Making request: GET http://10.210.0.45:11015/v3/namespaces/default/apps/output-batchsink-invalid-nodepath-test/versions/-SNAPSHOT/services/DatasetService/runs?status=RUNNING&start=0&end=9223372036854775807&limit=2147483647
11-Nov-2018 11:35:02 2018-11-11 11:35:02,185 - INFO  [main:c.c.c.t.AudiTestBase$1@134] - Received response: [200] Response Body: []
11-Nov-2018 11:35:02 2018-11-11 11:35:02,236 - INFO  [main:c.c.c.t.AudiTestBase$1@125] - Making request: GET http://10.210.0.45:11015/v3/namespaces/default/apps/output-batchsink-invalid-nodepath-test/versions/-SNAPSHOT/services/DatasetService/runs?status=RUNNING&start=0&end=9223372036854775807&limit=2147483647
11-Nov-2018 11:35:02 2018-11-11 11:35:02,326 - INFO  [main:c.c.c.t.AudiTestBase$1@134] - Received response: [200] Response Body: []
11-Nov-2018 11:35:02 2018-11-11 11:35:02,377 - INFO  [main:c.c.c.t.AudiTestBase$1@125] - Making request: GET http://10.210.0.45:11015/v3/namespaces/default/apps/output-batchsink-invalid-nodepath-test/versions/-SNAPSHOT/services/DatasetService/runs?status=RUNNING&start=0&end=9223372036854775807&limit=2147483647
11-Nov-2018 11:35:02 2018-11-11 11:35:02,467 - INFO  [main:c.c.c.t.AudiTestBase$1@134] - Received response: [200] Response Body: []
11-Nov-2018 11:35:02 2018-11-11 11:35:02,517 - INFO  [main:c.c.c.t.AudiTestBase$1@125] - Making request: GET http://10.210.0.45:11015/v3/namespaces/default/apps/output-batchsink-invalid-nodepath-test/versions/-SNAPSHOT/services/DatasetService/runs?status=RUNNING&start=0&end=9223372036854775807&limit=2147483647
11-Nov-2018 11:35:02 2018-11-11 11:35:02,607 - INFO  [main:c.c.c.t.AudiTestBase$1@134] - Received response: [200] Response Body: []
11-Nov-2018 11:35:02 2018-11-11 11:35:02,657 - INFO  [main:c.c.c.t.AudiTestBase$1@125] - Making request: GET http://10.210.0.45:11015/v3/namespaces/default/apps/output-batchsink-invalid-nodepath-test/versions/-SNAPSHOT/services/DatasetService/runs?status=RUNNING&start=0&end=9223372036854775807&limit=2147483647
11-Nov-2018 11:35:02 2018-11-11 11:35:02,746 - INFO  [main:c.c.c.t.AudiTestBase$1@134] - Received response: [200] Response Body: []
11-Nov-2018 11:35:02 2018-11-11 11:35:02,797 - INFO  [main:c.c.c.t.AudiTestBase$1@125] - Making request: GET http://10.210.0.45:11015/v3/namespaces/default/apps/output-batchsink-invalid-nodepath-test/versions/-SNAPSHOT/services/DatasetService/runs?status=RUNNING&start=0&end=9223372036854775807&limit=2147483647
11-Nov-2018 11:35:02 2018-11-11 11:35:02,886 - INFO  [main:c.c.c.t.AudiTestBase$1@134] - Received response: [200] Response Body: []
11-Nov-2018 11:35:02 2018-11-11 11:35:02,936 - INFO  [main:c.c.c.t.AudiTestBase$1@125] - Making request: GET http://10.210.0.45:11015/v3/namespaces/default/apps/output-batchsink-invalid-nodepath-test/versions/-SNAPSHOT/services/DatasetService/runs?status=RUNNING&start=0&end=9223372036854775807&limit=2147483647
11-Nov-2018 11:35:03 2018-11-11 11:35:03,027 - INFO  [main:c.c.c.t.AudiTestBase$1@134] - Received response: [200] Response Body: []
11-Nov-2018 11:35:03 2018-11-11 11:35:03,078 - INFO  [main:c.c.c.t.AudiTestBase$1@125] - Making request: GET http://10.210.0.45:11015/v3/namespaces/default/apps/output-batchsink-invalid-nodepath-test/versions/-SNAPSHOT/services/DatasetService/runs?status=RUNNING&start=0&end=9223372036854775807&limit=2147483647
11-Nov-2018 11:35:03 2018-11-11 11:35:03,167 - INFO  [main:c.c.c.t.AudiTestBase$1@134] - Received response: [200] Response Body: []
11-Nov-2018 11:35:03 2018-11-11 11:35:03,218 - INFO  [main:c.c.c.t.AudiTestBase$1@125] - Making request: GET http://10.210.0.45:11015/v3/namespaces/default/apps/output-batchsink-invalid-nodepath-test/versions/-SNAPSHOT/services/DatasetService/runs?status=RUNNING&start=0&end=9223372036854775807&limit=2147483647
11-Nov-2018 11:35:03 2018-11-11 11:35:03,320 - INFO  [main:c.c.c.t.AudiTestBase$1@134] - Received response: [200] Response Body: []
11-Nov-2018 11:35:03 2018-11-11 11:35:03,371 - INFO  [main:c.c.c.t.AudiTestBase$1@125] - Making request: GET http://10.210.0.45:11015/v3/namespaces/default/apps/output-batchsink-invalid-nodepath-test/versions/-SNAPSHOT/services/DatasetService/runs?status=RUNNING&start=0&end=9223372036854775807&limit=2147483647
11-Nov-2018 11:35:03 2018-11-11 11:35:03,460 - INFO  [main:c.c.c.t.AudiTestBase$1@134] - Received response: [200] Response Body: []
11-Nov-2018 11:35:03 2018-11-11 11:35:03,511 - INFO  [main:c.c.c.t.AudiTestBase$1@125] - Making request: GET http://10.210.0.45:11015/v3/namespaces/default/apps/output-batchsink-invalid-nodepath-test/versions/-SNAPSHOT/services/DatasetService/runs?status=RUNNING&start=0&end=9223372036854775807&limit=2147483647
11-Nov-2018 11:35:03 2018-11-11 11:35:03,601 - INFO  [main:c.c.c.t.AudiTestBase$1@134] - Received response: [200] Response Body: []
11-Nov-2018 11:35:03 2018-11-11 11:35:03,651 - INFO  [main:c.c.c.t.AudiTestBase$1@125] - Making request: GET http://10.210.0.45:11015/v3/namespaces/default/apps/output-batchsink-invalid-nodepath-test/versions/-SNAPSHOT/services/DatasetService/runs?status=RUNNING&start=0&end=9223372036854775807&limit=2147483647
11-Nov-2018 11:35:03 2018-11-11 11:35:03,741 - INFO  [main:c.c.c.t.AudiTestBase$1@134] - Received response: [200] Response Body: []
11-Nov-2018 11:35:03 2018-11-11 11:35:03,792 - INFO  [main:c.c.c.t.AudiTestBase$1@125] - Making request: GET http://10.210.0.45:11015/v3/namespaces/default/apps/output-batchsink-invalid-nodepath-test/versions/-SNAPSHOT/services/DatasetService/runs?status=RUNNING&start=0&end=9223372036854775807&limit=2147483647
11-Nov-2018 11:35:03 2018-11-11 11:35:03,882 - INFO  [main:c.c.c.t.AudiTestBase$1@134] - Received response: [200] Response Body: []
11-Nov-2018 11:35:03 2018-11-11 11:35:03,933 - INFO  [main:c.c.c.t.AudiTestBase$1@125] - Making request: GET http://10.210.0.45:11015/v3/namespaces/default/apps/output-batchsink-invalid-nodepath-test/versions/-SNAPSHOT/services/DatasetService/runs?status=RUNNING&start=0&end=9223372036854775807&limit=2147483647
11-Nov-2018 11:35:04 2018-11-11 11:35:04,024 - INFO  [main:c.c.c.t.AudiTestBase$1@134] - Received response: [200] Response Body: []
11-Nov-2018 11:35:04 2018-11-11 11:35:04,075 - INFO  [main:c.c.c.t.AudiTestBase$1@125] - Making request: GET http://10.210.0.45:11015/v3/namespaces/default/apps/output-batchsink-invalid-nodepath-test/versions/-SNAPSHOT/services/DatasetService/runs?status=RUNNING&start=0&end=9223372036854775807&limit=2147483647
11-Nov-2018 11:35:04 2018-11-11 11:35:04,166 - INFO  [main:c.c.c.t.AudiTestBase$1@134] - Received response: [200] Response Body: []
11-Nov-2018 11:35:04 2018-11-11 11:35:04,217 - INFO  [main:c.c.c.t.AudiTestBase$1@125] - Making request: GET http://10.210.0.45:11015/v3/namespaces/default/apps/output-batchsink-invalid-nodepath-test/versions/-SNAPSHOT/services/DatasetService/runs?status=RUNNING&start=0&end=9223372036854775807&limit=2147483647
11-Nov-2018 11:35:04 2018-11-11 11:35:04,308 - INFO  [main:c.c.c.t.AudiTestBase$1@134] - Received response: [200] Response Body: []
11-Nov-2018 11:35:04 2018-11-11 11:35:04,359 - INFO  [main:c.c.c.t.AudiTestBase$1@125] - Making request: GET http://10.210.0.45:11015/v3/namespaces/default/apps/output-batchsink-invalid-nodepath-test/versions/-SNAPSHOT/services/DatasetService/runs?status=RUNNING&start=0&end=9223372036854775807&limit=2147483647
11-Nov-2018 11:35:04 2018-11-11 11:35:04,450 - INFO  [main:c.c.c.t.AudiTestBase$1@134] - Received response: [200] Response Body: []
11-Nov-2018 11:35:04 2018-11-11 11:35:04,500 - INFO  [main:c.c.c.t.AudiTestBase$1@125] - Making request: GET http://10.210.0.45:11015/v3/namespaces/default/apps/output-batchsink-invalid-nodepath-test/versions/-SNAPSHOT/services/DatasetService/runs?status=RUNNING&start=0&end=9223372036854775807&limit=2147483647
11-Nov-2018 11:35:04 2018-11-11 11:35:04,590 - INFO  [main:c.c.c.t.AudiTestBase$1@134] - Received response: [200] Response Body: []
11-Nov-2018 11:35:04 2018-11-11 11:35:04,641 - INFO  [main:c.c.c.t.AudiTestBase$1@125] - Making request: GET http://10.210.0.45:11015/v3/namespaces/default/apps/output-batchsink-invalid-nodepath-test/versions/-SNAPSHOT/services/DatasetService/runs?status=RUNNING&start=0&end=9223372036854775807&limit=2147483647
11-Nov-2018 11:35:04 2018-11-11 11:35:04,729 - INFO  [main:c.c.c.t.AudiTestBase$1@134] - Received response: [200] Response Body: []
11-Nov-2018 11:35:04 2018-11-11 11:35:04,780 - INFO  [main:c.c.c.t.AudiTestBase$1@125] - Making request: GET http://10.210.0.45:11015/v3/namespaces/default/apps/output-batchsink-invalid-nodepath-test/versions/-SNAPSHOT/services/DatasetService/runs?status=RUNNING&start=0&end=9223372036854775807&limit=2147483647
11-Nov-2018 11:35:04 2018-11-11 11:35:04,871 - INFO  [main:c.c.c.t.AudiTestBase$1@134] - Received response: [200] Response Body: []
11-Nov-2018 11:35:04 2018-11-11 11:35:04,921 - INFO  [main:c.c.c.t.AudiTestBase$1@125] - Making request: GET http://10.210.0.45:11015/v3/namespaces/default/apps/output-batchsink-invalid-nodepath-test/versions/-SNAPSHOT/services/DatasetService/runs?status=RUNNING&start=0&end=9223372036854775807&limit=2147483647
11-Nov-2018 11:35:05 2018-11-11 11:35:05,012 - INFO  [main:c.c.c.t.AudiTestBase$1@134] - Received response: [200] Response Body: []
11-Nov-2018 11:35:05 2018-11-11 11:35:05,063 - INFO  [main:c.c.c.t.AudiTestBase$1@125] - Making request: GET http://10.210.0.45:11015/v3/namespaces/default/apps/output-batchsink-invalid-nodepath-test/versions/-SNAPSHOT/services/DatasetService/runs?status=RUNNING&start=0&end=9223372036854775807&limit=2147483647
11-Nov-2018 11:35:05 2018-11-11 11:35:05,156 - INFO  [main:c.c.c.t.AudiTestBase$1@134] - Received response: [200] Response Body: []
11-Nov-2018 11:35:05 2018-11-11 11:35:05,206 - INFO  [main:c.c.c.t.AudiTestBase$1@125] - Making request: GET http://10.210.0.45:11015/v3/namespaces/default/apps/output-batchsink-invalid-nodepath-test/versions/-SNAPSHOT/services/DatasetService/runs?status=RUNNING&start=0&end=9223372036854775807&limit=2147483647
11-Nov-2018 11:35:05 2018-11-11 11:35:05,298 - INFO  [main:c.c.c.t.AudiTestBase$1@134] - Received response: [200] Response Body: []
11-Nov-2018 11:35:05 2018-11-11 11:35:05,349 - INFO  [main:c.c.c.t.AudiTestBase$1@125] - Making request: GET http://10.210.0.45:11015/v3/namespaces/default/apps/output-batchsink-invalid-nodepath-test/versions/-SNAPSHOT/services/DatasetService/runs?status=RUNNING&start=0&end=9223372036854775807&limit=2147483647
11-Nov-2018 11:35:05 2018-11-11 11:35:05,440 - INFO  [main:c.c.c.t.AudiTestBase$1@134] - Received response: [200] Response Body: []
11-Nov-2018 11:35:05 2018-11-11 11:35:05,491 - INFO  [main:c.c.c.t.AudiTestBase$1@125] - Making request: GET http://10.210.0.45:11015/v3/namespaces/default/apps/output-batchsink-invalid-nodepath-test/versions/-SNAPSHOT/services/DatasetService/runs?status=RUNNING&start=0&end=9223372036854775807&limit=2147483647
11-Nov-2018 11:35:05 2018-11-11 11:35:05,582 - INFO  [main:c.c.c.t.AudiTestBase$1@134] - Received response: [200] Response Body: []
11-Nov-2018 11:35:05 2018-11-11 11:35:05,632 - INFO  [main:c.c.c.t.AudiTestBase$1@125] - Making request: GET http://10.210.0.45:11015/v3/namespaces/default/apps/output-batchsink-invalid-nodepath-test/versions/-SNAPSHOT/services/DatasetService/runs?status=RUNNING&start=0&end=9223372036854775807&limit=2147483647
11-Nov-2018 11:35:05 2018-11-11 11:35:05,725 - INFO  [main:c.c.c.t.AudiTestBase$1@134] - Received response: [200] Response Body: []
11-Nov-2018 11:35:05 2018-11-11 11:35:05,776 - INFO  [main:c.c.c.t.AudiTestBase$1@125] - Making request: GET http://10.210.0.45:11015/v3/namespaces/default/apps/output-batchsink-invalid-nodepath-test/versions/-SNAPSHOT/services/DatasetService/runs?status=RUNNING&start=0&end=9223372036854775807&limit=2147483647
11-Nov-2018 11:35:05 2018-11-11 11:35:05,871 - INFO  [main:c.c.c.t.AudiTestBase$1@134] - Received response: [200] Response Body: []
11-Nov-2018 11:35:05 2018-11-11 11:35:05,922 - INFO  [main:c.c.c.t.AudiTestBase$1@125] - Making request: GET http://10.210.0.45:11015/v3/namespaces/default/apps/output-batchsink-invalid-nodepath-test/versions/-SNAPSHOT/services/DatasetService/runs?status=RUNNING&start=0&end=9223372036854775807&limit=2147483647
11-Nov-2018 11:35:06 2018-11-11 11:35:06,012 - INFO  [main:c.c.c.t.AudiTestBase$1@134] - Received response: [200] Response Body: []
11-Nov-2018 11:35:06 2018-11-11 11:35:06,063 - INFO  [main:c.c.c.t.AudiTestBase$1@125] - Making request: GET http://10.210.0.45:11015/v3/namespaces/default/apps/output-batchsink-invalid-nodepath-test/versions/-SNAPSHOT/services/DatasetService/runs?status=RUNNING&start=0&end=9223372036854775807&limit=2147483647
11-Nov-2018 11:35:06 2018-11-11 11:35:06,154 - INFO  [main:c.c.c.t.AudiTestBase$1@134] - Received response: [200] Response Body: []
11-Nov-2018 11:35:06 2018-11-11 11:35:06,204 - INFO  [main:c.c.c.t.AudiTestBase$1@125] - Making request: GET http://10.210.0.45:11015/v3/namespaces/default/apps/output-batchsink-invalid-nodepath-test/versions/-SNAPSHOT/services/DatasetService/runs?status=RUNNING&start=0&end=9223372036854775807&limit=2147483647
11-Nov-2018 11:35:06 2018-11-11 11:35:06,294 - INFO  [main:c.c.c.t.AudiTestBase$1@134] - Received response: [200] Response Body: []
11-Nov-2018 11:35:06 2018-11-11 11:35:06,345 - INFO  [main:c.c.c.t.AudiTestBase$1@125] - Making request: GET http://10.210.0.45:11015/v3/namespaces/default/apps/output-batchsink-invalid-nodepath-test/versions/-SNAPSHOT/services/DatasetService/runs?status=RUNNING&start=0&end=9223372036854775807&limit=2147483647
11-Nov-2018 11:35:06 2018-11-11 11:35:06,435 - INFO  [main:c.c.c.t.AudiTestBase$1@134] - Received response: [200] Response Body: []
11-Nov-2018 11:35:06 2018-11-11 11:35:06,486 - INFO  [main:c.c.c.t.AudiTestBase$1@125] - Making request: GET http://10.210.0.45:11015/v3/namespaces/default/apps/output-batchsink-invalid-nodepath-test/versions/-SNAPSHOT/services/DatasetService/runs?status=RUNNING&start=0&end=9223372036854775807&limit=2147483647
11-Nov-2018 11:35:06 2018-11-11 11:35:06,576 - INFO  [main:c.c.c.t.AudiTestBase$1@134] - Received response: [200] Response Body: []
11-Nov-2018 11:35:06 2018-11-11 11:35:06,627 - INFO  [main:c.c.c.t.AudiTestBase$1@125] - Making request: GET http://10.210.0.45:11015/v3/namespaces/default/apps/output-batchsink-invalid-nodepath-test/versions/-SNAPSHOT/services/DatasetService/runs?status=RUNNING&start=0&end=9223372036854775807&limit=2147483647
11-Nov-2018 11:35:06 2018-11-11 11:35:06,716 - INFO  [main:c.c.c.t.AudiTestBase$1@134] - Received response: [200] Response Body: []
11-Nov-2018 11:35:06 2018-11-11 11:35:06,767 - INFO  [main:c.c.c.t.AudiTestBase$1@125] - Making request: GET http://10.210.0.45:11015/v3/namespaces/default/apps/output-batchsink-invalid-nodepath-test/versions/-SNAPSHOT/services/DatasetService/runs?status=RUNNING&start=0&end=9223372036854775807&limit=2147483647
11-Nov-2018 11:35:06 2018-11-11 11:35:06,856 - INFO  [main:c.c.c.t.AudiTestBase$1@134] - Received response: [200] Response Body: []
11-Nov-2018 11:35:06 2018-11-11 11:35:06,907 - INFO  [main:c.c.c.t.AudiTestBase$1@125] - Making request: GET http://10.210.0.45:11015/v3/namespaces/default/apps/output-batchsink-invalid-nodepath-test/versions/-SNAPSHOT/services/DatasetService/runs?status=RUNNING&start=0&end=9223372036854775807&limit=2147483647
11-Nov-2018 11:35:06 2018-11-11 11:35:06,997 - INFO  [main:c.c.c.t.AudiTestBase$1@134] - Received response: [200] Response Body: []
11-Nov-2018 11:35:07 2018-11-11 11:35:07,048 - INFO  [main:c.c.c.t.AudiTestBase$1@125] - Making request: GET http://10.210.0.45:11015/v3/namespaces/default/apps/output-batchsink-invalid-nodepath-test/versions/-SNAPSHOT/services/DatasetService/runs?status=RUNNING&start=0&end=9223372036854775807&limit=2147483647
11-Nov-2018 11:35:07 2018-11-11 11:35:07,137 - INFO  [main:c.c.c.t.AudiTestBase$1@134] - Received response: [200] Response Body: []
11-Nov-2018 11:35:07 2018-11-11 11:35:07,188 - INFO  [main:c.c.c.t.AudiTestBase$1@125] - Making request: GET http://10.210.0.45:11015/v3/namespaces/default/apps/output-batchsink-invalid-nodepath-test/versions/-SNAPSHOT/services/DatasetService/runs?status=RUNNING&start=0&end=9223372036854775807&limit=2147483647
11-Nov-2018 11:35:07 2018-11-11 11:35:07,277 - INFO  [main:c.c.c.t.AudiTestBase$1@134] - Received response: [200] Response Body: []
11-Nov-2018 11:35:07 2018-11-11 11:35:07,327 - INFO  [main:c.c.c.t.AudiTestBase$1@125] - Making request: GET http://10.210.0.45:11015/v3/namespaces/default/apps/output-batchsink-invalid-nodepath-test/versions/-SNAPSHOT/services/DatasetService/runs?status=RUNNING&start=0&end=9223372036854775807&limit=2147483647
11-Nov-2018 11:35:07 2018-11-11 11:35:07,418 - INFO  [main:c.c.c.t.AudiTestBase$1@134] - Received response: [200] Response Body: []
11-Nov-2018 11:35:07 2018-11-11 11:35:07,469 - INFO  [main:c.c.c.t.AudiTestBase$1@125] - Making request: GET http://10.210.0.45:11015/v3/namespaces/default/apps/output-batchsink-invalid-nodepath-test/versions/-SNAPSHOT/services/DatasetService/runs?status=RUNNING&start=0&end=9223372036854775807&limit=2147483647
11-Nov-2018 11:35:07 2018-11-11 11:35:07,562 - INFO  [main:c.c.c.t.AudiTestBase$1@134] - Received response: [200] Response Body: []
11-Nov-2018 11:35:07 2018-11-11 11:35:07,613 - INFO  [main:c.c.c.t.AudiTestBase$1@125] - Making request: GET http://10.210.0.45:11015/v3/namespaces/default/apps/output-batchsink-invalid-nodepath-test/versions/-SNAPSHOT/services/DatasetService/runs?status=RUNNING&start=0&end=9223372036854775807&limit=2147483647
11-Nov-2018 11:35:07 2018-11-11 11:35:07,702 - INFO  [main:c.c.c.t.AudiTestBase$1@134] - Received response: [200] Response Body: []
11-Nov-2018 11:35:07 2018-11-11 11:35:07,753 - INFO  [main:c.c.c.t.AudiTestBase$1@125] - Making request: GET http://10.210.0.45:11015/v3/namespaces/default/apps/output-batchsink-invalid-nodepath-test/versions/-SNAPSHOT/services/DatasetService/runs?status=RUNNING&start=0&end=9223372036854775807&limit=2147483647
11-Nov-2018 11:35:07 2018-11-11 11:35:07,849 - INFO  [main:c.c.c.t.AudiTestBase$1@134] - Received response: [200] Response Body: []
11-Nov-2018 11:35:07 2018-11-11 11:35:07,900 - INFO  [main:c.c.c.t.AudiTestBase$1@125] - Making request: GET http://10.210.0.45:11015/v3/namespaces/default/apps/output-batchsink-invalid-nodepath-test/versions/-SNAPSHOT/services/DatasetService/runs?status=RUNNING&start=0&end=9223372036854775807&limit=2147483647
11-Nov-2018 11:35:07 2018-11-11 11:35:07,990 - INFO  [main:c.c.c.t.AudiTestBase$1@134] - Received response: [200] Response Body: []
11-Nov-2018 11:35:08 2018-11-11 11:35:08,041 - INFO  [main:c.c.c.t.AudiTestBase$1@125] - Making request: GET http://10.210.0.45:11015/v3/namespaces/default/apps/output-batchsink-invalid-nodepath-test/versions/-SNAPSHOT/services/DatasetService/runs?status=RUNNING&start=0&end=9223372036854775807&limit=2147483647
11-Nov-2018 11:35:08 2018-11-11 11:35:08,131 - INFO  [main:c.c.c.t.AudiTestBase$1@134] - Received response: [200] Response Body: []
11-Nov-2018 11:35:08 2018-11-11 11:35:08,182 - INFO  [main:c.c.c.t.AudiTestBase$1@125] - Making request: GET http://10.210.0.45:11015/v3/namespaces/default/apps/output-batchsink-invalid-nodepath-test/versions/-SNAPSHOT/services/DatasetService/runs?status=RUNNING&start=0&end=9223372036854775807&limit=2147483647
11-Nov-2018 11:35:08 2018-11-11 11:35:08,272 - INFO  [main:c.c.c.t.AudiTestBase$1@134] - Received response: [200] Response Body: []
11-Nov-2018 11:35:08 2018-11-11 11:35:08,322 - INFO  [main:c.c.c.t.AudiTestBase$1@125] - Making request: GET http://10.210.0.45:11015/v3/namespaces/default/apps/output-batchsink-invalid-nodepath-test/versions/-SNAPSHOT/services/DatasetService/runs?status=RUNNING&start=0&end=9223372036854775807&limit=2147483647
11-Nov-2018 11:35:08 2018-11-11 11:35:08,418 - INFO  [main:c.c.c.t.AudiTestBase$1@134] - Received response: [200] Response Body: []
11-Nov-2018 11:35:08 2018-11-11 11:35:08,468 - INFO  [main:c.c.c.t.AudiTestBase$1@125] - Making request: GET http://10.210.0.45:11015/v3/namespaces/default/apps/output-batchsink-invalid-nodepath-test/versions/-SNAPSHOT/services/DatasetService/runs?status=RUNNING&start=0&end=9223372036854775807&limit=2147483647
11-Nov-2018 11:35:08 2018-11-11 11:35:08,558 - INFO  [main:c.c.c.t.AudiTestBase$1@134] - Received response: [200] Response Body: []
11-Nov-2018 11:35:08 2018-11-11 11:35:08,609 - INFO  [main:c.c.c.t.AudiTestBase$1@125] - Making request: GET http://10.210.0.45:11015/v3/namespaces/default/apps/output-batchsink-invalid-nodepath-test/versions/-SNAPSHOT/services/DatasetService/runs?status=RUNNING&start=0&end=9223372036854775807&limit=2147483647
11-Nov-2018 11:35:08 2018-11-11 11:35:08,699 - INFO  [main:c.c.c.t.AudiTestBase$1@134] - Received response: [200] Response Body: []
11-Nov-2018 11:35:08 2018-11-11 11:35:08,750 - INFO  [main:c.c.c.t.AudiTestBase$1@125] - Making request: GET http://10.210.0.45:11015/v3/namespaces/default/apps/output-batchsink-invalid-nodepath-test/versions/-SNAPSHOT/services/DatasetService/runs?status=RUNNING&start=0&end=9223372036854775807&limit=2147483647
11-Nov-2018 11:35:08 2018-11-11 11:35:08,840 - INFO  [main:c.c.c.t.AudiTestBase$1@134] - Received response: [200] Response Body: []
11-Nov-2018 11:35:08 2018-11-11 11:35:08,891 - INFO  [main:c.c.c.t.AudiTestBase$1@125] - Making request: GET http://10.210.0.45:11015/v3/namespaces/default/apps/output-batchsink-invalid-nodepath-test/versions/-SNAPSHOT/services/DatasetService/runs?status=RUNNING&start=0&end=9223372036854775807&limit=2147483647
11-Nov-2018 11:35:08 2018-11-11 11:35:08,980 - INFO  [main:c.c.c.t.AudiTestBase$1@134] - Received response: [200] Response Body: []
11-Nov-2018 11:35:09 2018-11-11 11:35:09,031 - INFO  [main:c.c.c.t.AudiTestBase$1@125] - Making request: GET http://10.210.0.45:11015/v3/namespaces/default/apps/output-batchsink-invalid-nodepath-test/versions/-SNAPSHOT/services/DatasetService/runs?status=RUNNING&start=0&end=9223372036854775807&limit=2147483647
11-Nov-2018 11:35:09 2018-11-11 11:35:09,121 - INFO  [main:c.c.c.t.AudiTestBase$1@134] - Received response: [200] Response Body: []
11-Nov-2018 11:35:09 2018-11-11 11:35:09,172 - INFO  [main:c.c.c.t.AudiTestBase$1@125] - Making request: GET http://10.210.0.45:11015/v3/namespaces/default/apps/output-batchsink-invalid-nodepath-test/versions/-SNAPSHOT/services/DatasetService/runs?status=RUNNING&start=0&end=9223372036854775807&limit=2147483647
11-Nov-2018 11:35:09 2018-11-11 11:35:09,262 - INFO  [main:c.c.c.t.AudiTestBase$1@134] - Received response: [200] Response Body: []
11-Nov-2018 11:35:09 2018-11-11 11:35:09,313 - INFO  [main:c.c.c.t.AudiTestBase$1@125] - Making request: GET http://10.210.0.45:11015/v3/namespaces/default/apps/output-batchsink-invalid-nodepath-test/versions/-SNAPSHOT/services/DatasetService/runs?status=RUNNING&start=0&end=9223372036854775807&limit=2147483647
11-Nov-2018 11:35:09 2018-11-11 11:35:09,406 - INFO  [main:c.c.c.t.AudiTestBase$1@134] - Received response: [200] Response Body: []
11-Nov-2018 11:35:09 2018-11-11 11:35:09,456 - INFO  [main:c.c.c.t.AudiTestBase$1@125] - Making request: GET http://10.210.0.45:11015/v3/namespaces/default/apps/output-batchsink-invalid-nodepath-test/versions/-SNAPSHOT/services/DatasetService/runs?status=RUNNING&start=0&end=9223372036854775807&limit=2147483647
11-Nov-2018 11:35:09 2018-11-11 11:35:09,546 - INFO  [main:c.c.c.t.AudiTestBase$1@134] - Received response: [200] Response Body: []
11-Nov-2018 11:35:09 2018-11-11 11:35:09,597 - INFO  [main:c.c.c.t.AudiTestBase$1@125] - Making request: GET http://10.210.0.45:11015/v3/namespaces/default/apps/output-batchsink-invalid-nodepath-test/versions/-SNAPSHOT/services/DatasetService/runs?status=RUNNING&start=0&end=9223372036854775807&limit=2147483647
11-Nov-2018 11:35:09 2018-11-11 11:35:09,689 - INFO  [main:c.c.c.t.AudiTestBase$1@134] - Received response: [200] Response Body: []
11-Nov-2018 11:35:09 2018-11-11 11:35:09,740 - INFO  [main:c.c.c.t.AudiTestBase$1@125] - Making request: GET http://10.210.0.45:11015/v3/namespaces/default/apps/output-batchsink-invalid-nodepath-test/versions/-SNAPSHOT/services/DatasetService/runs?status=RUNNING&start=0&end=9223372036854775807&limit=2147483647
11-Nov-2018 11:35:09 2018-11-11 11:35:09,874 - INFO  [main:c.c.c.t.AudiTestBase$1@134] - Received response: [200] Response Body: []
11-Nov-2018 11:35:09 2018-11-11 11:35:09,924 - INFO  [main:c.c.c.t.AudiTestBase$1@125] - Making request: GET http://10.210.0.45:11015/v3/namespaces/default/apps/output-batchsink-invalid-nodepath-test/versions/-SNAPSHOT/services/DatasetService/runs?status=RUNNING&start=0&end=9223372036854775807&limit=2147483647
11-Nov-2018 11:35:10 2018-11-11 11:35:10,015 - INFO  [main:c.c.c.t.AudiTestBase$1@134] - Received response: [200] Response Body: []
11-Nov-2018 11:35:10 2018-11-11 11:35:10,065 - INFO  [main:c.c.c.t.AudiTestBase$1@125] - Making request: GET http://10.210.0.45:11015/v3/namespaces/default/apps/output-batchsink-invalid-nodepath-test/versions/-SNAPSHOT/services/DatasetService/runs?status=RUNNING&start=0&end=9223372036854775807&limit=2147483647
11-Nov-2018 11:35:10 2018-11-11 11:35:10,157 - INFO  [main:c.c.c.t.AudiTestBase$1@134] - Received response: [200] Response Body: []
11-Nov-2018 11:35:10 2018-11-11 11:35:10,207 - INFO  [main:c.c.c.t.AudiTestBase$1@125] - Making request: GET http://10.210.0.45:11015/v3/namespaces/default/apps/output-batchsink-invalid-nodepath-test/versions/-SNAPSHOT/services/DatasetService/runs?status=RUNNING&start=0&end=9223372036854775807&limit=2147483647
11-Nov-2018 11:35:10 2018-11-11 11:35:10,304 - INFO  [main:c.c.c.t.AudiTestBase$1@134] - Received response: [200] Response Body: []
11-Nov-2018 11:35:10 2018-11-11 11:35:10,355 - INFO  [main:c.c.c.t.AudiTestBase$1@125] - Making request: GET http://10.210.0.45:11015/v3/namespaces/default/apps/output-batchsink-invalid-nodepath-test/versions/-SNAPSHOT/services/DatasetService/runs?status=RUNNING&start=0&end=9223372036854775807&limit=2147483647
11-Nov-2018 11:35:10 2018-11-11 11:35:10,445 - INFO  [main:c.c.c.t.AudiTestBase$1@134] - Received response: [200] Response Body: []
11-Nov-2018 11:35:10 2018-11-11 11:35:10,496 - INFO  [main:c.c.c.t.AudiTestBase$1@125] - Making request: GET http://10.210.0.45:11015/v3/namespaces/default/apps/output-batchsink-invalid-nodepath-test/versions/-SNAPSHOT/services/DatasetService/runs?status=RUNNING&start=0&end=9223372036854775807&limit=2147483647
11-Nov-2018 11:35:10 2018-11-11 11:35:10,585 - INFO  [main:c.c.c.t.AudiTestBase$1@134] - Received response: [200] Response Body: []
11-Nov-2018 11:35:10 2018-11-11 11:35:10,636 - INFO  [main:c.c.c.t.AudiTestBase$1@125] - Making request: GET http://10.210.0.45:11015/v3/namespaces/default/apps/output-batchsink-invalid-nodepath-test/versions/-SNAPSHOT/services/DatasetService/runs?status=RUNNING&start=0&end=9223372036854775807&limit=2147483647
11-Nov-2018 11:35:10 2018-11-11 11:35:10,725 - INFO  [main:c.c.c.t.AudiTestBase$1@134] - Received response: [200] Response Body: []
11-Nov-2018 11:35:10 2018-11-11 11:35:10,776 - INFO  [main:c.c.c.t.AudiTestBase$1@125] - Making request: GET http://10.210.0.45:11015/v3/namespaces/default/apps/output-batchsink-invalid-nodepath-test/versions/-SNAPSHOT/services/DatasetService/runs?status=RUNNING&start=0&end=9223372036854775807&limit=2147483647
11-Nov-2018 11:35:10 2018-11-11 11:35:10,866 - INFO  [main:c.c.c.t.AudiTestBase$1@134] - Received response: [200] Response Body: []
11-Nov-2018 11:35:10 2018-11-11 11:35:10,916 - INFO  [main:c.c.c.t.AudiTestBase$1@125] - Making request: GET http://10.210.0.45:11015/v3/namespaces/default/apps/output-batchsink-invalid-nodepath-test/versions/-SNAPSHOT/services/DatasetService/runs?status=RUNNING&start=0&end=9223372036854775807&limit=2147483647
11-Nov-2018 11:35:11 2018-11-11 11:35:11,006 - INFO  [main:c.c.c.t.AudiTestBase$1@134] - Received response: [200] Response Body: []
11-Nov-2018 11:35:11 2018-11-11 11:35:11,057 - INFO  [main:c.c.c.t.AudiTestBase$1@125] - Making request: GET http://10.210.0.45:11015/v3/namespaces/default/apps/output-batchsink-invalid-nodepath-test/versions/-SNAPSHOT/services/DatasetService/runs?status=RUNNING&start=0&end=9223372036854775807&limit=2147483647
11-Nov-2018 11:35:11 2018-11-11 11:35:11,147 - INFO  [main:c.c.c.t.AudiTestBase$1@134] - Received response: [200] Response Body: []
11-Nov-2018 11:35:11 2018-11-11 11:35:11,198 - INFO  [main:c.c.c.t.AudiTestBase$1@125] - Making request: GET http://10.210.0.45:11015/v3/namespaces/default/apps/output-batchsink-invalid-nodepath-test/versions/-SNAPSHOT/services/DatasetService/runs?status=RUNNING&start=0&end=9223372036854775807&limit=2147483647
11-Nov-2018 11:35:11 2018-11-11 11:35:11,288 - INFO  [main:c.c.c.t.AudiTestBase$1@134] - Received response: [200] Response Body: []
11-Nov-2018 11:35:11 2018-11-11 11:35:11,339 - INFO  [main:c.c.c.t.AudiTestBase$1@125] - Making request: GET http://10.210.0.45:11015/v3/namespaces/default/apps/output-batchsink-invalid-nodepath-test/versions/-SNAPSHOT/services/DatasetService/runs?status=RUNNING&start=0&end=9223372036854775807&limit=2147483647
11-Nov-2018 11:35:11 2018-11-11 11:35:11,429 - INFO  [main:c.c.c.t.AudiTestBase$1@134] - Received response: [200] Response Body: []
11-Nov-2018 11:35:11 2018-11-11 11:35:11,479 - INFO  [main:c.c.c.t.AudiTestBase$1@125] - Making request: GET http://10.210.0.45:11015/v3/namespaces/default/apps/output-batchsink-invalid-nodepath-test/versions/-SNAPSHOT/services/DatasetService/runs?status=RUNNING&start=0&end=9223372036854775807&limit=2147483647
11-Nov-2018 11:35:11 2018-11-11 11:35:11,571 - INFO  [main:c.c.c.t.AudiTestBase$1@134] - Received response: [200] Response Body: []
11-Nov-2018 11:35:11 2018-11-11 11:35:11,622 - INFO  [main:c.c.c.t.AudiTestBase$1@125] - Making request: GET http://10.210.0.45:11015/v3/namespaces/default/apps/output-batchsink-invalid-nodepath-test/versions/-SNAPSHOT/services/DatasetService/runs?status=RUNNING&start=0&end=9223372036854775807&limit=2147483647
11-Nov-2018 11:35:11 2018-11-11 11:35:11,713 - INFO  [main:c.c.c.t.AudiTestBase$1@134] - Received response: [200] Response Body: []
11-Nov-2018 11:35:11 2018-11-11 11:35:11,764 - INFO  [main:c.c.c.t.AudiTestBase$1@125] - Making request: GET http://10.210.0.45:11015/v3/namespaces/default/apps/output-batchsink-invalid-nodepath-test/versions/-SNAPSHOT/services/DatasetService/runs?status=RUNNING&start=0&end=9223372036854775807&limit=2147483647
11-Nov-2018 11:35:11 2018-11-11 11:35:11,854 - INFO  [main:c.c.c.t.AudiTestBase$1@134] - Received response: [200] Response Body: []
11-Nov-2018 11:35:11 2018-11-11 11:35:11,905 - INFO  [main:c.c.c.t.AudiTestBase$1@125] - Making request: GET http://10.210.0.45:11015/v3/namespaces/default/apps/output-batchsink-invalid-nodepath-test/versions/-SNAPSHOT/services/DatasetService/runs?status=RUNNING&start=0&end=9223372036854775807&limit=2147483647
11-Nov-2018 11:35:11 2018-11-11 11:35:11,995 - INFO  [main:c.c.c.t.AudiTestBase$1@134] - Received response: [200] Response Body: []
11-Nov-2018 11:35:12 2018-11-11 11:35:12,045 - INFO  [main:c.c.c.t.AudiTestBase$1@125] - Making request: GET http://10.210.0.45:11015/v3/namespaces/default/apps/output-batchsink-invalid-nodepath-test/versions/-SNAPSHOT/services/DatasetService/runs?status=RUNNING&start=0&end=9223372036854775807&limit=2147483647
11-Nov-2018 11:35:12 2018-11-11 11:35:12,137 - INFO  [main:c.c.c.t.AudiTestBase$1@134] - Received response: [200] Response Body: []
11-Nov-2018 11:35:12 2018-11-11 11:35:12,187 - INFO  [main:c.c.c.t.AudiTestBase$1@125] - Making request: GET http://10.210.0.45:11015/v3/namespaces/default/apps/output-batchsink-invalid-nodepath-test/versions/-SNAPSHOT/services/DatasetService/runs?status=RUNNING&start=0&end=9223372036854775807&limit=2147483647
11-Nov-2018 11:35:12 2018-11-11 11:35:12,278 - INFO  [main:c.c.c.t.AudiTestBase$1@134] - Received response: [200] Response Body: []
11-Nov-2018 11:35:12 2018-11-11 11:35:12,329 - INFO  [main:c.c.c.t.AudiTestBase$1@125] - Making request: GET http://10.210.0.45:11015/v3/namespaces/default/apps/output-batchsink-invalid-nodepath-test/versions/-SNAPSHOT/services/DatasetService/runs?status=RUNNING&start=0&end=9223372036854775807&limit=2147483647
11-Nov-2018 11:35:12 2018-11-11 11:35:12,418 - INFO  [main:c.c.c.t.AudiTestBase$1@134] - Received response: [200] Response Body: []
11-Nov-2018 11:35:12 2018-11-11 11:35:12,469 - INFO  [main:c.c.c.t.AudiTestBase$1@125] - Making request: GET http://10.210.0.45:11015/v3/namespaces/default/apps/output-batchsink-invalid-nodepath-test/versions/-SNAPSHOT/services/DatasetService/runs?status=RUNNING&start=0&end=9223372036854775807&limit=2147483647
11-Nov-2018 11:35:12 2018-11-11 11:35:12,559 - INFO  [main:c.c.c.t.AudiTestBase$1@134] - Received response: [200] Response Body: []
11-Nov-2018 11:35:12 2018-11-11 11:35:12,609 - INFO  [main:c.c.c.t.AudiTestBase$1@125] - Making request: GET http://10.210.0.45:11015/v3/namespaces/default/apps/output-batchsink-invalid-nodepath-test/versions/-SNAPSHOT/services/DatasetService/runs?status=RUNNING&start=0&end=9223372036854775807&limit=2147483647
11-Nov-2018 11:35:12 2018-11-11 11:35:12,699 - INFO  [main:c.c.c.t.AudiTestBase$1@134] - Received response: [200] Response Body: []
11-Nov-2018 11:35:12 2018-11-11 11:35:12,750 - INFO  [main:c.c.c.t.AudiTestBase$1@125] - Making request: GET http://10.210.0.45:11015/v3/namespaces/default/apps/output-batchsink-invalid-nodepath-test/versions/-SNAPSHOT/services/DatasetService/runs?status=RUNNING&start=0&end=9223372036854775807&limit=2147483647
11-Nov-2018 11:35:12 2018-11-11 11:35:12,839 - INFO  [main:c.c.c.t.AudiTestBase$1@134] - Received response: [200] Response Body: []
11-Nov-2018 11:35:12 2018-11-11 11:35:12,890 - INFO  [main:c.c.c.t.AudiTestBase$1@125] - Making request: GET http://10.210.0.45:11015/v3/namespaces/default/apps/output-batchsink-invalid-nodepath-test/versions/-SNAPSHOT/services/DatasetService/runs?status=RUNNING&start=0&end=9223372036854775807&limit=2147483647
11-Nov-2018 11:35:12 2018-11-11 11:35:12,980 - INFO  [main:c.c.c.t.AudiTestBase$1@134] - Received response: [200] Response Body: []
11-Nov-2018 11:35:13 2018-11-11 11:35:13,031 - INFO  [main:c.c.c.t.AudiTestBase$1@125] - Making request: GET http://10.210.0.45:11015/v3/namespaces/default/apps/output-batchsink-invalid-nodepath-test/versions/-SNAPSHOT/services/DatasetService/runs?status=RUNNING&start=0&end=9223372036854775807&limit=2147483647
11-Nov-2018 11:35:13 2018-11-11 11:35:13,121 - INFO  [main:c.c.c.t.AudiTestBase$1@134] - Received response: [200] Response Body: []
11-Nov-2018 11:35:13 2018-11-11 11:35:13,172 - INFO  [main:c.c.c.t.AudiTestBase$1@125] - Making request: GET http://10.210.0.45:11015/v3/namespaces/default/apps/output-batchsink-invalid-nodepath-test/versions/-SNAPSHOT/services/DatasetService/runs?status=RUNNING&start=0&end=9223372036854775807&limit=2147483647
11-Nov-2018 11:35:13 2018-11-11 11:35:13,262 - INFO  [main:c.c.c.t.AudiTestBase$1@134] - Received response: [200] Response Body: []
11-Nov-2018 11:35:13 2018-11-11 11:35:13,313 - INFO  [main:c.c.c.t.AudiTestBase$1@125] - Making request: GET http://10.210.0.45:11015/v3/namespaces/default/apps/output-batchsink-invalid-nodepath-test/versions/-SNAPSHOT/services/DatasetService/runs?status=RUNNING&start=0&end=9223372036854775807&limit=2147483647
11-Nov-2018 11:35:13 2018-11-11 11:35:13,401 - INFO  [main:c.c.c.t.AudiTestBase$1@134] - Received response: [200] Response Body: []
11-Nov-2018 11:35:13 2018-11-11 11:35:13,452 - INFO  [main:c.c.c.t.AudiTestBase$1@125] - Making request: GET http://10.210.0.45:11015/v3/namespaces/default/apps/output-batchsink-invalid-nodepath-test/versions/-SNAPSHOT/services/DatasetService/runs?status=RUNNING&start=0&end=9223372036854775807&limit=2147483647
11-Nov-2018 11:35:13 2018-11-11 11:35:13,541 - INFO  [main:c.c.c.t.AudiTestBase$1@134] - Received response: [200] Response Body: []
11-Nov-2018 11:35:13 2018-11-11 11:35:13,592 - INFO  [main:c.c.c.t.AudiTestBase$1@125] - Making request: GET http://10.210.0.45:11015/v3/namespaces/default/apps/output-batchsink-invalid-nodepath-test/versions/-SNAPSHOT/services/DatasetService/runs?status=RUNNING&start=0&end=9223372036854775807&limit=2147483647
11-Nov-2018 11:35:13 2018-11-11 11:35:13,682 - INFO  [main:c.c.c.t.AudiTestBase$1@134] - Received response: [200] Response Body: []
11-Nov-2018 11:35:13 2018-11-11 11:35:13,733 - INFO  [main:c.c.c.t.AudiTestBase$1@125] - Making request: GET http://10.210.0.45:11015/v3/namespaces/default/apps/output-batchsink-invalid-nodepath-test/versions/-SNAPSHOT/services/DatasetService/runs?status=RUNNING&start=0&end=9223372036854775807&limit=2147483647
11-Nov-2018 11:35:13 2018-11-11 11:35:13,822 - INFO  [main:c.c.c.t.AudiTestBase$1@134] - Received response: [200] Response Body: []
11-Nov-2018 11:35:13 2018-11-11 11:35:13,873 - INFO  [main:c.c.c.t.AudiTestBase$1@125] - Making request: GET http://10.210.0.45:11015/v3/namespaces/default/apps/output-batchsink-invalid-nodepath-test/versions/-SNAPSHOT/services/DatasetService/runs?status=RUNNING&start=0&end=9223372036854775807&limit=2147483647
11-Nov-2018 11:35:13 2018-11-11 11:35:13,961 - INFO  [main:c.c.c.t.AudiTestBase$1@134] - Received response: [200] Response Body: []
11-Nov-2018 11:35:14 2018-11-11 11:35:14,012 - INFO  [main:c.c.c.t.AudiTestBase$1@125] - Making request: GET http://10.210.0.45:11015/v3/namespaces/default/apps/output-batchsink-invalid-nodepath-test/versions/-SNAPSHOT/services/DatasetService/runs?status=RUNNING&start=0&end=9223372036854775807&limit=2147483647
11-Nov-2018 11:35:14 2018-11-11 11:35:14,100 - INFO  [main:c.c.c.t.AudiTestBase$1@134] - Received response: [200] Response Body: []
11-Nov-2018 11:35:14 2018-11-11 11:35:14,151 - INFO  [main:c.c.c.t.AudiTestBase$1@125] - Making request: GET http://10.210.0.45:11015/v3/namespaces/default/apps/output-batchsink-invalid-nodepath-test/versions/-SNAPSHOT/services/DatasetService/runs?status=RUNNING&start=0&end=9223372036854775807&limit=2147483647
11-Nov-2018 11:35:14 2018-11-11 11:35:14,241 - INFO  [main:c.c.c.t.AudiTestBase$1@134] - Received response: [200] Response Body: []
11-Nov-2018 11:35:14 2018-11-11 11:35:14,292 - INFO  [main:c.c.c.t.AudiTestBase$1@125] - Making request: GET http://10.210.0.45:11015/v3/namespaces/default/apps/output-batchsink-invalid-nodepath-test/versions/-SNAPSHOT/services/DatasetService/runs?status=RUNNING&start=0&end=9223372036854775807&limit=2147483647
11-Nov-2018 11:35:14 2018-11-11 11:35:14,383 - INFO  [main:c.c.c.t.AudiTestBase$1@134] - Received response: [200] Response Body: []
11-Nov-2018 11:35:14 2018-11-11 11:35:14,434 - INFO  [main:c.c.c.t.AudiTestBase$1@125] - Making request: GET http://10.210.0.45:11015/v3/namespaces/default/apps/output-batchsink-invalid-nodepath-test/versions/-SNAPSHOT/services/DatasetService/runs?status=RUNNING&start=0&end=9223372036854775807&limit=2147483647
11-Nov-2018 11:35:14 2018-11-11 11:35:14,524 - INFO  [main:c.c.c.t.AudiTestBase$1@134] - Received response: [200] Response Body: []
11-Nov-2018 11:35:14 2018-11-11 11:35:14,575 - INFO  [main:c.c.c.t.AudiTestBase$1@125] - Making request: GET http://10.210.0.45:11015/v3/namespaces/default/apps/output-batchsink-invalid-nodepath-test/versions/-SNAPSHOT/services/DatasetService/runs?status=RUNNING&start=0&end=9223372036854775807&limit=2147483647
11-Nov-2018 11:35:14 2018-11-11 11:35:14,665 - INFO  [main:c.c.c.t.AudiTestBase$1@134] - Received response: [200] Response Body: []
11-Nov-2018 11:35:14 2018-11-11 11:35:14,716 - INFO  [main:c.c.c.t.AudiTestBase$1@125] - Making request: GET http://10.210.0.45:11015/v3/namespaces/default/apps/output-batchsink-invalid-nodepath-test/versions/-SNAPSHOT/services/DatasetService/runs?status=RUNNING&start=0&end=9223372036854775807&limit=2147483647
11-Nov-2018 11:35:14 2018-11-11 11:35:14,805 - INFO  [main:c.c.c.t.AudiTestBase$1@134] - Received response: [200] Response Body: []
11-Nov-2018 11:35:14 2018-11-11 11:35:14,856 - INFO  [main:c.c.c.t.AudiTestBase$1@125] - Making request: GET http://10.210.0.45:11015/v3/namespaces/default/apps/output-batchsink-invalid-nodepath-test/versions/-SNAPSHOT/services/DatasetService/runs?status=RUNNING&start=0&end=9223372036854775807&limit=2147483647
11-Nov-2018 11:35:14 2018-11-11 11:35:14,946 - INFO  [main:c.c.c.t.AudiTestBase$1@134] - Received response: [200] Response Body: []
11-Nov-2018 11:35:14 2018-11-11 11:35:14,997 - INFO  [main:c.c.c.t.AudiTestBase$1@125] - Making request: GET http://10.210.0.45:11015/v3/namespaces/default/apps/output-batchsink-invalid-nodepath-test/versions/-SNAPSHOT/services/DatasetService/runs?status=RUNNING&start=0&end=9223372036854775807&limit=2147483647
11-Nov-2018 11:35:15 2018-11-11 11:35:15,087 - INFO  [main:c.c.c.t.AudiTestBase$1@134] - Received response: [200] Response Body: []
11-Nov-2018 11:35:15 2018-11-11 11:35:15,138 - INFO  [main:c.c.c.t.AudiTestBase$1@125] - Making request: GET http://10.210.0.45:11015/v3/namespaces/default/apps/output-batchsink-invalid-nodepath-test/versions/-SNAPSHOT/services/DatasetService/runs?status=RUNNING&start=0&end=9223372036854775807&limit=2147483647
11-Nov-2018 11:35:15 2018-11-11 11:35:15,228 - INFO  [main:c.c.c.t.AudiTestBase$1@134] - Received response: [200] Response Body: []
11-Nov-2018 11:35:15 2018-11-11 11:35:15,279 - INFO  [main:c.c.c.t.AudiTestBase$1@125] - Making request: GET http://10.210.0.45:11015/v3/namespaces/default/apps/output-batchsink-invalid-nodepath-test/versions/-SNAPSHOT/services/DatasetService/runs?status=RUNNING&start=0&end=9223372036854775807&limit=2147483647
11-Nov-2018 11:35:15 2018-11-11 11:35:15,370 - INFO  [main:c.c.c.t.AudiTestBase$1@134] - Received response: [200] Response Body: []
11-Nov-2018 11:35:15 2018-11-11 11:35:15,420 - INFO  [main:c.c.c.t.AudiTestBase$1@125] - Making request: GET http://10.210.0.45:11015/v3/namespaces/default/apps/output-batchsink-invalid-nodepath-test/versions/-SNAPSHOT/services/DatasetService/runs?status=RUNNING&start=0&end=9223372036854775807&limit=2147483647
11-Nov-2018 11:35:15 2018-11-11 11:35:15,510 - INFO  [main:c.c.c.t.AudiTestBase$1@134] - Received response: [200] Response Body: [{"runid":"d1b2077a-e5a5-11e8-9aaf-42010ad2002d","starting":1541936098,"start":1541936114,"status":"RUNNING","properties":{"runtimeArgs":"{\"logical.start.time\":\"1541936098521\"}"}}]
11-Nov-2018 11:35:15 2018-11-11 11:35:15,511 - INFO  [main:c.c.c.t.AudiTestBase$1@125] - Making request: GET http://10.210.0.45:11015/v3/namespaces/default/apps/output-batchsink-invalid-nodepath-test/versions/-SNAPSHOT/services/DatasetService/available
11-Nov-2018 11:35:15 2018-11-11 11:35:15,899 - INFO  [main:c.c.c.t.AudiTestBase$1@134] - Received response: [503] Response Body: Service is running but not accepting requests at this time.
11-Nov-2018 11:35:15 2018-11-11 11:35:15,950 - INFO  [main:c.c.c.t.AudiTestBase$1@125] - Making request: GET http://10.210.0.45:11015/v3/namespaces/default/apps/output-batchsink-invalid-nodepath-test/versions/-SNAPSHOT/services/DatasetService/available
11-Nov-2018 11:35:16 2018-11-11 11:35:16,338 - INFO  [main:c.c.c.t.AudiTestBase$1@134] - Received response: [503] Response Body: Service is running but not accepting requests at this time.
11-Nov-2018 11:35:16 2018-11-11 11:35:16,389 - INFO  [main:c.c.c.t.AudiTestBase$1@125] - Making request: GET http://10.210.0.45:11015/v3/namespaces/default/apps/output-batchsink-invalid-nodepath-test/versions/-SNAPSHOT/services/DatasetService/available
11-Nov-2018 11:35:16 2018-11-11 11:35:16,778 - INFO  [main:c.c.c.t.AudiTestBase$1@134] - Received response: [503] Response Body: Service is running but not accepting requests at this time.
11-Nov-2018 11:35:16 2018-11-11 11:35:16,829 - INFO  [main:c.c.c.t.AudiTestBase$1@125] - Making request: GET http://10.210.0.45:11015/v3/namespaces/default/apps/output-batchsink-invalid-nodepath-test/versions/-SNAPSHOT/services/DatasetService/available
11-Nov-2018 11:35:17 2018-11-11 11:35:17,217 - INFO  [main:c.c.c.t.AudiTestBase$1@134] - Received response: [503] Response Body: Service is running but not accepting requests at this time.
11-Nov-2018 11:35:17 2018-11-11 11:35:17,267 - INFO  [main:c.c.c.t.AudiTestBase$1@125] - Making request: GET http://10.210.0.45:11015/v3/namespaces/default/apps/output-batchsink-invalid-nodepath-test/versions/-SNAPSHOT/services/DatasetService/available
11-Nov-2018 11:35:17 2018-11-11 11:35:17,660 - INFO  [main:c.c.c.t.AudiTestBase$1@134] - Received response: [503] Response Body: Service is running but not accepting requests at this time.
11-Nov-2018 11:35:17 2018-11-11 11:35:17,711 - INFO  [main:c.c.c.t.AudiTestBase$1@125] - Making request: GET http://10.210.0.45:11015/v3/namespaces/default/apps/output-batchsink-invalid-nodepath-test/versions/-SNAPSHOT/services/DatasetService/available
11-Nov-2018 11:35:18 2018-11-11 11:35:18,099 - INFO  [main:c.c.c.t.AudiTestBase$1@134] - Received response: [503] Response Body: Service is running but not accepting requests at this time.
11-Nov-2018 11:35:18 2018-11-11 11:35:18,149 - INFO  [main:c.c.c.t.AudiTestBase$1@125] - Making request: GET http://10.210.0.45:11015/v3/namespaces/default/apps/output-batchsink-invalid-nodepath-test/versions/-SNAPSHOT/services/DatasetService/available
11-Nov-2018 11:35:18 2018-11-11 11:35:18,540 - INFO  [main:c.c.c.t.AudiTestBase$1@134] - Received response: [503] Response Body: Service is running but not accepting requests at this time.
11-Nov-2018 11:35:18 2018-11-11 11:35:18,591 - INFO  [main:c.c.c.t.AudiTestBase$1@125] - Making request: GET http://10.210.0.45:11015/v3/namespaces/default/apps/output-batchsink-invalid-nodepath-test/versions/-SNAPSHOT/services/DatasetService/available
11-Nov-2018 11:35:18 2018-11-11 11:35:18,985 - INFO  [main:c.c.c.t.AudiTestBase$1@134] - Received response: [503] Response Body: Service is running but not accepting requests at this time.
11-Nov-2018 11:35:19 2018-11-11 11:35:19,036 - INFO  [main:c.c.c.t.AudiTestBase$1@125] - Making request: GET http://10.210.0.45:11015/v3/namespaces/default/apps/output-batchsink-invalid-nodepath-test/versions/-SNAPSHOT/services/DatasetService/available
11-Nov-2018 11:35:19 2018-11-11 11:35:19,424 - INFO  [main:c.c.c.t.AudiTestBase$1@134] - Received response: [503] Response Body: Service is running but not accepting requests at this time.
11-Nov-2018 11:35:19 2018-11-11 11:35:19,475 - INFO  [main:c.c.c.t.AudiTestBase$1@125] - Making request: GET http://10.210.0.45:11015/v3/namespaces/default/apps/output-batchsink-invalid-nodepath-test/versions/-SNAPSHOT/services/DatasetService/available
11-Nov-2018 11:35:19 2018-11-11 11:35:19,866 - INFO  [main:c.c.c.t.AudiTestBase$1@134] - Received response: [503] Response Body: Service is running but not accepting requests at this time.
11-Nov-2018 11:35:19 2018-11-11 11:35:19,916 - INFO  [main:c.c.c.t.AudiTestBase$1@125] - Making request: GET http://10.210.0.45:11015/v3/namespaces/default/apps/output-batchsink-invalid-nodepath-test/versions/-SNAPSHOT/services/DatasetService/available
11-Nov-2018 11:35:20 2018-11-11 11:35:20,303 - INFO  [main:c.c.c.t.AudiTestBase$1@134] - Received response: [503] Response Body: Service is running but not accepting requests at this time.
11-Nov-2018 11:35:20 2018-11-11 11:35:20,353 - INFO  [main:c.c.c.t.AudiTestBase$1@125] - Making request: GET http://10.210.0.45:11015/v3/namespaces/default/apps/output-batchsink-invalid-nodepath-test/versions/-SNAPSHOT/services/DatasetService/available
11-Nov-2018 11:35:20 2018-11-11 11:35:20,743 - INFO  [main:c.c.c.t.AudiTestBase$1@134] - Received response: [503] Response Body: Service is running but not accepting requests at this time.
11-Nov-2018 11:35:20 2018-11-11 11:35:20,793 - INFO  [main:c.c.c.t.AudiTestBase$1@125] - Making request: GET http://10.210.0.45:11015/v3/namespaces/default/apps/output-batchsink-invalid-nodepath-test/versions/-SNAPSHOT/services/DatasetService/available
11-Nov-2018 11:35:21 2018-11-11 11:35:21,195 - INFO  [main:c.c.c.t.AudiTestBase$1@134] - Received response: [503] Response Body: Service is running but not accepting requests at this time.
11-Nov-2018 11:35:21 2018-11-11 11:35:21,245 - INFO  [main:c.c.c.t.AudiTestBase$1@125] - Making request: GET http://10.210.0.45:11015/v3/namespaces/default/apps/output-batchsink-invalid-nodepath-test/versions/-SNAPSHOT/services/DatasetService/available
11-Nov-2018 11:35:21 2018-11-11 11:35:21,634 - INFO  [main:c.c.c.t.AudiTestBase$1@134] - Received response: [503] Response Body: Service is running but not accepting requests at this time.
11-Nov-2018 11:35:21 2018-11-11 11:35:21,684 - INFO  [main:c.c.c.t.AudiTestBase$1@125] - Making request: GET http://10.210.0.45:11015/v3/namespaces/default/apps/output-batchsink-invalid-nodepath-test/versions/-SNAPSHOT/services/DatasetService/available
11-Nov-2018 11:35:22 2018-11-11 11:35:22,075 - INFO  [main:c.c.c.t.AudiTestBase$1@134] - Received response: [503] Response Body: Service is running but not accepting requests at this time.
11-Nov-2018 11:35:22 2018-11-11 11:35:22,126 - INFO  [main:c.c.c.t.AudiTestBase$1@125] - Making request: GET http://10.210.0.45:11015/v3/namespaces/default/apps/output-batchsink-invalid-nodepath-test/versions/-SNAPSHOT/services/DatasetService/available
11-Nov-2018 11:35:22 2018-11-11 11:35:22,519 - INFO  [main:c.c.c.t.AudiTestBase$1@134] - Received response: [503] Response Body: Service is running but not accepting requests at this time.
11-Nov-2018 11:35:22 2018-11-11 11:35:22,569 - INFO  [main:c.c.c.t.AudiTestBase$1@125] - Making request: GET http://10.210.0.45:11015/v3/namespaces/default/apps/output-batchsink-invalid-nodepath-test/versions/-SNAPSHOT/services/DatasetService/available
11-Nov-2018 11:35:22 2018-11-11 11:35:22,963 - INFO  [main:c.c.c.t.AudiTestBase$1@134] - Received response: [503] Response Body: Service is running but not accepting requests at this time.
11-Nov-2018 11:35:23 2018-11-11 11:35:23,014 - INFO  [main:c.c.c.t.AudiTestBase$1@125] - Making request: GET http://10.210.0.45:11015/v3/namespaces/default/apps/output-batchsink-invalid-nodepath-test/versions/-SNAPSHOT/services/DatasetService/available
11-Nov-2018 11:35:23 2018-11-11 11:35:23,414 - INFO  [main:c.c.c.t.AudiTestBase$1@134] - Received response: [503] Response Body: Service is running but not accepting requests at this time.
11-Nov-2018 11:35:23 2018-11-11 11:35:23,465 - INFO  [main:c.c.c.t.AudiTestBase$1@125] - Making request: GET http://10.210.0.45:11015/v3/namespaces/default/apps/output-batchsink-invalid-nodepath-test/versions/-SNAPSHOT/services/DatasetService/available
11-Nov-2018 11:35:23 2018-11-11 11:35:23,861 - INFO  [main:c.c.c.t.AudiTestBase$1@134] - Received response: [503] Response Body: Service is running but not accepting requests at this time.
11-Nov-2018 11:35:23 2018-11-11 11:35:23,912 - INFO  [main:c.c.c.t.AudiTestBase$1@125] - Making request: GET http://10.210.0.45:11015/v3/namespaces/default/apps/output-batchsink-invalid-nodepath-test/versions/-SNAPSHOT/services/DatasetService/available
11-Nov-2018 11:35:24 2018-11-11 11:35:24,308 - INFO  [main:c.c.c.t.AudiTestBase$1@134] - Received response: [503] Response Body: Service is running but not accepting requests at this time.
11-Nov-2018 11:35:24 2018-11-11 11:35:24,359 - INFO  [main:c.c.c.t.AudiTestBase$1@125] - Making request: GET http://10.210.0.45:11015/v3/namespaces/default/apps/output-batchsink-invalid-nodepath-test/versions/-SNAPSHOT/services/DatasetService/available
11-Nov-2018 11:35:24 2018-11-11 11:35:24,754 - INFO  [main:c.c.c.t.AudiTestBase$1@134] - Received response: [503] Response Body: Service is running but not accepting requests at this time.
11-Nov-2018 11:35:24 2018-11-11 11:35:24,805 - INFO  [main:c.c.c.t.AudiTestBase$1@125] - Making request: GET http://10.210.0.45:11015/v3/namespaces/default/apps/output-batchsink-invalid-nodepath-test/versions/-SNAPSHOT/services/DatasetService/available
11-Nov-2018 11:35:25 2018-11-11 11:35:25,200 - INFO  [main:c.c.c.t.AudiTestBase$1@134] - Received response: [503] Response Body: Service is running but not accepting requests at this time.
11-Nov-2018 11:35:25 2018-11-11 11:35:25,251 - INFO  [main:c.c.c.t.AudiTestBase$1@125] - Making request: GET http://10.210.0.45:11015/v3/namespaces/default/apps/output-batchsink-invalid-nodepath-test/versions/-SNAPSHOT/services/DatasetService/available
11-Nov-2018 11:35:25 2018-11-11 11:35:25,648 - INFO  [main:c.c.c.t.AudiTestBase$1@134] - Received response: [503] Response Body: Service is running but not accepting requests at this time.
11-Nov-2018 11:35:25 2018-11-11 11:35:25,699 - INFO  [main:c.c.c.t.AudiTestBase$1@125] - Making request: GET http://10.210.0.45:11015/v3/namespaces/default/apps/output-batchsink-invalid-nodepath-test/versions/-SNAPSHOT/services/DatasetService/available
11-Nov-2018 11:35:26 2018-11-11 11:35:26,098 - INFO  [main:c.c.c.t.AudiTestBase$1@134] - Received response: [503] Response Body: Service is running but not accepting requests at this time.
11-Nov-2018 11:35:26 2018-11-11 11:35:26,148 - INFO  [main:c.c.c.t.AudiTestBase$1@125] - Making request: GET http://10.210.0.45:11015/v3/namespaces/default/apps/output-batchsink-invalid-nodepath-test/versions/-SNAPSHOT/services/DatasetService/available
11-Nov-2018 11:35:26 2018-11-11 11:35:26,543 - INFO  [main:c.c.c.t.AudiTestBase$1@134] - Received response: [503] Response Body: Service is running but not accepting requests at this time.
11-Nov-2018 11:35:26 2018-11-11 11:35:26,593 - INFO  [main:c.c.c.t.AudiTestBase$1@125] - Making request: GET http://10.210.0.45:11015/v3/namespaces/default/apps/output-batchsink-invalid-nodepath-test/versions/-SNAPSHOT/services/DatasetService/available
11-Nov-2018 11:35:26 2018-11-11 11:35:26,988 - INFO  [main:c.c.c.t.AudiTestBase$1@134] - Received response: [503] Response Body: Service is running but not accepting requests at this time.
11-Nov-2018 11:35:27 2018-11-11 11:35:27,038 - INFO  [main:c.c.c.t.AudiTestBase$1@125] - Making request: GET http://10.210.0.45:11015/v3/namespaces/default/apps/output-batchsink-invalid-nodepath-test/versions/-SNAPSHOT/services/DatasetService/available
11-Nov-2018 11:35:27 2018-11-11 11:35:27,384 - INFO  [main:c.c.c.t.AudiTestBase$1@134] - Received response: [200] Response Body: Service is available to accept requests.
11-Nov-2018 11:35:27 2018-11-11 11:35:27,385 - INFO  [main:c.c.c.t.AudiTestBase$1@125] - Making request: GET http://10.210.0.45:11015/v3/namespaces/default/apps/output-batchsink-invalid-nodepath-test/versions/-SNAPSHOT/services/DatasetService
11-Nov-2018 11:35:27 2018-11-11 11:35:27,509 - INFO  [main:c.c.c.t.AudiTestBase$1@134] - Received response: [200] Response Body: {"className":"co.cask.cdap.remote.dataset.AbstractDatasetApp$DatasetService","name":"DatasetService","description":"","handlers":{"TableHttpHandler":{"className":"co.cask.cdap.remote.dataset.table.TableDatasetApp$TableHttpHandler","name":"TableHttpHandler","description":"","properties":{"co.cask.cdap.remote.dataset.table.TableDatasetApp$TableHttpHandler.datasetName":"output-batchsink-invalid-nodepath-test"},"datasets":[],"endpoints":[{"method":"POST","path":"/namespaces/{namespace}/datasets/{dataset}/incrementAndGet"},{"method":"POST","path":"/namespaces/{namespace}/datasets/{dataset}/get"},{"method":"POST","path":"/namespaces/{namespace}/datasets/{dataset}/put"},{"method":"POST","path":"/getWithRange"},{"method":"POST","path":"/compareAndSwap"},{"method":"POST","path":"/get"},{"method":"POST","path":"/put"},{"method":"POST","path":"/delete"},{"method":"POST","path":"/incrementAndGet"}]}},"resources":{"virtualCores":1,"memoryMB":512},"instances":1}
11-Nov-2018 11:35:27 2018-11-11 11:35:27,510 - INFO  [main:c.c.c.t.AudiTestBase$1@125] - Making request: POST http://10.210.0.45:11015/v3/namespaces/default/apps/output-batchsink-invalid-nodepath-test/versions/-SNAPSHOT/services/DatasetService/methods/get
11-Nov-2018 11:35:30 2018-11-11 11:35:30,086 - INFO  [main:c.c.c.t.AudiTestBase$1@134] - Received response: [200] Response Body: {"row":[50,50],"columns":{}}
11-Nov-2018 11:35:30 2018-11-11 11:35:30,086 - INFO  [main:c.c.c.t.AudiTestBase$1@125] - Making request: POST http://10.210.0.45:11015/v3/namespaces/default/apps/output-batchsink-invalid-nodepath-test/versions/-SNAPSHOT/services/DatasetService/methods/get
11-Nov-2018 11:35:30 2018-11-11 11:35:30,190 - INFO  [main:c.c.c.t.AudiTestBase$1@134] - Received response: [200] Response Body: {"row":[49,50,56],"columns":{}}
11-Nov-2018 11:35:30 2018-11-11 11:35:30,190 - INFO  [main:c.c.c.t.AudiTestBase$1@125] - Making request: GET http://10.210.0.45:11015/v3/namespaces/default/apps/UploadFile/versions/-SNAPSHOT/services/FileSetService/methods/fileExist/xmlreadersource?path=catalog.xml
11-Nov-2018 11:35:30 2018-11-11 11:35:30,316 - INFO  [main:c.c.c.t.AudiTestBase$1@134] - Received response: [200] Response Body: false
11-Nov-2018 11:35:30 2018-11-11 11:35:30,316 - INFO  [main:c.c.c.t.AudiTestBase$1@125] - Making request: GET http://10.210.0.45:11015/v3/namespaces/default/apps/UploadFile/versions/-SNAPSHOT/services/FileSetService/methods/fileExist/xmlreadertarget?path=catalog.xml
11-Nov-2018 11:35:30 2018-11-11 11:35:30,428 - INFO  [main:c.c.c.t.AudiTestBase$1@134] - Received response: [200] Response Body: true
11-Nov-2018 11:35:30 2018-11-11 11:35:30,429 - INFO  [main:c.c.c.t.AudiTestBase$1@125] - Making request: GET http://10.210.0.45:11015/v3/namespaces/default/apps/UploadFile/versions/-SNAPSHOT/services/FileSetService/methods/fileExist/xmlreadersource?path=catalogProcessedFile.xml
11-Nov-2018 11:35:30 2018-11-11 11:35:30,521 - INFO  [main:c.c.c.t.AudiTestBase$1@134] - Received response: [200] Response Body: true
11-Nov-2018 11:35:30 2018-11-11 11:35:30,521 - INFO  [main:c.c.c.t.AudiTestBase$1@125] - Making request: POST http://10.210.0.45:11015/v3/namespaces/default/apps/XMLInvalidNodePathTrackingTable/versions/-SNAPSHOT/services/DatasetService/methods/read
11-Nov-2018 11:35:30 2018-11-11 11:35:30,749 - INFO  [main:c.c.c.t.AudiTestBase$1@134] - Received response: [200] Response Body: {"result":[0,0,1,102,-101,-116,-109,24]}
11-Nov-2018 11:35:30 2018-11-11 11:35:30,749 - INFO  [main:c.c.c.t.IntegrationTestBase@119] - Beginning tearDown.
11-Nov-2018 11:35:30 2018-11-11 11:35:30,750 - INFO  [main:c.c.c.t.AudiTestBase$1@125] - Making request: GET http://10.210.0.45:11015/v3/namespaces/default
11-Nov-2018 11:35:30 2018-11-11 11:35:30,826 - INFO  [main:c.c.c.t.AudiTestBase$1@134] - Received response: [200] Response Body: {"name":"default","description":"Default Namespace","config":{"scheduler.queue.name":"","explore.as.principal":true}}
11-Nov-2018 11:35:30 2018-11-11 11:35:30,827 - INFO  [main:c.c.c.t.AudiTestBase$1@125] - Making request: GET http://10.210.0.45:11015/v3/namespaces/default/apps
11-Nov-2018 11:35:30 2018-11-11 11:35:30,919 - INFO  [main:c.c.c.t.AudiTestBase$1@134] - Received response: [200] Response Body: [{"type":"App","id":"UploadFile","name":"UploadFile","version":"-SNAPSHOT","description":"Application to upload file on HDFS using FileSet dataset","artifact":{"name":"UploadFile","version":"1.0.0-SNAPSHOT","scope":"USER"}},{"type":"App","id":"XMLInvalidNodePathTest","name":"XMLInvalidNodePathTest","version":"-SNAPSHOT","description":"Data Pipeline Application","artifact":{"name":"cdap-data-pipeline","version":"4.3.5-SNAPSHOT","scope":"SYSTEM"}},{"type":"App","id":"output-batchsink-invalid-nodepath-test","name":"output-batchsink-invalid-nodepath-test","version":"-SNAPSHOT","description":"","artifact":{"name":"TableDatasetApp","version":"1.0.0-SNAPSHOT","scope":"USER"}},{"type":"App","id":"XMLInvalidNodePathTrackingTable","name":"XMLInvalidNodePathTrackingTable","version":"-SNAPSHOT","description":"","artifact":{"name":"KVTableDatasetApp","version":"1.0.0-SNAPSHOT","scope":"USER"}}]
11-Nov-2018 11:35:30 2018-11-11 11:35:30,920 - INFO  [main:c.c.c.t.AudiTestBase$1@125] - Making request: GET http://10.210.0.45:11015/v3/namespaces/default/apps/UploadFile/versions/-SNAPSHOT
11-Nov-2018 11:35:31 2018-11-11 11:35:31,005 - INFO  [main:c.c.c.t.AudiTestBase$1@134] - Received response: [200] Response Body: {"name":"UploadFile","appVersion":"-SNAPSHOT","artifactVersion":"1.0.0-SNAPSHOT","description":"Application to upload file on HDFS using FileSet dataset","configuration":"","streams":[],"datasets":[],"programs":[{"type":"Service","app":"UploadFile","id":"FileSetService","name":"FileSetService","description":"A service to upload files to file sets, and return it\u0027s location"}],"plugins":[],"artifact":{"name":"UploadFile","version":"1.0.0-SNAPSHOT","scope":"USER"}}
11-Nov-2018 11:35:31 2018-11-11 11:35:31,005 - INFO  [main:c.c.c.t.AudiTestBase$1@125] - Making request: GET http://10.210.0.45:11015/v3/namespaces/default/apps/UploadFile/versions/-SNAPSHOT/services/FileSetService/status
11-Nov-2018 11:35:31 2018-11-11 11:35:31,093 - INFO  [main:c.c.c.t.AudiTestBase$1@134] - Received response: [200] Response Body: {"status":"RUNNING"}
11-Nov-2018 11:35:31 2018-11-11 11:35:31,093 - INFO  [main:c.c.c.t.AudiTestBase$1@125] - Making request: POST http://10.210.0.45:11015/v3/namespaces/default/apps/UploadFile/versions/-SNAPSHOT/services/FileSetService/stop
11-Nov-2018 11:35:35 2018-11-11 11:35:35,569 - INFO  [main:c.c.c.t.AudiTestBase$1@134] - Received response: [200] Response Body:
11-Nov-2018 11:35:35 2018-11-11 11:35:35,570 - INFO  [main:c.c.c.t.AudiTestBase$1@125] - Making request: GET http://10.210.0.45:11015/v3/namespaces/default/apps/UploadFile/versions/-SNAPSHOT/services/FileSetService/status
11-Nov-2018 11:35:35 2018-11-11 11:35:35,628 - INFO  [main:c.c.c.t.AudiTestBase$1@134] - Received response: [200] Response Body: {"status":"STOPPED"}
11-Nov-2018 11:35:35 2018-11-11 11:35:35,628 - INFO  [main:c.c.c.t.AudiTestBase$1@125] - Making request: GET http://10.210.0.45:11015/v3/namespaces/default/apps/XMLInvalidNodePathTest/versions/-SNAPSHOT
11-Nov-2018 11:35:35 2018-11-11 11:35:35,750 - INFO  [main:c.c.c.t.AudiTestBase$1@134] - Received response: [200] Response Body: {"name":"XMLInvalidNodePathTest","appVersion":"-SNAPSHOT","artifactVersion":"4.3.5-SNAPSHOT","description":"Data Pipeline Application","configuration":"{\"engine\":\"MAPREDUCE\",\"schedule\":\"* * * * *\",\"postActions\":[],\"stages\":[{\"name\":\"XMLTableSink\",\"plugin\":{\"name\":\"Table\",\"type\":\"batchsink\",\"properties\":{\"name\":\"output-batchsink-invalid-nodepath-test\",\"schema.row.field\":\"offset\",\"schema\":\"{\\\"type\\\":\\\"record\\\",\\\"name\\\":\\\"xmlSink\\\",\\\"fields\\\":[{\\\"name\\\":\\\"offset\\\",\\\"type\\\":\\\"string\\\"},{\\\"name\\\":\\\"filename\\\",\\\"type\\\":\\\"string\\\"},{\\\"name\\\":\\\"record\\\",\\\"type\\\":\\\"string\\\"}]}\"}}},{\"name\":\"XMLProjectionTransform\",\"plugin\":{\"name\":\"Projection\",\"type\":\"transform\",\"properties\":{\"convert\":\"offset:string\",\"schema\":\"{\\\"type\\\":\\\"record\\\",\\\"name\\\":\\\"xmlTransform\\\",\\\"fields\\\":[{\\\"name\\\":\\\"offset\\\",\\\"type\\\":\\\"long\\\"},{\\\"name\\\":\\\"filename\\\",\\\"type\\\":\\\"string\\\"},{\\\"name\\\":\\\"record\\\",\\\"type\\\":\\\"string\\\"}]}\"}}},{\"name\":\"XMLReader\",\"plugin\":{\"name\":\"XMLReader\",\"type\":\"batchsource\",\"properties\":{\"referenceName\":\"XMLReaderInvalidNodePathTest\",\"path\":\"hdfs://10.210.0.45:8020/cdap/namespaces/default/data/xmlreadersource/\",\"targetFolder\":\"hdfs://10.210.0.45:8020/cdap/namespaces/default/data/xmlreadertarget/\",\"nodePath\":\"/catalog/book/prices\",\"reprocessingRequired\":\"No\",\"tableName\":\"XMLInvalidNodePathTrackingTable\",\"actionAfterProcess\":\"move\",\"tableExpiryPeriod\":\"30\",\"temporaryFolder\":\"/tmp\"}}}],\"connections\":[{\"from\":\"XMLReader\",\"to\":\"XMLProjectionTransform\"},{\"from\":\"XMLProjectionTransform\",\"to\":\"XMLTableSink\"}],\"resources\":{\"virtualCores\":1.0,\"memoryMB\":1024.0},\"driverResources\":{\"virtualCores\":1.0,\"memoryMB\":1024.0},\"clientResources\":{\"virtualCores\":1.0,\"memoryMB\":1024.0},\"stageLoggingEnabled\":true,\"processTimingEnabled\":true,\"numOfRecordsPreview\":0.0,\"properties\":{},\"sinks\":[],\"transforms\":[]}","streams":[],"datasets":[{"name":"XMLInvalidNodePathTrackingTable","classname":"co.cask.cdap.api.dataset.lib.KeyValueTable"},{"name":"output-batchsink-invalid-nodepath-test","classname":"co.cask.cdap.api.dataset.table.Table"}],"programs":[{"type":"Mapreduce","app":"XMLInvalidNodePathTest","id":"phase-1","name":"phase-1","description":"MapReduce phase executor. Sources \u0027XMLReader\u0027 to sinks \u0027XMLTableSink\u0027."},{"type":"Workflow","app":"XMLInvalidNodePathTest","id":"DataPipelineWorkflow","name":"DataPipelineWorkflow","description":"Data Pipeline Workflow"}],"plugins":[{"id":"XMLProjectionTransform","name":"Projection","type":"transform"},{"id":"XMLTableSink","name":"Table","type":"batchsink"},{"id":"XMLReader","name":"XMLReader","type":"batchsource"}],"artifact":{"name":"cdap-data-pipeline","version":"4.3.5-SNAPSHOT","scope":"SYSTEM"}}
11-Nov-2018 11:35:35 2018-11-11 11:35:35,750 - INFO  [main:c.c.c.t.AudiTestBase$1@125] - Making request: GET http://10.210.0.45:11015/v3/namespaces/default/apps/XMLInvalidNodePathTest/versions/-SNAPSHOT/mapreduce/phase-1/status
11-Nov-2018 11:35:35 2018-11-11 11:35:35,847 - INFO  [main:c.c.c.t.AudiTestBase$1@134] - Received response: [200] Response Body: {"status":"STOPPED"}
11-Nov-2018 11:35:35 2018-11-11 11:35:35,847 - INFO  [main:c.c.c.t.AudiTestBase$1@125] - Making request: GET http://10.210.0.45:11015/v3/namespaces/default/apps/XMLInvalidNodePathTest/versions/-SNAPSHOT/workflows/DataPipelineWorkflow/status
11-Nov-2018 11:35:35 2018-11-11 11:35:35,944 - INFO  [main:c.c.c.t.AudiTestBase$1@134] - Received response: [200] Response Body: {"status":"STOPPED"}
11-Nov-2018 11:35:35 2018-11-11 11:35:35,944 - INFO  [main:c.c.c.t.AudiTestBase$1@125] - Making request: GET http://10.210.0.45:11015/v3/namespaces/default/apps/output-batchsink-invalid-nodepath-test/versions/-SNAPSHOT
11-Nov-2018 11:35:36 2018-11-11 11:35:36,031 - INFO  [main:c.c.c.t.AudiTestBase$1@134] - Received response: [200] Response Body: {"name":"output-batchsink-invalid-nodepath-test","appVersion":"-SNAPSHOT","artifactVersion":"1.0.0-SNAPSHOT","description":"","configuration":"{\"datasetName\":\"output-batchsink-invalid-nodepath-test\"}","streams":[],"datasets":[{"name":"output-batchsink-invalid-nodepath-test","classname":"co.cask.cdap.api.dataset.table.Table"}],"programs":[{"type":"Service","app":"output-batchsink-invalid-nodepath-test","id":"DatasetService","name":"DatasetService","description":""}],"plugins":[],"artifact":{"name":"TableDatasetApp","version":"1.0.0-SNAPSHOT","scope":"USER"}}
11-Nov-2018 11:35:36 2018-11-11 11:35:36,031 - INFO  [main:c.c.c.t.AudiTestBase$1@125] - Making request: GET http://10.210.0.45:11015/v3/namespaces/default/apps/output-batchsink-invalid-nodepath-test/versions/-SNAPSHOT/services/DatasetService/status
11-Nov-2018 11:35:36 2018-11-11 11:35:36,118 - INFO  [main:c.c.c.t.AudiTestBase$1@134] - Received response: [200] Response Body: {"status":"RUNNING"}
11-Nov-2018 11:35:36 2018-11-11 11:35:36,118 - INFO  [main:c.c.c.t.AudiTestBase$1@125] - Making request: POST http://10.210.0.45:11015/v3/namespaces/default/apps/output-batchsink-invalid-nodepath-test/versions/-SNAPSHOT/services/DatasetService/stop
11-Nov-2018 11:35:41 2018-11-11 11:35:41,910 - INFO  [main:c.c.c.t.AudiTestBase$1@134] - Received response: [200] Response Body:
11-Nov-2018 11:35:41 2018-11-11 11:35:41,910 - INFO  [main:c.c.c.t.AudiTestBase$1@125] - Making request: GET http://10.210.0.45:11015/v3/namespaces/default/apps/output-batchsink-invalid-nodepath-test/versions/-SNAPSHOT/services/DatasetService/status
11-Nov-2018 11:35:41 2018-11-11 11:35:41,970 - INFO  [main:c.c.c.t.AudiTestBase$1@134] - Received response: [200] Response Body: {"status":"STOPPED"}
11-Nov-2018 11:35:41 2018-11-11 11:35:41,971 - INFO  [main:c.c.c.t.AudiTestBase$1@125] - Making request: GET http://10.210.0.45:11015/v3/namespaces/default/apps/XMLInvalidNodePathTrackingTable/versions/-SNAPSHOT
11-Nov-2018 11:35:42 2018-11-11 11:35:42,056 - INFO  [main:c.c.c.t.AudiTestBase$1@134] - Received response: [200] Response Body: {"name":"XMLInvalidNodePathTrackingTable","appVersion":"-SNAPSHOT","artifactVersion":"1.0.0-SNAPSHOT","description":"","configuration":"{\"datasetName\":\"XMLInvalidNodePathTrackingTable\"}","streams":[],"datasets":[{"name":"XMLInvalidNodePathTrackingTable","classname":"co.cask.cdap.api.dataset.lib.KeyValueTable"}],"programs":[{"type":"Service","app":"XMLInvalidNodePathTrackingTable","id":"DatasetService","name":"DatasetService","description":""}],"plugins":[],"artifact":{"name":"KVTableDatasetApp","version":"1.0.0-SNAPSHOT","scope":"USER"}}
11-Nov-2018 11:35:42 2018-11-11 11:35:42,056 - INFO  [main:c.c.c.t.AudiTestBase$1@125] - Making request: GET http://10.210.0.45:11015/v3/namespaces/default/apps/XMLInvalidNodePathTrackingTable/versions/-SNAPSHOT/services/DatasetService/status
11-Nov-2018 11:35:42 2018-11-11 11:35:42,146 - INFO  [main:c.c.c.t.AudiTestBase$1@134] - Received response: [200] Response Body: {"status":"RUNNING"}
11-Nov-2018 11:35:42 2018-11-11 11:35:42,146 - INFO  [main:c.c.c.t.AudiTestBase$1@125] - Making request: POST http://10.210.0.45:11015/v3/namespaces/default/apps/XMLInvalidNodePathTrackingTable/versions/-SNAPSHOT/services/DatasetService/stop
11-Nov-2018 11:35:46 2018-11-11 11:35:46,739 - INFO  [main:c.c.c.t.AudiTestBase$1@134] - Received response: [200] Response Body:
11-Nov-2018 11:35:46 2018-11-11 11:35:46,740 - INFO  [main:c.c.c.t.AudiTestBase$1@125] - Making request: GET http://10.210.0.45:11015/v3/namespaces/default/apps/XMLInvalidNodePathTrackingTable/versions/-SNAPSHOT/services/DatasetService/status
11-Nov-2018 11:35:46 2018-11-11 11:35:46,798 - INFO  [main:c.c.c.t.AudiTestBase$1@134] - Received response: [200] Response Body: {"status":"STOPPED"}
11-Nov-2018 11:35:46 2018-11-11 11:35:46,799 - INFO  [main:c.c.c.t.AudiTestBase$1@125] - Making request: GET http://10.210.0.45:11015/v3/namespaces/default/apps
11-Nov-2018 11:35:46 2018-11-11 11:35:46,895 - INFO  [main:c.c.c.t.AudiTestBase$1@134] - Received response: [200] Response Body: [{"type":"App","id":"UploadFile","name":"UploadFile","version":"-SNAPSHOT","description":"Application to upload file on HDFS using FileSet dataset","artifact":{"name":"UploadFile","version":"1.0.0-SNAPSHOT","scope":"USER"}},{"type":"App","id":"XMLInvalidNodePathTest","name":"XMLInvalidNodePathTest","version":"-SNAPSHOT","description":"Data Pipeline Application","artifact":{"name":"cdap-data-pipeline","version":"4.3.5-SNAPSHOT","scope":"SYSTEM"}},{"type":"App","id":"output-batchsink-invalid-nodepath-test","name":"output-batchsink-invalid-nodepath-test","version":"-SNAPSHOT","description":"","artifact":{"name":"TableDatasetApp","version":"1.0.0-SNAPSHOT","scope":"USER"}},{"type":"App","id":"XMLInvalidNodePathTrackingTable","name":"XMLInvalidNodePathTrackingTable","version":"-SNAPSHOT","description":"","artifact":{"name":"KVTableDatasetApp","version":"1.0.0-SNAPSHOT","scope":"USER"}}]
11-Nov-2018 11:35:46 2018-11-11 11:35:46,895 - INFO  [main:c.c.c.t.AudiTestBase$1@125] - Making request: DELETE http://10.210.0.45:11015/v3/namespaces/default/apps/UploadFile/versions/-SNAPSHOT
11-Nov-2018 11:35:47 2018-11-11 11:35:47,459 - INFO  [main:c.c.c.t.AudiTestBase$1@134] - Received response: [200] Response Body:
11-Nov-2018 11:35:47 2018-11-11 11:35:47,460 - INFO  [main:c.c.c.t.AudiTestBase$1@125] - Making request: DELETE http://10.210.0.45:11015/v3/namespaces/default/apps/XMLInvalidNodePathTest/versions/-SNAPSHOT
11-Nov-2018 11:35:48 2018-11-11 11:35:48,222 - INFO  [main:c.c.c.t.AudiTestBase$1@134] - Received response: [200] Response Body:
11-Nov-2018 11:35:48 2018-11-11 11:35:48,223 - INFO  [main:c.c.c.t.AudiTestBase$1@125] - Making request: DELETE http://10.210.0.45:11015/v3/namespaces/default/apps/output-batchsink-invalid-nodepath-test/versions/-SNAPSHOT
11-Nov-2018 11:35:48 2018-11-11 11:35:48,661 - INFO  [main:c.c.c.t.AudiTestBase$1@134] - Received response: [200] Response Body:
11-Nov-2018 11:35:48 2018-11-11 11:35:48,661 - INFO  [main:c.c.c.t.AudiTestBase$1@125] - Making request: DELETE http://10.210.0.45:11015/v3/namespaces/default/apps/XMLInvalidNodePathTrackingTable/versions/-SNAPSHOT
11-Nov-2018 11:35:49 2018-11-11 11:35:49,118 - INFO  [main:c.c.c.t.AudiTestBase$1@134] - Received response: [200] Response Body:
11-Nov-2018 11:35:49 2018-11-11 11:35:49,118 - INFO  [main:c.c.c.t.AudiTestBase$1@125] - Making request: GET http://10.210.0.45:11015/v3/namespaces/default/streams
11-Nov-2018 11:35:49 2018-11-11 11:35:49,170 - INFO  [main:c.c.c.t.AudiTestBase$1@134] - Received response: [200] Response Body: []
11-Nov-2018 11:35:49 2018-11-11 11:35:49,171 - INFO  [main:c.c.c.t.AudiTestBase$1@125] - Making request: GET http://10.210.0.45:11015/v3/namespaces/default/data/datasets
11-Nov-2018 11:35:49 2018-11-11 11:35:49,290 - INFO  [main:c.c.c.t.AudiTestBase$1@134] - Received response: [200] Response Body: [{"name":"xmlreadersource","type":"fileSet","properties":{}},{"name":"xmlreadertarget","type":"fileSet","properties":{}},{"name":"XMLReaderInvalidNodePathTest","type":"externalDataset","properties":{"input.format.class":"co.cask.hydrator.plugin.batch.source.XMLInputFormat","mapreduce.input.fileinputformat.inputdir":"hdfs://10.210.0.45:8020/cdap/namespaces/default/data/xmlreadersource","mapreduce.input.pathFilter.class":"co.cask.hydrator.plugin.common.BatchXMLFileFilter","rpc.engine.org.apache.hadoop.hdfs.protocolPB.ClientNamenodeProtocolPB":"org.apache.hadoop.ipc.ProtobufRpcEngine","xml.inputformat.file.action":"move","xml.inputformat.node.path":"/catalog/book/prices","xml.inputformat.path.name":"hdfs://10.210.0.45:8020/cdap/namespaces/default/data/xmlreadersource/","xml.inputformat.processed.data.temp.folder":"/tmp/XMLInvalidNodePathTrackingTable1541935976190","xml.inputformat.processed.files":"[\"hdfs://10.210.0.45:8020/cdap/namespaces/default/data/xmlreadersource/catalogProcessedFile.xml\"]","xml.inputformat.target.folder":"hdfs://10.210.0.45:8020/cdap/namespaces/default/data/xmlreadertarget/"}},{"name":"XMLInvalidNodePathTrackingTable","type":"co.cask.cdap.api.dataset.lib.KeyValueTable","properties":{}},{"name":"output-batchsink-invalid-nodepath-test","type":"co.cask.cdap.api.dataset.table.Table","properties":{"schema":"{\"type\":\"record\",\"name\":\"xmlSink\",\"fields\":[{\"name\":\"offset\",\"type\":\"string\"},{\"name\":\"filename\",\"type\":\"string\"},{\"name\":\"record\",\"type\":\"string\"}]}","schema.row.field":"offset"}}]
11-Nov-2018 11:35:49 2018-11-11 11:35:49,290 - INFO  [main:c.c.c.t.AudiTestBase$1@125] - Making request: DELETE http://10.210.0.45:11015/v3/namespaces/default/data/datasets/xmlreadersource
11-Nov-2018 11:35:55 2018-11-11 11:35:55,985 - INFO  [main:c.c.c.t.AudiTestBase$1@134] - Received response: [200] Response Body:
11-Nov-2018 11:35:55 2018-11-11 11:35:55,986 - INFO  [main:c.c.c.t.AudiTestBase$1@125] - Making request: DELETE http://10.210.0.45:11015/v3/namespaces/default/data/datasets/xmlreadertarget
11-Nov-2018 11:35:56 2018-11-11 11:35:56,233 - INFO  [main:c.c.c.t.AudiTestBase$1@134] - Received response: [200] Response Body:
11-Nov-2018 11:35:56 2018-11-11 11:35:56,234 - INFO  [main:c.c.c.t.AudiTestBase$1@125] - Making request: DELETE http://10.210.0.45:11015/v3/namespaces/default/data/datasets/XMLReaderInvalidNodePathTest
11-Nov-2018 11:35:56 2018-11-11 11:35:56,445 - INFO  [main:c.c.c.t.AudiTestBase$1@134] - Received response: [200] Response Body:
11-Nov-2018 11:35:56 2018-11-11 11:35:56,446 - INFO  [main:c.c.c.t.AudiTestBase$1@125] - Making request: DELETE http://10.210.0.45:11015/v3/namespaces/default/data/datasets/XMLInvalidNodePathTrackingTable
11-Nov-2018 11:36:00 2018-11-11 11:36:00,707 - INFO  [main:c.c.c.t.AudiTestBase$1@134] - Received response: [200] Response Body:
11-Nov-2018 11:36:00 2018-11-11 11:36:00,708 - INFO  [main:c.c.c.t.AudiTestBase$1@125] - Making request: DELETE http://10.210.0.45:11015/v3/namespaces/default/data/datasets/output-batchsink-invalid-nodepath-test
11-Nov-2018 11:36:05 2018-11-11 11:36:05,006 - INFO  [main:c.c.c.t.AudiTestBase$1@134] - Received response: [200] Response Body:
11-Nov-2018 11:36:05 2018-11-11 11:36:05,007 - INFO  [main:c.c.c.t.AudiTestBase$1@125] - Making request: GET http://10.210.0.45:11015/v3/namespaces/default/artifacts?scope=USER
11-Nov-2018 11:36:05 2018-11-11 11:36:05,051 - INFO  [main:c.c.c.t.AudiTestBase$1@134] - Received response: [200] Response Body: [{"name":"KVTableDatasetApp","version":"1.0.0-SNAPSHOT","scope":"USER"},{"name":"TableDatasetApp","version":"1.0.0-SNAPSHOT","scope":"USER"},{"name":"UploadFile","version":"1.0.0-SNAPSHOT","scope":"USER"}]
11-Nov-2018 11:36:05 2018-11-11 11:36:05,052 - INFO  [main:c.c.c.t.AudiTestBase$1@125] - Making request: DELETE http://10.210.0.45:11015/v3/namespaces/default/artifacts/KVTableDatasetApp/versions/1.0.0-SNAPSHOT
11-Nov-2018 11:36:05 2018-11-11 11:36:05,204 - INFO  [main:c.c.c.t.AudiTestBase$1@134] - Received response: [200] Response Body:
11-Nov-2018 11:36:05 2018-11-11 11:36:05,205 - INFO  [main:c.c.c.t.AudiTestBase$1@125] - Making request: DELETE http://10.210.0.45:11015/v3/namespaces/default/artifacts/TableDatasetApp/versions/1.0.0-SNAPSHOT
11-Nov-2018 11:36:05 2018-11-11 11:36:05,319 - INFO  [main:c.c.c.t.AudiTestBase$1@134] - Received response: [200] Response Body:
11-Nov-2018 11:36:05 2018-11-11 11:36:05,320 - INFO  [main:c.c.c.t.AudiTestBase$1@125] - Making request: DELETE http://10.210.0.45:11015/v3/namespaces/default/artifacts/UploadFile/versions/1.0.0-SNAPSHOT
11-Nov-2018 11:36:05 2018-11-11 11:36:05,433 - INFO  [main:c.c.c.t.AudiTestBase$1@134] - Received response: [200] Response Body:
11-Nov-2018 11:36:05 2018-11-11 11:36:05,434 - INFO  [main:c.c.c.t.AudiTestBase$1@125] - Making request: GET http://10.210.0.45:11015/v3/namespaces/default/apps
11-Nov-2018 11:36:05 2018-11-11 11:36:05,479 - INFO  [main:c.c.c.t.AudiTestBase$1@134] - Received response: [200] Response Body: []
11-Nov-2018 11:36:05 2018-11-11 11:36:05,480 - INFO  [main:c.c.c.t.AudiTestBase$1@125] - Making request: GET http://10.210.0.45:11015/v3/namespaces/default/data/datasets
11-Nov-2018 11:36:05 2018-11-11 11:36:05,561 - INFO  [main:c.c.c.t.AudiTestBase$1@134] - Received response: [200] Response Body: []
11-Nov-2018 11:36:05 2018-11-11 11:36:05,561 - INFO  [main:c.c.c.t.AudiTestBase$1@125] - Making request: GET http://10.210.0.45:11015/v3/namespaces/default/streams
11-Nov-2018 11:36:05 2018-11-11 11:36:05,646 - INFO  [main:c.c.c.t.AudiTestBase$1@134] - Received response: [200] Response Body: []
11-Nov-2018 11:36:05 2018-11-11 11:36:05,647 - INFO  [main:c.c.c.t.IntegrationTestBase@131] - Completed tearDown.
11-Nov-2018 11:36:10 Tests run: 65, Failures: 0, Errors: 10, Skipped: 0, Time elapsed: 12,648.513 sec <<< FAILURE! - in co.cask.cdap.test.suite.AllTests
11-Nov-2018 11:36:10 testJoinerSpark(co.cask.cdap.app.etl.batch.BatchJoinerTest)  Time elapsed: 168.948 sec  <<< ERROR!
11-Nov-2018 11:36:10 java.lang.RuntimeException: java.io.IOException: 500: Spark not found. Please set environment variable SPARK_HOME
11-Nov-2018 11:36:10         at co.cask.cdap.client.util.RESTClient.execute(RESTClient.java:132)
11-Nov-2018 11:36:10         at co.cask.cdap.client.util.RESTClient.execute(RESTClient.java:69)
11-Nov-2018 11:36:10         at co.cask.cdap.client.ProgramClient.start(ProgramClient.java:155)
11-Nov-2018 11:36:10         at co.cask.cdap.test.remote.RemoteApplicationManager.startProgram(RemoteApplicationManager.java:151)
11-Nov-2018 11:36:10         at co.cask.cdap.test.AbstractProgramManager.start(AbstractProgramManager.java:57)
11-Nov-2018 11:36:10         at co.cask.cdap.test.AbstractProgramManager.start(AbstractProgramManager.java:52)
11-Nov-2018 11:36:10         at co.cask.cdap.app.etl.batch.BatchJoinerTest.testJoiner(BatchJoinerTest.java:224)
11-Nov-2018 11:36:10         at co.cask.cdap.app.etl.batch.BatchJoinerTest.testJoinerSpark(BatchJoinerTest.java:102)
11-Nov-2018 11:36:10
11-Nov-2018 11:36:10 testDataStreams(co.cask.cdap.app.etl.********.DataStreamsTest)  Time elapsed: 48.217 sec  <<< ERROR!
11-Nov-2018 11:36:10 java.io.IOException: java.lang.IllegalArgumentException: No plugin of type streamingsource and name File could be found for stage File.
11-Nov-2018 11:36:10         at co.cask.cdap.client.util.RESTClient.upload(RESTClient.java:160)
11-Nov-2018 11:36:10         at co.cask.cdap.client.ApplicationClient.deploy(ApplicationClient.java:614)
11-Nov-2018 11:36:10         at co.cask.cdap.test.IntegrationTestManager.deployApplication(IntegrationTestManager.java:203)
11-Nov-2018 11:36:10         at co.cask.cdap.test.IntegrationTestBase.deployApplication(IntegrationTestBase.java:400)
11-Nov-2018 11:36:10         at co.cask.cdap.app.etl.********.DataStreamsTest.testDataStreams(DataStreamsTest.java:145)
11-Nov-2018 11:36:10
11-Nov-2018 11:36:10 test(co.cask.cdap.app.etl.batch.RowDenormalizerTest)  Time elapsed: 713.213 sec  <<< ERROR!
11-Nov-2018 11:36:10 java.util.concurrent.TimeoutException: Timeout occurred. Expected true but found false.
11-Nov-2018 11:36:10         at co.cask.cdap.common.utils.Tasks.waitFor(Tasks.java:70)
11-Nov-2018 11:36:10         at co.cask.cdap.common.utils.Tasks.waitFor(Tasks.java:91)
11-Nov-2018 11:36:10         at co.cask.cdap.common.utils.Tasks.waitFor(Tasks.java:130)
11-Nov-2018 11:36:10         at co.cask.cdap.test.AbstractProgramManager.waitForRuns(AbstractProgramManager.java:90)
11-Nov-2018 11:36:10         at co.cask.cdap.test.AbstractProgramManager.waitForRun(AbstractProgramManager.java:84)
11-Nov-2018 11:36:10         at co.cask.cdap.app.etl.batch.RowDenormalizerTest.test(RowDenormalizerTest.java:102)
11-Nov-2018 11:36:10
11-Nov-2018 11:36:10 test(co.cask.cdap.app.etl.batch.RowDenormalizerTest)  Time elapsed: 713.214 sec  <<< ERROR!
11-Nov-2018 11:36:10 java.util.concurrent.TimeoutException: Timeout occurred. Expected STOPPED but found RUNNING.
11-Nov-2018 11:36:10         at co.cask.cdap.common.utils.Tasks.waitFor(Tasks.java:70)
11-Nov-2018 11:36:10         at co.cask.cdap.common.utils.Tasks.waitFor(Tasks.java:91)
11-Nov-2018 11:36:10         at co.cask.cdap.client.ProgramClient.waitForStatus(ProgramClient.java:490)
11-Nov-2018 11:36:10         at co.cask.cdap.client.ProgramClient.stopAll(ProgramClient.java:371)
11-Nov-2018 11:36:10         at co.cask.cdap.test.IntegrationTestBase.doClear(IntegrationTestBase.java:413)
11-Nov-2018 11:36:10         at co.cask.cdap.test.IntegrationTestBase.tearDown(IntegrationTestBase.java:128)
11-Nov-2018 11:36:10         at sun.reflect.GeneratedMethodAccessor4.invoke(Unknown Source)
11-Nov-2018 11:36:10         at sun.reflect.DelegatingMethodAccessorImpl.invoke(DelegatingMethodAccessorImpl.java:43)
11-Nov-2018 11:36:10         at java.lang.reflect.Method.invoke(Method.java:498)
11-Nov-2018 11:36:10         at org.junit.runners.model.FrameworkMethod$1.runReflectiveCall(FrameworkMethod.java:47)
11-Nov-2018 11:36:10         at org.junit.internal.runners.model.ReflectiveCallable.run(ReflectiveCallable.java:12)
11-Nov-2018 11:36:10         at org.junit.runners.model.FrameworkMethod.invokeExplosively(FrameworkMethod.java:44)
11-Nov-2018 11:36:10         at org.junit.internal.runners.statements.RunAfters.evaluate(RunAfters.java:33)
11-Nov-2018 11:36:10         at org.junit.runners.ParentRunner.runLeaf(ParentRunner.java:271)
11-Nov-2018 11:36:10         at org.junit.runners.BlockJUnit4ClassRunner.runChild(BlockJUnit4ClassRunner.java:70)
11-Nov-2018 11:36:10         at org.junit.runners.BlockJUnit4ClassRunner.runChild(BlockJUnit4ClassRunner.java:50)
11-Nov-2018 11:36:10         at org.junit.runners.ParentRunner$3.run(ParentRunner.java:238)
11-Nov-2018 11:36:10         at org.junit.runners.ParentRunner$1.schedule(ParentRunner.java:63)
11-Nov-2018 11:36:10         at org.junit.runners.ParentRunner.runChildren(ParentRunner.java:236)
11-Nov-2018 11:36:10         at org.junit.runners.ParentRunner.access$000(ParentRunner.java:53)
11-Nov-2018 11:36:10         at org.junit.runners.ParentRunner$2.evaluate(ParentRunner.java:229)
11-Nov-2018 11:36:10         at org.junit.rules.ExternalResource$1.evaluate(ExternalResource.java:48)
11-Nov-2018 11:36:10         at org.junit.rules.RunRules.evaluate(RunRules.java:20)
11-Nov-2018 11:36:10         at org.junit.runners.ParentRunner.run(ParentRunner.java:309)
11-Nov-2018 11:36:10         at org.junit.runners.Suite.runChild(Suite.java:127)
11-Nov-2018 11:36:10         at org.junit.runners.Suite.runChild(Suite.java:26)
11-Nov-2018 11:36:10         at org.junit.runners.ParentRunner$3.run(ParentRunner.java:238)
11-Nov-2018 11:36:10         at org.junit.runners.ParentRunner$1.schedule(ParentRunner.java:63)
11-Nov-2018 11:36:10         at org.junit.runners.ParentRunner.runChildren(ParentRunner.java:236)
11-Nov-2018 11:36:10         at org.junit.runners.ParentRunner.access$000(ParentRunner.java:53)
11-Nov-2018 11:36:10         at org.junit.runners.ParentRunner$2.evaluate(ParentRunner.java:229)
11-Nov-2018 11:36:10         at org.junit.runners.ParentRunner.run(ParentRunner.java:309)
11-Nov-2018 11:36:10         at org.apache.maven.surefire.junit4.JUnit4Provider.execute(JUnit4Provider.java:283)
11-Nov-2018 11:36:10         at org.apache.maven.surefire.junit4.JUnit4Provider.executeWithRerun(JUnit4Provider.java:173)
11-Nov-2018 11:36:10         at org.apache.maven.surefire.junit4.JUnit4Provider.executeTestSet(JUnit4Provider.java:153)
11-Nov-2018 11:36:10         at org.apache.maven.surefire.junit4.JUnit4Provider.invoke(JUnit4Provider.java:128)
11-Nov-2018 11:36:10         at org.apache.maven.surefire.booter.ForkedBooter.invokeProviderInSameClassLoader(ForkedBooter.java:203)
11-Nov-2018 11:36:10         at org.apache.maven.surefire.booter.ForkedBooter.runSuitesInProcess(ForkedBooter.java:155)
11-Nov-2018 11:36:10         at org.apache.maven.surefire.booter.ForkedBooter.main(ForkedBooter.java:103)
11-Nov-2018 11:36:10
11-Nov-2018 11:36:10 test(co.cask.cdap.app.serviceworker.ServiceWorkerTest)  Time elapsed: 94.011 sec  <<< ERROR!
11-Nov-2018 11:36:10 java.util.concurrent.TimeoutException: Timeout occurred. Expected STOPPED but found RUNNING.
11-Nov-2018 11:36:10         at co.cask.cdap.common.utils.Tasks.waitFor(Tasks.java:70)
11-Nov-2018 11:36:10         at co.cask.cdap.common.utils.Tasks.waitFor(Tasks.java:91)
11-Nov-2018 11:36:10         at co.cask.cdap.client.ProgramClient.waitForStatus(ProgramClient.java:490)
11-Nov-2018 11:36:10         at co.cask.cdap.client.ProgramClient.stopAll(ProgramClient.java:371)
11-Nov-2018 11:36:10         at co.cask.cdap.test.IntegrationTestBase.doClear(IntegrationTestBase.java:413)
11-Nov-2018 11:36:10         at co.cask.cdap.test.IntegrationTestBase.setUp(IntegrationTestBase.java:111)
11-Nov-2018 11:36:10         at sun.reflect.GeneratedMethodAccessor2.invoke(Unknown Source)
11-Nov-2018 11:36:10         at sun.reflect.DelegatingMethodAccessorImpl.invoke(DelegatingMethodAccessorImpl.java:43)
11-Nov-2018 11:36:10         at java.lang.reflect.Method.invoke(Method.java:498)
11-Nov-2018 11:36:10         at org.junit.runners.model.FrameworkMethod$1.runReflectiveCall(FrameworkMethod.java:47)
11-Nov-2018 11:36:10         at org.junit.internal.runners.model.ReflectiveCallable.run(ReflectiveCallable.java:12)
11-Nov-2018 11:36:10         at org.junit.runners.model.FrameworkMethod.invokeExplosively(FrameworkMethod.java:44)
11-Nov-2018 11:36:10         at org.junit.internal.runners.statements.RunBefores.evaluate(RunBefores.java:24)
11-Nov-2018 11:36:10         at org.junit.internal.runners.statements.RunAfters.evaluate(RunAfters.java:27)
11-Nov-2018 11:36:10         at org.junit.runners.ParentRunner.runLeaf(ParentRunner.java:271)
11-Nov-2018 11:36:10         at org.junit.runners.BlockJUnit4ClassRunner.runChild(BlockJUnit4ClassRunner.java:70)
11-Nov-2018 11:36:10         at org.junit.runners.BlockJUnit4ClassRunner.runChild(BlockJUnit4ClassRunner.java:50)
11-Nov-2018 11:36:10         at org.junit.runners.ParentRunner$3.run(ParentRunner.java:238)
11-Nov-2018 11:36:10         at org.junit.runners.ParentRunner$1.schedule(ParentRunner.java:63)
11-Nov-2018 11:36:10         at org.junit.runners.ParentRunner.runChildren(ParentRunner.java:236)
11-Nov-2018 11:36:10         at org.junit.runners.ParentRunner.access$000(ParentRunner.java:53)
11-Nov-2018 11:36:10         at org.junit.runners.ParentRunner$2.evaluate(ParentRunner.java:229)
11-Nov-2018 11:36:10         at org.junit.rules.ExternalResource$1.evaluate(ExternalResource.java:48)
11-Nov-2018 11:36:10         at org.junit.rules.RunRules.evaluate(RunRules.java:20)
11-Nov-2018 11:36:10         at org.junit.runners.ParentRunner.run(ParentRunner.java:309)
11-Nov-2018 11:36:10         at org.junit.runners.Suite.runChild(Suite.java:127)
11-Nov-2018 11:36:10         at org.junit.runners.Suite.runChild(Suite.java:26)
11-Nov-2018 11:36:10         at org.junit.runners.ParentRunner$3.run(ParentRunner.java:238)
11-Nov-2018 11:36:10         at org.junit.runners.ParentRunner$1.schedule(ParentRunner.java:63)
11-Nov-2018 11:36:10         at org.junit.runners.ParentRunner.runChildren(ParentRunner.java:236)
11-Nov-2018 11:36:10         at org.junit.runners.ParentRunner.access$000(ParentRunner.java:53)
11-Nov-2018 11:36:10         at org.junit.runners.ParentRunner$2.evaluate(ParentRunner.java:229)
11-Nov-2018 11:36:10         at org.junit.runners.ParentRunner.run(ParentRunner.java:309)
11-Nov-2018 11:36:10         at org.apache.maven.surefire.junit4.JUnit4Provider.execute(JUnit4Provider.java:283)
11-Nov-2018 11:36:10         at org.apache.maven.surefire.junit4.JUnit4Provider.executeWithRerun(JUnit4Provider.java:173)
11-Nov-2018 11:36:10         at org.apache.maven.surefire.junit4.JUnit4Provider.executeTestSet(JUnit4Provider.java:153)
11-Nov-2018 11:36:10         at org.apache.maven.surefire.junit4.JUnit4Provider.invoke(JUnit4Provider.java:128)
11-Nov-2018 11:36:10         at org.apache.maven.surefire.booter.ForkedBooter.invokeProviderInSameClassLoader(ForkedBooter.java:203)
11-Nov-2018 11:36:10         at org.apache.maven.surefire.booter.ForkedBooter.runSuitesInProcess(ForkedBooter.java:155)
11-Nov-2018 11:36:10         at org.apache.maven.surefire.booter.ForkedBooter.main(ForkedBooter.java:103)
11-Nov-2018 11:36:10
11-Nov-2018 11:36:10 test(co.cask.cdap.apps.spark.sparkpagerank.SparkPageRankAppTest)  Time elapsed: 3.698 sec  <<< ERROR!
11-Nov-2018 11:36:10 java.lang.RuntimeException: java.io.IOException: java.lang.IllegalStateException: Missing Spark related class co.cask.cdap.api.spark.JavaSparkMain. It may be caused by unavailability of Spark. Please verify environment variable SPARK_HOME is set correctly
11-Nov-2018 11:36:10         at co.cask.cdap.client.util.RESTClient.upload(RESTClient.java:160)
11-Nov-2018 11:36:10         at co.cask.cdap.client.ApplicationClient.deployApp(ApplicationClient.java:671)
11-Nov-2018 11:36:10         at co.cask.cdap.client.ApplicationClient.deploy(ApplicationClient.java:551)
11-Nov-2018 11:36:10         at co.cask.cdap.client.ApplicationClient.deploy(ApplicationClient.java:527)
11-Nov-2018 11:36:10         at co.cask.cdap.test.IntegrationTestManager.deployApplication(IntegrationTestManager.java:183)
11-Nov-2018 11:36:10         at co.cask.cdap.test.AbstractTestManager.deployApplication(AbstractTestManager.java:159)
11-Nov-2018 11:36:10         at co.cask.cdap.test.IntegrationTestBase.deployApplication(IntegrationTestBase.java:391)
11-Nov-2018 11:36:10         at co.cask.cdap.test.IntegrationTestBase.deployApplication(IntegrationTestBase.java:395)
11-Nov-2018 11:36:10         at co.cask.cdap.apps.spark.sparkpagerank.SparkPageRankAppTest.test(SparkPageRankAppTest.java:109)
11-Nov-2018 11:36:10
11-Nov-2018 11:36:10 testSpark(co.cask.cdap.app.etl.batch.TPFSSinkSourceTest)  Time elapsed: 65.796 sec  <<< ERROR!
11-Nov-2018 11:36:10 java.lang.RuntimeException: java.io.IOException: 500: Spark not found. Please set environment variable SPARK_HOME
11-Nov-2018 11:36:10         at co.cask.cdap.client.util.RESTClient.execute(RESTClient.java:132)
11-Nov-2018 11:36:10         at co.cask.cdap.client.util.RESTClient.execute(RESTClient.java:69)
11-Nov-2018 11:36:10         at co.cask.cdap.client.ProgramClient.start(ProgramClient.java:155)
11-Nov-2018 11:36:10         at co.cask.cdap.test.remote.RemoteApplicationManager.startProgram(RemoteApplicationManager.java:151)
11-Nov-2018 11:36:10         at co.cask.cdap.test.AbstractProgramManager.start(AbstractProgramManager.java:57)
11-Nov-2018 11:36:10         at co.cask.cdap.app.etl.batch.TPFSSinkSourceTest.testStreamTPFSWithProjection(TPFSSinkSourceTest.java:107)
11-Nov-2018 11:36:10         at co.cask.cdap.app.etl.batch.TPFSSinkSourceTest.testSpark(TPFSSinkSourceTest.java:85)
11-Nov-2018 11:36:10
11-Nov-2018 11:36:10 testLDA(co.cask.cdap.apps.workflow.WorkflowTest)  Time elapsed: 8.384 sec  <<< ERROR!
11-Nov-2018 11:36:10 java.io.IOException: java.lang.IllegalStateException: Missing Spark related class co.cask.cdap.api.spark.SparkMain. It may be caused by unavailability of Spark. Please verify environment variable SPARK_HOME is set correctly
11-Nov-2018 11:36:10         at co.cask.cdap.client.util.RESTClient.upload(RESTClient.java:160)
11-Nov-2018 11:36:10         at co.cask.cdap.client.ApplicationClient.deploy(ApplicationClient.java:614)
11-Nov-2018 11:36:10         at co.cask.cdap.test.IntegrationTestManager.deployApplication(IntegrationTestManager.java:203)
11-Nov-2018 11:36:10         at co.cask.cdap.test.IntegrationTestBase.deployApplication(IntegrationTestBase.java:400)
11-Nov-2018 11:36:10         at co.cask.cdap.apps.workflow.WorkflowTest.testLDA(WorkflowTest.java:86)
11-Nov-2018 11:36:10
11-Nov-2018 11:36:10 testKMeans(co.cask.cdap.apps.workflow.WorkflowTest)  Time elapsed: 8.297 sec  <<< ERROR!
11-Nov-2018 11:36:10 java.io.IOException: java.lang.IllegalStateException: Missing Spark related class co.cask.cdap.api.spark.SparkMain. It may be caused by unavailability of Spark. Please verify environment variable SPARK_HOME is set correctly
11-Nov-2018 11:36:10         at co.cask.cdap.client.util.RESTClient.upload(RESTClient.java:160)
11-Nov-2018 11:36:10         at co.cask.cdap.client.ApplicationClient.deploy(ApplicationClient.java:614)
11-Nov-2018 11:36:10         at co.cask.cdap.test.IntegrationTestManager.deployApplication(IntegrationTestManager.java:203)
11-Nov-2018 11:36:10         at co.cask.cdap.test.IntegrationTestBase.deployApplication(IntegrationTestBase.java:400)
11-Nov-2018 11:36:10         at co.cask.cdap.apps.workflow.WorkflowTest.testKMeans(WorkflowTest.java:103)
11-Nov-2018 11:36:10
11-Nov-2018 11:36:10 testWranglerSpark(co.cask.cdap.app.etl.wrangler.WranglerTest)  Time elapsed: 86.105 sec  <<< ERROR!
11-Nov-2018 11:36:10 java.lang.RuntimeException: java.io.IOException: 500: Spark not found. Please set environment variable SPARK_HOME
11-Nov-2018 11:36:10         at co.cask.cdap.client.util.RESTClient.execute(RESTClient.java:132)
11-Nov-2018 11:36:10         at co.cask.cdap.client.util.RESTClient.execute(RESTClient.java:69)
11-Nov-2018 11:36:10         at co.cask.cdap.client.ProgramClient.start(ProgramClient.java:155)
11-Nov-2018 11:36:10         at co.cask.cdap.test.remote.RemoteApplicationManager.startProgram(RemoteApplicationManager.java:151)
11-Nov-2018 11:36:10         at co.cask.cdap.test.AbstractProgramManager.start(AbstractProgramManager.java:57)
11-Nov-2018 11:36:10         at co.cask.cdap.test.AbstractProgramManager.start(AbstractProgramManager.java:52)
11-Nov-2018 11:36:10         at co.cask.cdap.app.etl.wrangler.WranglerTest.testWrangler(WranglerTest.java:190)
11-Nov-2018 11:36:10         at co.cask.cdap.app.etl.wrangler.WranglerTest.testWranglerSpark(WranglerTest.java:99)
11-Nov-2018 11:36:10
11-Nov-2018 11:36:10
11-Nov-2018 11:36:10 Results :
11-Nov-2018 11:36:10
11-Nov-2018 11:36:10 Tests in error:
11-Nov-2018 11:36:10   BatchJoinerTest.testJoinerSpark:102->testJoiner:224 » Runtime java.io.IOExcept...
11-Nov-2018 11:36:10 co.cask.cdap.app.etl.batch.RowDenormalizerTest.test(co.cask.cdap.app.etl.batch.RowDenormalizerTest)
11-Nov-2018 11:36:10   Run 1: RowDenormalizerTest.test:102 » Timeout Timeout occurred. Expected true but fou...
11-Nov-2018 11:36:10   Run 2: RowDenormalizerTest>IntegrationTestBase.tearDown:128->IntegrationTestBase.doClear:413 » Timeout
11-Nov-2018 11:36:10
11-Nov-2018 11:36:10   TPFSSinkSourceTest.testSpark:85->testStreamTPFSWithProjection:107 » Runtime ja...
11-Nov-2018 11:36:10   DataStreamsTest.testDataStreams:145->IntegrationTestBase.deployApplication:400 » IO
11-Nov-2018 11:36:10   WranglerTest.testWranglerSpark:99->testWrangler:190 » Runtime java.io.IOExcept...
11-Nov-2018 11:36:10   ServiceWorkerTest>IntegrationTestBase.setUp:111->IntegrationTestBase.doClear:413 » Timeout
11-Nov-2018 11:36:10   SparkPageRankAppTest.test:109->IntegrationTestBase.deployApplication:395->IntegrationTestBase.deployApplication:391 » Runtime
11-Nov-2018 11:36:10   WorkflowTest.testKMeans:103->IntegrationTestBase.deployApplication:400 » IO ja...
11-Nov-2018 11:36:10   WorkflowTest.testLDA:86->IntegrationTestBase.deployApplication:400 » IO java.l...
11-Nov-2018 11:36:10
11-Nov-2018 11:36:10 Tests run: 64, Failures: 0, Errors: 9, Skipped: 0
11-Nov-2018 11:36:10
11-Nov-2018 11:36:10 [INFO] ------------------------------------------------------------------------
11-Nov-2018 11:36:10 [INFO] Reactor Summary:
11-Nov-2018 11:36:10 [INFO]
11-Nov-2018 11:36:10 [INFO] integration-test .................................. SUCCESS [14.990s]
11-Nov-2018 11:36:10 [INFO] integration-test-core ............................. SUCCESS [4.294s]
11-Nov-2018 11:36:10 [INFO] integration-test-remote ........................... FAILURE [3:30:59.926s]
11-Nov-2018 11:36:10 [INFO] integration-test-standalone ....................... SKIPPED
11-Nov-2018 11:36:10 [INFO] upgrade-test ...................................... SKIPPED
11-Nov-2018 11:36:10 [INFO] long-running-test ................................. SKIPPED
11-Nov-2018 11:36:10 [INFO] ------------------------------------------------------------------------
11-Nov-2018 11:36:10 [INFO] BUILD FAILURE
11-Nov-2018 11:36:10 [INFO] ------------------------------------------------------------------------
11-Nov-2018 11:36:10 [INFO] Total time: 3:31:19.714s
11-Nov-2018 11:36:10 [INFO] Finished at: Sun Nov 11 11:36:10 UTC 2018
11-Nov-2018 11:36:11 [INFO] Final Memory: 88M/997M
11-Nov-2018 11:36:11 [INFO] ------------------------------------------------------------------------
11-Nov-2018 11:36:11 [ERROR] Failed to execute goal org.apache.maven.plugins:maven-surefire-plugin:2.18.1:test (default-test) on project integration-test-remote: There are test failures.
11-Nov-2018 11:36:11 [ERROR]
11-Nov-2018 11:36:11 [ERROR] Please refer to /var/bamboo/xml-data/build-dir/IT-ITN5-DSTC514/cdap-integration-tests/integration-test-remote/target/surefire-reports for the individual test results.
11-Nov-2018 11:36:11 [ERROR] -> [Help 1]
11-Nov-2018 11:36:11 [ERROR]
11-Nov-2018 11:36:11 [ERROR] To see the full stack trace of the errors, re-run Maven with the -e switch.
11-Nov-2018 11:36:11 [ERROR] Re-run Maven using the -X switch to enable full debug logging.
11-Nov-2018 11:36:11 [ERROR]
11-Nov-2018 11:36:11 [ERROR] For more information about the errors and possible solutions, please read the following articles:
11-Nov-2018 11:36:11 [ERROR] [Help 1] http://cwiki.apache.org/confluence/display/MAVEN/MojoFailureException
11-Nov-2018 11:36:11 [ERROR]
11-Nov-2018 11:36:11 [ERROR] After correcting the problems, you can resume the build with the command
11-Nov-2018 11:36:11 [ERROR]   mvn <goals> -rf :integration-test-remote
11-Nov-2018 11:36:11 Failing task since return code of [/opt/maven/bin/mvn --batch-mode -Djava.io.tmpdir=/tmp/IT-ITN5-DSTC514 clean test -U -Dtest=AllTests -Dcdap.username=******** -Dcdap.password=******** -DinstanceUri=http://10.210.0.45] was 1 while expected 0
11-Nov-2018 11:36:11 Parsing test results under /var/bamboo/xml-data/build-dir/IT-ITN5-DSTC514...
11-Nov-2018 11:36:11 Finished task 'Integration test - cluster' with result: Failed
11-Nov-2018 11:36:11 Running post build plugin 'Docker Container Cleanup'
11-Nov-2018 11:36:11 Running post build plugin 'NCover Results Collector'
11-Nov-2018 11:36:11 Running post build plugin 'Clover Results Collector'
11-Nov-2018 11:36:11 Running post build plugin 'npm Cache Cleanup'
11-Nov-2018 11:36:11 Running post build plugin 'Artifact Copier'
11-Nov-2018 11:36:11 Finalising the build...
11-Nov-2018 11:36:11 Stopping timer.
11-Nov-2018 11:36:11 Build IT-ITN5-DSTC514-29 completed.
11-Nov-2018 11:36:12 Running on server: post build plugin 'NCover Results Collector'
11-Nov-2018 11:36:13 Running on server: post build plugin 'Build Hanging Detection Configuration'
11-Nov-2018 11:36:13 Running on server: post build plugin 'Clover Delta Calculator'
11-Nov-2018 11:36:13 Running on server: post build plugin 'Maven Dependencies Postprocessor'
11-Nov-2018 11:36:13 All post build plugins have finished
11-Nov-2018 11:36:13 Generating build results summary...
11-Nov-2018 11:36:14 Saving build results to disk...
11-Nov-2018 11:36:14 Logging substituted variables...
11-Nov-2018 11:36:14 Indexing build results...
11-Nov-2018 11:36:14 Finished building IT-ITN5-DSTC514-29.