Build #27

Build: #27 failed

Job: Distro Tests - CDH 5.14 failed

Build log

The build generated 94,626 lines of output.The output is too long and has been truncated to the last 1,000 lines. Download or view full build log

10-Nov-2018 02:54:40 2018-11-10 02:54:40,153 - INFO  [main:c.c.c.t.AudiTestBase$1@125] - Making request: GET http://10.210.0.16:11015/v3/namespaces/default/apps/XMLInvalidNodePathTest/versions/-SNAPSHOT/workflows/DataPipelineWorkflow/runs?status=COMPLETED&start=0&end=9223372036854775807&limit=2147483647
10-Nov-2018 02:54:40 2018-11-10 02:54:40,240 - INFO  [main:c.c.c.t.AudiTestBase$1@134] - Received response: [200] Response Body: []
10-Nov-2018 02:54:40 2018-11-10 02:54:40,291 - INFO  [main:c.c.c.t.AudiTestBase$1@125] - Making request: GET http://10.210.0.16:11015/v3/namespaces/default/apps/XMLInvalidNodePathTest/versions/-SNAPSHOT/workflows/DataPipelineWorkflow/runs?status=COMPLETED&start=0&end=9223372036854775807&limit=2147483647
10-Nov-2018 02:54:40 2018-11-10 02:54:40,379 - INFO  [main:c.c.c.t.AudiTestBase$1@134] - Received response: [200] Response Body: []
10-Nov-2018 02:54:40 2018-11-10 02:54:40,430 - INFO  [main:c.c.c.t.AudiTestBase$1@125] - Making request: GET http://10.210.0.16:11015/v3/namespaces/default/apps/XMLInvalidNodePathTest/versions/-SNAPSHOT/workflows/DataPipelineWorkflow/runs?status=COMPLETED&start=0&end=9223372036854775807&limit=2147483647
10-Nov-2018 02:54:40 2018-11-10 02:54:40,518 - INFO  [main:c.c.c.t.AudiTestBase$1@134] - Received response: [200] Response Body: []
10-Nov-2018 02:54:40 2018-11-10 02:54:40,568 - INFO  [main:c.c.c.t.AudiTestBase$1@125] - Making request: GET http://10.210.0.16:11015/v3/namespaces/default/apps/XMLInvalidNodePathTest/versions/-SNAPSHOT/workflows/DataPipelineWorkflow/runs?status=COMPLETED&start=0&end=9223372036854775807&limit=2147483647
10-Nov-2018 02:54:40 2018-11-10 02:54:40,656 - INFO  [main:c.c.c.t.AudiTestBase$1@134] - Received response: [200] Response Body: []
10-Nov-2018 02:54:40 2018-11-10 02:54:40,707 - INFO  [main:c.c.c.t.AudiTestBase$1@125] - Making request: GET http://10.210.0.16:11015/v3/namespaces/default/apps/XMLInvalidNodePathTest/versions/-SNAPSHOT/workflows/DataPipelineWorkflow/runs?status=COMPLETED&start=0&end=9223372036854775807&limit=2147483647
10-Nov-2018 02:54:40 2018-11-10 02:54:40,795 - INFO  [main:c.c.c.t.AudiTestBase$1@134] - Received response: [200] Response Body: []
10-Nov-2018 02:54:40 2018-11-10 02:54:40,846 - INFO  [main:c.c.c.t.AudiTestBase$1@125] - Making request: GET http://10.210.0.16:11015/v3/namespaces/default/apps/XMLInvalidNodePathTest/versions/-SNAPSHOT/workflows/DataPipelineWorkflow/runs?status=COMPLETED&start=0&end=9223372036854775807&limit=2147483647
10-Nov-2018 02:54:40 2018-11-10 02:54:40,944 - INFO  [main:c.c.c.t.AudiTestBase$1@134] - Received response: [200] Response Body: []
10-Nov-2018 02:54:40 2018-11-10 02:54:40,995 - INFO  [main:c.c.c.t.AudiTestBase$1@125] - Making request: GET http://10.210.0.16:11015/v3/namespaces/default/apps/XMLInvalidNodePathTest/versions/-SNAPSHOT/workflows/DataPipelineWorkflow/runs?status=COMPLETED&start=0&end=9223372036854775807&limit=2147483647
10-Nov-2018 02:54:41 2018-11-10 02:54:41,082 - INFO  [main:c.c.c.t.AudiTestBase$1@134] - Received response: [200] Response Body: []
10-Nov-2018 02:54:41 2018-11-10 02:54:41,133 - INFO  [main:c.c.c.t.AudiTestBase$1@125] - Making request: GET http://10.210.0.16:11015/v3/namespaces/default/apps/XMLInvalidNodePathTest/versions/-SNAPSHOT/workflows/DataPipelineWorkflow/runs?status=COMPLETED&start=0&end=9223372036854775807&limit=2147483647
10-Nov-2018 02:54:41 2018-11-10 02:54:41,220 - INFO  [main:c.c.c.t.AudiTestBase$1@134] - Received response: [200] Response Body: []
10-Nov-2018 02:54:41 2018-11-10 02:54:41,271 - INFO  [main:c.c.c.t.AudiTestBase$1@125] - Making request: GET http://10.210.0.16:11015/v3/namespaces/default/apps/XMLInvalidNodePathTest/versions/-SNAPSHOT/workflows/DataPipelineWorkflow/runs?status=COMPLETED&start=0&end=9223372036854775807&limit=2147483647
10-Nov-2018 02:54:41 2018-11-10 02:54:41,358 - INFO  [main:c.c.c.t.AudiTestBase$1@134] - Received response: [200] Response Body: []
10-Nov-2018 02:54:41 2018-11-10 02:54:41,409 - INFO  [main:c.c.c.t.AudiTestBase$1@125] - Making request: GET http://10.210.0.16:11015/v3/namespaces/default/apps/XMLInvalidNodePathTest/versions/-SNAPSHOT/workflows/DataPipelineWorkflow/runs?status=COMPLETED&start=0&end=9223372036854775807&limit=2147483647
10-Nov-2018 02:54:41 2018-11-10 02:54:41,496 - INFO  [main:c.c.c.t.AudiTestBase$1@134] - Received response: [200] Response Body: []
10-Nov-2018 02:54:41 2018-11-10 02:54:41,547 - INFO  [main:c.c.c.t.AudiTestBase$1@125] - Making request: GET http://10.210.0.16:11015/v3/namespaces/default/apps/XMLInvalidNodePathTest/versions/-SNAPSHOT/workflows/DataPipelineWorkflow/runs?status=COMPLETED&start=0&end=9223372036854775807&limit=2147483647
10-Nov-2018 02:54:41 2018-11-10 02:54:41,635 - INFO  [main:c.c.c.t.AudiTestBase$1@134] - Received response: [200] Response Body: []
10-Nov-2018 02:54:41 2018-11-10 02:54:41,685 - INFO  [main:c.c.c.t.AudiTestBase$1@125] - Making request: GET http://10.210.0.16:11015/v3/namespaces/default/apps/XMLInvalidNodePathTest/versions/-SNAPSHOT/workflows/DataPipelineWorkflow/runs?status=COMPLETED&start=0&end=9223372036854775807&limit=2147483647
10-Nov-2018 02:54:41 2018-11-10 02:54:41,772 - INFO  [main:c.c.c.t.AudiTestBase$1@134] - Received response: [200] Response Body: []
10-Nov-2018 02:54:41 2018-11-10 02:54:41,823 - INFO  [main:c.c.c.t.AudiTestBase$1@125] - Making request: GET http://10.210.0.16:11015/v3/namespaces/default/apps/XMLInvalidNodePathTest/versions/-SNAPSHOT/workflows/DataPipelineWorkflow/runs?status=COMPLETED&start=0&end=9223372036854775807&limit=2147483647
10-Nov-2018 02:54:41 2018-11-10 02:54:41,911 - INFO  [main:c.c.c.t.AudiTestBase$1@134] - Received response: [200] Response Body: []
10-Nov-2018 02:54:41 2018-11-10 02:54:41,962 - INFO  [main:c.c.c.t.AudiTestBase$1@125] - Making request: GET http://10.210.0.16:11015/v3/namespaces/default/apps/XMLInvalidNodePathTest/versions/-SNAPSHOT/workflows/DataPipelineWorkflow/runs?status=COMPLETED&start=0&end=9223372036854775807&limit=2147483647
10-Nov-2018 02:54:42 2018-11-10 02:54:42,050 - INFO  [main:c.c.c.t.AudiTestBase$1@134] - Received response: [200] Response Body: []
10-Nov-2018 02:54:42 2018-11-10 02:54:42,101 - INFO  [main:c.c.c.t.AudiTestBase$1@125] - Making request: GET http://10.210.0.16:11015/v3/namespaces/default/apps/XMLInvalidNodePathTest/versions/-SNAPSHOT/workflows/DataPipelineWorkflow/runs?status=COMPLETED&start=0&end=9223372036854775807&limit=2147483647
10-Nov-2018 02:54:42 2018-11-10 02:54:42,188 - INFO  [main:c.c.c.t.AudiTestBase$1@134] - Received response: [200] Response Body: []
10-Nov-2018 02:54:42 2018-11-10 02:54:42,239 - INFO  [main:c.c.c.t.AudiTestBase$1@125] - Making request: GET http://10.210.0.16:11015/v3/namespaces/default/apps/XMLInvalidNodePathTest/versions/-SNAPSHOT/workflows/DataPipelineWorkflow/runs?status=COMPLETED&start=0&end=9223372036854775807&limit=2147483647
10-Nov-2018 02:54:42 2018-11-10 02:54:42,326 - INFO  [main:c.c.c.t.AudiTestBase$1@134] - Received response: [200] Response Body: []
10-Nov-2018 02:54:42 2018-11-10 02:54:42,377 - INFO  [main:c.c.c.t.AudiTestBase$1@125] - Making request: GET http://10.210.0.16:11015/v3/namespaces/default/apps/XMLInvalidNodePathTest/versions/-SNAPSHOT/workflows/DataPipelineWorkflow/runs?status=COMPLETED&start=0&end=9223372036854775807&limit=2147483647
10-Nov-2018 02:54:42 2018-11-10 02:54:42,463 - INFO  [main:c.c.c.t.AudiTestBase$1@134] - Received response: [200] Response Body: []
10-Nov-2018 02:54:42 2018-11-10 02:54:42,514 - INFO  [main:c.c.c.t.AudiTestBase$1@125] - Making request: GET http://10.210.0.16:11015/v3/namespaces/default/apps/XMLInvalidNodePathTest/versions/-SNAPSHOT/workflows/DataPipelineWorkflow/runs?status=COMPLETED&start=0&end=9223372036854775807&limit=2147483647
10-Nov-2018 02:54:42 2018-11-10 02:54:42,602 - INFO  [main:c.c.c.t.AudiTestBase$1@134] - Received response: [200] Response Body: []
10-Nov-2018 02:54:42 2018-11-10 02:54:42,652 - INFO  [main:c.c.c.t.AudiTestBase$1@125] - Making request: GET http://10.210.0.16:11015/v3/namespaces/default/apps/XMLInvalidNodePathTest/versions/-SNAPSHOT/workflows/DataPipelineWorkflow/runs?status=COMPLETED&start=0&end=9223372036854775807&limit=2147483647
10-Nov-2018 02:54:42 2018-11-10 02:54:42,739 - INFO  [main:c.c.c.t.AudiTestBase$1@134] - Received response: [200] Response Body: []
10-Nov-2018 02:54:42 2018-11-10 02:54:42,790 - INFO  [main:c.c.c.t.AudiTestBase$1@125] - Making request: GET http://10.210.0.16:11015/v3/namespaces/default/apps/XMLInvalidNodePathTest/versions/-SNAPSHOT/workflows/DataPipelineWorkflow/runs?status=COMPLETED&start=0&end=9223372036854775807&limit=2147483647
10-Nov-2018 02:54:42 2018-11-10 02:54:42,879 - INFO  [main:c.c.c.t.AudiTestBase$1@134] - Received response: [200] Response Body: []
10-Nov-2018 02:54:42 2018-11-10 02:54:42,930 - INFO  [main:c.c.c.t.AudiTestBase$1@125] - Making request: GET http://10.210.0.16:11015/v3/namespaces/default/apps/XMLInvalidNodePathTest/versions/-SNAPSHOT/workflows/DataPipelineWorkflow/runs?status=COMPLETED&start=0&end=9223372036854775807&limit=2147483647
10-Nov-2018 02:54:43 2018-11-10 02:54:43,017 - INFO  [main:c.c.c.t.AudiTestBase$1@134] - Received response: [200] Response Body: []
10-Nov-2018 02:54:43 2018-11-10 02:54:43,067 - INFO  [main:c.c.c.t.AudiTestBase$1@125] - Making request: GET http://10.210.0.16:11015/v3/namespaces/default/apps/XMLInvalidNodePathTest/versions/-SNAPSHOT/workflows/DataPipelineWorkflow/runs?status=COMPLETED&start=0&end=9223372036854775807&limit=2147483647
10-Nov-2018 02:54:43 2018-11-10 02:54:43,155 - INFO  [main:c.c.c.t.AudiTestBase$1@134] - Received response: [200] Response Body: []
10-Nov-2018 02:54:43 2018-11-10 02:54:43,206 - INFO  [main:c.c.c.t.AudiTestBase$1@125] - Making request: GET http://10.210.0.16:11015/v3/namespaces/default/apps/XMLInvalidNodePathTest/versions/-SNAPSHOT/workflows/DataPipelineWorkflow/runs?status=COMPLETED&start=0&end=9223372036854775807&limit=2147483647
10-Nov-2018 02:54:43 2018-11-10 02:54:43,294 - INFO  [main:c.c.c.t.AudiTestBase$1@134] - Received response: [200] Response Body: []
10-Nov-2018 02:54:43 2018-11-10 02:54:43,345 - INFO  [main:c.c.c.t.AudiTestBase$1@125] - Making request: GET http://10.210.0.16:11015/v3/namespaces/default/apps/XMLInvalidNodePathTest/versions/-SNAPSHOT/workflows/DataPipelineWorkflow/runs?status=COMPLETED&start=0&end=9223372036854775807&limit=2147483647
10-Nov-2018 02:54:43 2018-11-10 02:54:43,437 - INFO  [main:c.c.c.t.AudiTestBase$1@134] - Received response: [200] Response Body: []
10-Nov-2018 02:54:43 2018-11-10 02:54:43,488 - INFO  [main:c.c.c.t.AudiTestBase$1@125] - Making request: GET http://10.210.0.16:11015/v3/namespaces/default/apps/XMLInvalidNodePathTest/versions/-SNAPSHOT/workflows/DataPipelineWorkflow/runs?status=COMPLETED&start=0&end=9223372036854775807&limit=2147483647
10-Nov-2018 02:54:43 2018-11-10 02:54:43,575 - INFO  [main:c.c.c.t.AudiTestBase$1@134] - Received response: [200] Response Body: []
10-Nov-2018 02:54:43 2018-11-10 02:54:43,625 - INFO  [main:c.c.c.t.AudiTestBase$1@125] - Making request: GET http://10.210.0.16:11015/v3/namespaces/default/apps/XMLInvalidNodePathTest/versions/-SNAPSHOT/workflows/DataPipelineWorkflow/runs?status=COMPLETED&start=0&end=9223372036854775807&limit=2147483647
10-Nov-2018 02:54:43 2018-11-10 02:54:43,713 - INFO  [main:c.c.c.t.AudiTestBase$1@134] - Received response: [200] Response Body: []
10-Nov-2018 02:54:43 2018-11-10 02:54:43,764 - INFO  [main:c.c.c.t.AudiTestBase$1@125] - Making request: GET http://10.210.0.16:11015/v3/namespaces/default/apps/XMLInvalidNodePathTest/versions/-SNAPSHOT/workflows/DataPipelineWorkflow/runs?status=COMPLETED&start=0&end=9223372036854775807&limit=2147483647
10-Nov-2018 02:54:43 2018-11-10 02:54:43,851 - INFO  [main:c.c.c.t.AudiTestBase$1@134] - Received response: [200] Response Body: []
10-Nov-2018 02:54:43 2018-11-10 02:54:43,902 - INFO  [main:c.c.c.t.AudiTestBase$1@125] - Making request: GET http://10.210.0.16:11015/v3/namespaces/default/apps/XMLInvalidNodePathTest/versions/-SNAPSHOT/workflows/DataPipelineWorkflow/runs?status=COMPLETED&start=0&end=9223372036854775807&limit=2147483647
10-Nov-2018 02:54:43 2018-11-10 02:54:43,989 - INFO  [main:c.c.c.t.AudiTestBase$1@134] - Received response: [200] Response Body: []
10-Nov-2018 02:54:44 2018-11-10 02:54:44,040 - INFO  [main:c.c.c.t.AudiTestBase$1@125] - Making request: GET http://10.210.0.16:11015/v3/namespaces/default/apps/XMLInvalidNodePathTest/versions/-SNAPSHOT/workflows/DataPipelineWorkflow/runs?status=COMPLETED&start=0&end=9223372036854775807&limit=2147483647
10-Nov-2018 02:54:44 2018-11-10 02:54:44,127 - INFO  [main:c.c.c.t.AudiTestBase$1@134] - Received response: [200] Response Body: []
10-Nov-2018 02:54:44 2018-11-10 02:54:44,178 - INFO  [main:c.c.c.t.AudiTestBase$1@125] - Making request: GET http://10.210.0.16:11015/v3/namespaces/default/apps/XMLInvalidNodePathTest/versions/-SNAPSHOT/workflows/DataPipelineWorkflow/runs?status=COMPLETED&start=0&end=9223372036854775807&limit=2147483647
10-Nov-2018 02:54:44 2018-11-10 02:54:44,265 - INFO  [main:c.c.c.t.AudiTestBase$1@134] - Received response: [200] Response Body: []
10-Nov-2018 02:54:44 2018-11-10 02:54:44,316 - INFO  [main:c.c.c.t.AudiTestBase$1@125] - Making request: GET http://10.210.0.16:11015/v3/namespaces/default/apps/XMLInvalidNodePathTest/versions/-SNAPSHOT/workflows/DataPipelineWorkflow/runs?status=COMPLETED&start=0&end=9223372036854775807&limit=2147483647
10-Nov-2018 02:54:44 2018-11-10 02:54:44,404 - INFO  [main:c.c.c.t.AudiTestBase$1@134] - Received response: [200] Response Body: []
10-Nov-2018 02:54:44 2018-11-10 02:54:44,455 - INFO  [main:c.c.c.t.AudiTestBase$1@125] - Making request: GET http://10.210.0.16:11015/v3/namespaces/default/apps/XMLInvalidNodePathTest/versions/-SNAPSHOT/workflows/DataPipelineWorkflow/runs?status=COMPLETED&start=0&end=9223372036854775807&limit=2147483647
10-Nov-2018 02:54:44 2018-11-10 02:54:44,545 - INFO  [main:c.c.c.t.AudiTestBase$1@134] - Received response: [200] Response Body: []
10-Nov-2018 02:54:44 2018-11-10 02:54:44,596 - INFO  [main:c.c.c.t.AudiTestBase$1@125] - Making request: GET http://10.210.0.16:11015/v3/namespaces/default/apps/XMLInvalidNodePathTest/versions/-SNAPSHOT/workflows/DataPipelineWorkflow/runs?status=COMPLETED&start=0&end=9223372036854775807&limit=2147483647
10-Nov-2018 02:54:44 2018-11-10 02:54:44,689 - INFO  [main:c.c.c.t.AudiTestBase$1@134] - Received response: [200] Response Body: []
10-Nov-2018 02:54:44 2018-11-10 02:54:44,739 - INFO  [main:c.c.c.t.AudiTestBase$1@125] - Making request: GET http://10.210.0.16:11015/v3/namespaces/default/apps/XMLInvalidNodePathTest/versions/-SNAPSHOT/workflows/DataPipelineWorkflow/runs?status=COMPLETED&start=0&end=9223372036854775807&limit=2147483647
10-Nov-2018 02:54:44 2018-11-10 02:54:44,826 - INFO  [main:c.c.c.t.AudiTestBase$1@134] - Received response: [200] Response Body: []
10-Nov-2018 02:54:44 2018-11-10 02:54:44,876 - INFO  [main:c.c.c.t.AudiTestBase$1@125] - Making request: GET http://10.210.0.16:11015/v3/namespaces/default/apps/XMLInvalidNodePathTest/versions/-SNAPSHOT/workflows/DataPipelineWorkflow/runs?status=COMPLETED&start=0&end=9223372036854775807&limit=2147483647
10-Nov-2018 02:54:44 2018-11-10 02:54:44,963 - INFO  [main:c.c.c.t.AudiTestBase$1@134] - Received response: [200] Response Body: []
10-Nov-2018 02:54:45 2018-11-10 02:54:45,014 - INFO  [main:c.c.c.t.AudiTestBase$1@125] - Making request: GET http://10.210.0.16:11015/v3/namespaces/default/apps/XMLInvalidNodePathTest/versions/-SNAPSHOT/workflows/DataPipelineWorkflow/runs?status=COMPLETED&start=0&end=9223372036854775807&limit=2147483647
10-Nov-2018 02:54:45 2018-11-10 02:54:45,099 - INFO  [main:c.c.c.t.AudiTestBase$1@134] - Received response: [200] Response Body: []
10-Nov-2018 02:54:45 2018-11-10 02:54:45,150 - INFO  [main:c.c.c.t.AudiTestBase$1@125] - Making request: GET http://10.210.0.16:11015/v3/namespaces/default/apps/XMLInvalidNodePathTest/versions/-SNAPSHOT/workflows/DataPipelineWorkflow/runs?status=COMPLETED&start=0&end=9223372036854775807&limit=2147483647
10-Nov-2018 02:54:45 2018-11-10 02:54:45,237 - INFO  [main:c.c.c.t.AudiTestBase$1@134] - Received response: [200] Response Body: []
10-Nov-2018 02:54:45 2018-11-10 02:54:45,287 - INFO  [main:c.c.c.t.AudiTestBase$1@125] - Making request: GET http://10.210.0.16:11015/v3/namespaces/default/apps/XMLInvalidNodePathTest/versions/-SNAPSHOT/workflows/DataPipelineWorkflow/runs?status=COMPLETED&start=0&end=9223372036854775807&limit=2147483647
10-Nov-2018 02:54:45 2018-11-10 02:54:45,373 - INFO  [main:c.c.c.t.AudiTestBase$1@134] - Received response: [200] Response Body: []
10-Nov-2018 02:54:45 2018-11-10 02:54:45,424 - INFO  [main:c.c.c.t.AudiTestBase$1@125] - Making request: GET http://10.210.0.16:11015/v3/namespaces/default/apps/XMLInvalidNodePathTest/versions/-SNAPSHOT/workflows/DataPipelineWorkflow/runs?status=COMPLETED&start=0&end=9223372036854775807&limit=2147483647
10-Nov-2018 02:54:45 2018-11-10 02:54:45,511 - INFO  [main:c.c.c.t.AudiTestBase$1@134] - Received response: [200] Response Body: []
10-Nov-2018 02:54:45 2018-11-10 02:54:45,562 - INFO  [main:c.c.c.t.AudiTestBase$1@125] - Making request: GET http://10.210.0.16:11015/v3/namespaces/default/apps/XMLInvalidNodePathTest/versions/-SNAPSHOT/workflows/DataPipelineWorkflow/runs?status=COMPLETED&start=0&end=9223372036854775807&limit=2147483647
10-Nov-2018 02:54:45 2018-11-10 02:54:45,649 - INFO  [main:c.c.c.t.AudiTestBase$1@134] - Received response: [200] Response Body: []
10-Nov-2018 02:54:45 2018-11-10 02:54:45,700 - INFO  [main:c.c.c.t.AudiTestBase$1@125] - Making request: GET http://10.210.0.16:11015/v3/namespaces/default/apps/XMLInvalidNodePathTest/versions/-SNAPSHOT/workflows/DataPipelineWorkflow/runs?status=COMPLETED&start=0&end=9223372036854775807&limit=2147483647
10-Nov-2018 02:54:45 2018-11-10 02:54:45,788 - INFO  [main:c.c.c.t.AudiTestBase$1@134] - Received response: [200] Response Body: []
10-Nov-2018 02:54:45 2018-11-10 02:54:45,838 - INFO  [main:c.c.c.t.AudiTestBase$1@125] - Making request: GET http://10.210.0.16:11015/v3/namespaces/default/apps/XMLInvalidNodePathTest/versions/-SNAPSHOT/workflows/DataPipelineWorkflow/runs?status=COMPLETED&start=0&end=9223372036854775807&limit=2147483647
10-Nov-2018 02:54:45 2018-11-10 02:54:45,926 - INFO  [main:c.c.c.t.AudiTestBase$1@134] - Received response: [200] Response Body: []
10-Nov-2018 02:54:45 2018-11-10 02:54:45,977 - INFO  [main:c.c.c.t.AudiTestBase$1@125] - Making request: GET http://10.210.0.16:11015/v3/namespaces/default/apps/XMLInvalidNodePathTest/versions/-SNAPSHOT/workflows/DataPipelineWorkflow/runs?status=COMPLETED&start=0&end=9223372036854775807&limit=2147483647
10-Nov-2018 02:54:46 2018-11-10 02:54:46,065 - INFO  [main:c.c.c.t.AudiTestBase$1@134] - Received response: [200] Response Body: []
10-Nov-2018 02:54:46 2018-11-10 02:54:46,116 - INFO  [main:c.c.c.t.AudiTestBase$1@125] - Making request: GET http://10.210.0.16:11015/v3/namespaces/default/apps/XMLInvalidNodePathTest/versions/-SNAPSHOT/workflows/DataPipelineWorkflow/runs?status=COMPLETED&start=0&end=9223372036854775807&limit=2147483647
10-Nov-2018 02:54:46 2018-11-10 02:54:46,204 - INFO  [main:c.c.c.t.AudiTestBase$1@134] - Received response: [200] Response Body: []
10-Nov-2018 02:54:46 2018-11-10 02:54:46,254 - INFO  [main:c.c.c.t.AudiTestBase$1@125] - Making request: GET http://10.210.0.16:11015/v3/namespaces/default/apps/XMLInvalidNodePathTest/versions/-SNAPSHOT/workflows/DataPipelineWorkflow/runs?status=COMPLETED&start=0&end=9223372036854775807&limit=2147483647
10-Nov-2018 02:54:46 2018-11-10 02:54:46,342 - INFO  [main:c.c.c.t.AudiTestBase$1@134] - Received response: [200] Response Body: []
10-Nov-2018 02:54:46 2018-11-10 02:54:46,392 - INFO  [main:c.c.c.t.AudiTestBase$1@125] - Making request: GET http://10.210.0.16:11015/v3/namespaces/default/apps/XMLInvalidNodePathTest/versions/-SNAPSHOT/workflows/DataPipelineWorkflow/runs?status=COMPLETED&start=0&end=9223372036854775807&limit=2147483647
10-Nov-2018 02:54:46 2018-11-10 02:54:46,479 - INFO  [main:c.c.c.t.AudiTestBase$1@134] - Received response: [200] Response Body: []
10-Nov-2018 02:54:46 2018-11-10 02:54:46,530 - INFO  [main:c.c.c.t.AudiTestBase$1@125] - Making request: GET http://10.210.0.16:11015/v3/namespaces/default/apps/XMLInvalidNodePathTest/versions/-SNAPSHOT/workflows/DataPipelineWorkflow/runs?status=COMPLETED&start=0&end=9223372036854775807&limit=2147483647
10-Nov-2018 02:54:46 2018-11-10 02:54:46,617 - INFO  [main:c.c.c.t.AudiTestBase$1@134] - Received response: [200] Response Body: []
10-Nov-2018 02:54:46 2018-11-10 02:54:46,668 - INFO  [main:c.c.c.t.AudiTestBase$1@125] - Making request: GET http://10.210.0.16:11015/v3/namespaces/default/apps/XMLInvalidNodePathTest/versions/-SNAPSHOT/workflows/DataPipelineWorkflow/runs?status=COMPLETED&start=0&end=9223372036854775807&limit=2147483647
10-Nov-2018 02:54:46 2018-11-10 02:54:46,756 - INFO  [main:c.c.c.t.AudiTestBase$1@134] - Received response: [200] Response Body: []
10-Nov-2018 02:54:46 2018-11-10 02:54:46,807 - INFO  [main:c.c.c.t.AudiTestBase$1@125] - Making request: GET http://10.210.0.16:11015/v3/namespaces/default/apps/XMLInvalidNodePathTest/versions/-SNAPSHOT/workflows/DataPipelineWorkflow/runs?status=COMPLETED&start=0&end=9223372036854775807&limit=2147483647
10-Nov-2018 02:54:46 2018-11-10 02:54:46,895 - INFO  [main:c.c.c.t.AudiTestBase$1@134] - Received response: [200] Response Body: []
10-Nov-2018 02:54:46 2018-11-10 02:54:46,946 - INFO  [main:c.c.c.t.AudiTestBase$1@125] - Making request: GET http://10.210.0.16:11015/v3/namespaces/default/apps/XMLInvalidNodePathTest/versions/-SNAPSHOT/workflows/DataPipelineWorkflow/runs?status=COMPLETED&start=0&end=9223372036854775807&limit=2147483647
10-Nov-2018 02:54:47 2018-11-10 02:54:47,033 - INFO  [main:c.c.c.t.AudiTestBase$1@134] - Received response: [200] Response Body: []
10-Nov-2018 02:54:47 2018-11-10 02:54:47,084 - INFO  [main:c.c.c.t.AudiTestBase$1@125] - Making request: GET http://10.210.0.16:11015/v3/namespaces/default/apps/XMLInvalidNodePathTest/versions/-SNAPSHOT/workflows/DataPipelineWorkflow/runs?status=COMPLETED&start=0&end=9223372036854775807&limit=2147483647
10-Nov-2018 02:54:47 2018-11-10 02:54:47,173 - INFO  [main:c.c.c.t.AudiTestBase$1@134] - Received response: [200] Response Body: []
10-Nov-2018 02:54:47 2018-11-10 02:54:47,224 - INFO  [main:c.c.c.t.AudiTestBase$1@125] - Making request: GET http://10.210.0.16:11015/v3/namespaces/default/apps/XMLInvalidNodePathTest/versions/-SNAPSHOT/workflows/DataPipelineWorkflow/runs?status=COMPLETED&start=0&end=9223372036854775807&limit=2147483647
10-Nov-2018 02:54:47 2018-11-10 02:54:47,313 - INFO  [main:c.c.c.t.AudiTestBase$1@134] - Received response: [200] Response Body: []
10-Nov-2018 02:54:47 2018-11-10 02:54:47,364 - INFO  [main:c.c.c.t.AudiTestBase$1@125] - Making request: GET http://10.210.0.16:11015/v3/namespaces/default/apps/XMLInvalidNodePathTest/versions/-SNAPSHOT/workflows/DataPipelineWorkflow/runs?status=COMPLETED&start=0&end=9223372036854775807&limit=2147483647
10-Nov-2018 02:54:47 2018-11-10 02:54:47,452 - INFO  [main:c.c.c.t.AudiTestBase$1@134] - Received response: [200] Response Body: []
10-Nov-2018 02:54:47 2018-11-10 02:54:47,502 - INFO  [main:c.c.c.t.AudiTestBase$1@125] - Making request: GET http://10.210.0.16:11015/v3/namespaces/default/apps/XMLInvalidNodePathTest/versions/-SNAPSHOT/workflows/DataPipelineWorkflow/runs?status=COMPLETED&start=0&end=9223372036854775807&limit=2147483647
10-Nov-2018 02:54:47 2018-11-10 02:54:47,590 - INFO  [main:c.c.c.t.AudiTestBase$1@134] - Received response: [200] Response Body: []
10-Nov-2018 02:54:47 2018-11-10 02:54:47,641 - INFO  [main:c.c.c.t.AudiTestBase$1@125] - Making request: GET http://10.210.0.16:11015/v3/namespaces/default/apps/XMLInvalidNodePathTest/versions/-SNAPSHOT/workflows/DataPipelineWorkflow/runs?status=COMPLETED&start=0&end=9223372036854775807&limit=2147483647
10-Nov-2018 02:54:47 2018-11-10 02:54:47,729 - INFO  [main:c.c.c.t.AudiTestBase$1@134] - Received response: [200] Response Body: []
10-Nov-2018 02:54:47 2018-11-10 02:54:47,780 - INFO  [main:c.c.c.t.AudiTestBase$1@125] - Making request: GET http://10.210.0.16:11015/v3/namespaces/default/apps/XMLInvalidNodePathTest/versions/-SNAPSHOT/workflows/DataPipelineWorkflow/runs?status=COMPLETED&start=0&end=9223372036854775807&limit=2147483647
10-Nov-2018 02:54:47 2018-11-10 02:54:47,868 - INFO  [main:c.c.c.t.AudiTestBase$1@134] - Received response: [200] Response Body: []
10-Nov-2018 02:54:47 2018-11-10 02:54:47,919 - INFO  [main:c.c.c.t.AudiTestBase$1@125] - Making request: GET http://10.210.0.16:11015/v3/namespaces/default/apps/XMLInvalidNodePathTest/versions/-SNAPSHOT/workflows/DataPipelineWorkflow/runs?status=COMPLETED&start=0&end=9223372036854775807&limit=2147483647
10-Nov-2018 02:54:48 2018-11-10 02:54:48,008 - INFO  [main:c.c.c.t.AudiTestBase$1@134] - Received response: [200] Response Body: []
10-Nov-2018 02:54:48 2018-11-10 02:54:48,058 - INFO  [main:c.c.c.t.AudiTestBase$1@125] - Making request: GET http://10.210.0.16:11015/v3/namespaces/default/apps/XMLInvalidNodePathTest/versions/-SNAPSHOT/workflows/DataPipelineWorkflow/runs?status=COMPLETED&start=0&end=9223372036854775807&limit=2147483647
10-Nov-2018 02:54:48 2018-11-10 02:54:48,146 - INFO  [main:c.c.c.t.AudiTestBase$1@134] - Received response: [200] Response Body: []
10-Nov-2018 02:54:48 2018-11-10 02:54:48,197 - INFO  [main:c.c.c.t.AudiTestBase$1@125] - Making request: GET http://10.210.0.16:11015/v3/namespaces/default/apps/XMLInvalidNodePathTest/versions/-SNAPSHOT/workflows/DataPipelineWorkflow/runs?status=COMPLETED&start=0&end=9223372036854775807&limit=2147483647
10-Nov-2018 02:54:48 2018-11-10 02:54:48,285 - INFO  [main:c.c.c.t.AudiTestBase$1@134] - Received response: [200] Response Body: []
10-Nov-2018 02:54:48 2018-11-10 02:54:48,336 - INFO  [main:c.c.c.t.AudiTestBase$1@125] - Making request: GET http://10.210.0.16:11015/v3/namespaces/default/apps/XMLInvalidNodePathTest/versions/-SNAPSHOT/workflows/DataPipelineWorkflow/runs?status=COMPLETED&start=0&end=9223372036854775807&limit=2147483647
10-Nov-2018 02:54:48 2018-11-10 02:54:48,424 - INFO  [main:c.c.c.t.AudiTestBase$1@134] - Received response: [200] Response Body: []
10-Nov-2018 02:54:48 2018-11-10 02:54:48,475 - INFO  [main:c.c.c.t.AudiTestBase$1@125] - Making request: GET http://10.210.0.16:11015/v3/namespaces/default/apps/XMLInvalidNodePathTest/versions/-SNAPSHOT/workflows/DataPipelineWorkflow/runs?status=COMPLETED&start=0&end=9223372036854775807&limit=2147483647
10-Nov-2018 02:54:48 2018-11-10 02:54:48,563 - INFO  [main:c.c.c.t.AudiTestBase$1@134] - Received response: [200] Response Body: []
10-Nov-2018 02:54:48 2018-11-10 02:54:48,614 - INFO  [main:c.c.c.t.AudiTestBase$1@125] - Making request: GET http://10.210.0.16:11015/v3/namespaces/default/apps/XMLInvalidNodePathTest/versions/-SNAPSHOT/workflows/DataPipelineWorkflow/runs?status=COMPLETED&start=0&end=9223372036854775807&limit=2147483647
10-Nov-2018 02:54:48 2018-11-10 02:54:48,700 - INFO  [main:c.c.c.t.AudiTestBase$1@134] - Received response: [200] Response Body: []
10-Nov-2018 02:54:48 2018-11-10 02:54:48,751 - INFO  [main:c.c.c.t.AudiTestBase$1@125] - Making request: GET http://10.210.0.16:11015/v3/namespaces/default/apps/XMLInvalidNodePathTest/versions/-SNAPSHOT/workflows/DataPipelineWorkflow/runs?status=COMPLETED&start=0&end=9223372036854775807&limit=2147483647
10-Nov-2018 02:54:48 2018-11-10 02:54:48,840 - INFO  [main:c.c.c.t.AudiTestBase$1@134] - Received response: [200] Response Body: []
10-Nov-2018 02:54:48 2018-11-10 02:54:48,891 - INFO  [main:c.c.c.t.AudiTestBase$1@125] - Making request: GET http://10.210.0.16:11015/v3/namespaces/default/apps/XMLInvalidNodePathTest/versions/-SNAPSHOT/workflows/DataPipelineWorkflow/runs?status=COMPLETED&start=0&end=9223372036854775807&limit=2147483647
10-Nov-2018 02:54:48 2018-11-10 02:54:48,981 - INFO  [main:c.c.c.t.AudiTestBase$1@134] - Received response: [200] Response Body: []
10-Nov-2018 02:54:49 2018-11-10 02:54:49,031 - INFO  [main:c.c.c.t.AudiTestBase$1@125] - Making request: GET http://10.210.0.16:11015/v3/namespaces/default/apps/XMLInvalidNodePathTest/versions/-SNAPSHOT/workflows/DataPipelineWorkflow/runs?status=COMPLETED&start=0&end=9223372036854775807&limit=2147483647
10-Nov-2018 02:54:49 2018-11-10 02:54:49,119 - INFO  [main:c.c.c.t.AudiTestBase$1@134] - Received response: [200] Response Body: []
10-Nov-2018 02:54:49 2018-11-10 02:54:49,170 - INFO  [main:c.c.c.t.AudiTestBase$1@125] - Making request: GET http://10.210.0.16:11015/v3/namespaces/default/apps/XMLInvalidNodePathTest/versions/-SNAPSHOT/workflows/DataPipelineWorkflow/runs?status=COMPLETED&start=0&end=9223372036854775807&limit=2147483647
10-Nov-2018 02:54:49 2018-11-10 02:54:49,258 - INFO  [main:c.c.c.t.AudiTestBase$1@134] - Received response: [200] Response Body: []
10-Nov-2018 02:54:49 2018-11-10 02:54:49,308 - INFO  [main:c.c.c.t.AudiTestBase$1@125] - Making request: GET http://10.210.0.16:11015/v3/namespaces/default/apps/XMLInvalidNodePathTest/versions/-SNAPSHOT/workflows/DataPipelineWorkflow/runs?status=COMPLETED&start=0&end=9223372036854775807&limit=2147483647
10-Nov-2018 02:54:49 2018-11-10 02:54:49,395 - INFO  [main:c.c.c.t.AudiTestBase$1@134] - Received response: [200] Response Body: []
10-Nov-2018 02:54:49 2018-11-10 02:54:49,446 - INFO  [main:c.c.c.t.AudiTestBase$1@125] - Making request: GET http://10.210.0.16:11015/v3/namespaces/default/apps/XMLInvalidNodePathTest/versions/-SNAPSHOT/workflows/DataPipelineWorkflow/runs?status=COMPLETED&start=0&end=9223372036854775807&limit=2147483647
10-Nov-2018 02:54:49 2018-11-10 02:54:49,533 - INFO  [main:c.c.c.t.AudiTestBase$1@134] - Received response: [200] Response Body: []
10-Nov-2018 02:54:49 2018-11-10 02:54:49,584 - INFO  [main:c.c.c.t.AudiTestBase$1@125] - Making request: GET http://10.210.0.16:11015/v3/namespaces/default/apps/XMLInvalidNodePathTest/versions/-SNAPSHOT/workflows/DataPipelineWorkflow/runs?status=COMPLETED&start=0&end=9223372036854775807&limit=2147483647
10-Nov-2018 02:54:49 2018-11-10 02:54:49,675 - INFO  [main:c.c.c.t.AudiTestBase$1@134] - Received response: [200] Response Body: []
10-Nov-2018 02:54:49 2018-11-10 02:54:49,725 - INFO  [main:c.c.c.t.AudiTestBase$1@125] - Making request: GET http://10.210.0.16:11015/v3/namespaces/default/apps/XMLInvalidNodePathTest/versions/-SNAPSHOT/workflows/DataPipelineWorkflow/runs?status=COMPLETED&start=0&end=9223372036854775807&limit=2147483647
10-Nov-2018 02:54:49 2018-11-10 02:54:49,815 - INFO  [main:c.c.c.t.AudiTestBase$1@134] - Received response: [200] Response Body: []
10-Nov-2018 02:54:49 2018-11-10 02:54:49,865 - INFO  [main:c.c.c.t.AudiTestBase$1@125] - Making request: GET http://10.210.0.16:11015/v3/namespaces/default/apps/XMLInvalidNodePathTest/versions/-SNAPSHOT/workflows/DataPipelineWorkflow/runs?status=COMPLETED&start=0&end=9223372036854775807&limit=2147483647
10-Nov-2018 02:54:49 2018-11-10 02:54:49,953 - INFO  [main:c.c.c.t.AudiTestBase$1@134] - Received response: [200] Response Body: []
10-Nov-2018 02:54:50 2018-11-10 02:54:50,003 - INFO  [main:c.c.c.t.AudiTestBase$1@125] - Making request: GET http://10.210.0.16:11015/v3/namespaces/default/apps/XMLInvalidNodePathTest/versions/-SNAPSHOT/workflows/DataPipelineWorkflow/runs?status=COMPLETED&start=0&end=9223372036854775807&limit=2147483647
10-Nov-2018 02:54:50 2018-11-10 02:54:50,091 - INFO  [main:c.c.c.t.AudiTestBase$1@134] - Received response: [200] Response Body: []
10-Nov-2018 02:54:50 2018-11-10 02:54:50,142 - INFO  [main:c.c.c.t.AudiTestBase$1@125] - Making request: GET http://10.210.0.16:11015/v3/namespaces/default/apps/XMLInvalidNodePathTest/versions/-SNAPSHOT/workflows/DataPipelineWorkflow/runs?status=COMPLETED&start=0&end=9223372036854775807&limit=2147483647
10-Nov-2018 02:54:50 2018-11-10 02:54:50,230 - INFO  [main:c.c.c.t.AudiTestBase$1@134] - Received response: [200] Response Body: []
10-Nov-2018 02:54:50 2018-11-10 02:54:50,281 - INFO  [main:c.c.c.t.AudiTestBase$1@125] - Making request: GET http://10.210.0.16:11015/v3/namespaces/default/apps/XMLInvalidNodePathTest/versions/-SNAPSHOT/workflows/DataPipelineWorkflow/runs?status=COMPLETED&start=0&end=9223372036854775807&limit=2147483647
10-Nov-2018 02:54:50 2018-11-10 02:54:50,368 - INFO  [main:c.c.c.t.AudiTestBase$1@134] - Received response: [200] Response Body: []
10-Nov-2018 02:54:50 2018-11-10 02:54:50,419 - INFO  [main:c.c.c.t.AudiTestBase$1@125] - Making request: GET http://10.210.0.16:11015/v3/namespaces/default/apps/XMLInvalidNodePathTest/versions/-SNAPSHOT/workflows/DataPipelineWorkflow/runs?status=COMPLETED&start=0&end=9223372036854775807&limit=2147483647
10-Nov-2018 02:54:50 2018-11-10 02:54:50,507 - INFO  [main:c.c.c.t.AudiTestBase$1@134] - Received response: [200] Response Body: []
10-Nov-2018 02:54:50 2018-11-10 02:54:50,558 - INFO  [main:c.c.c.t.AudiTestBase$1@125] - Making request: GET http://10.210.0.16:11015/v3/namespaces/default/apps/XMLInvalidNodePathTest/versions/-SNAPSHOT/workflows/DataPipelineWorkflow/runs?status=COMPLETED&start=0&end=9223372036854775807&limit=2147483647
10-Nov-2018 02:54:50 2018-11-10 02:54:50,647 - INFO  [main:c.c.c.t.AudiTestBase$1@134] - Received response: [200] Response Body: []
10-Nov-2018 02:54:50 2018-11-10 02:54:50,697 - INFO  [main:c.c.c.t.AudiTestBase$1@125] - Making request: GET http://10.210.0.16:11015/v3/namespaces/default/apps/XMLInvalidNodePathTest/versions/-SNAPSHOT/workflows/DataPipelineWorkflow/runs?status=COMPLETED&start=0&end=9223372036854775807&limit=2147483647
10-Nov-2018 02:54:50 2018-11-10 02:54:50,785 - INFO  [main:c.c.c.t.AudiTestBase$1@134] - Received response: [200] Response Body: []
10-Nov-2018 02:54:50 2018-11-10 02:54:50,836 - INFO  [main:c.c.c.t.AudiTestBase$1@125] - Making request: GET http://10.210.0.16:11015/v3/namespaces/default/apps/XMLInvalidNodePathTest/versions/-SNAPSHOT/workflows/DataPipelineWorkflow/runs?status=COMPLETED&start=0&end=9223372036854775807&limit=2147483647
10-Nov-2018 02:54:50 2018-11-10 02:54:50,924 - INFO  [main:c.c.c.t.AudiTestBase$1@134] - Received response: [200] Response Body: []
10-Nov-2018 02:54:50 2018-11-10 02:54:50,974 - INFO  [main:c.c.c.t.AudiTestBase$1@125] - Making request: GET http://10.210.0.16:11015/v3/namespaces/default/apps/XMLInvalidNodePathTest/versions/-SNAPSHOT/workflows/DataPipelineWorkflow/runs?status=COMPLETED&start=0&end=9223372036854775807&limit=2147483647
10-Nov-2018 02:54:51 2018-11-10 02:54:51,062 - INFO  [main:c.c.c.t.AudiTestBase$1@134] - Received response: [200] Response Body: []
10-Nov-2018 02:54:51 2018-11-10 02:54:51,113 - INFO  [main:c.c.c.t.AudiTestBase$1@125] - Making request: GET http://10.210.0.16:11015/v3/namespaces/default/apps/XMLInvalidNodePathTest/versions/-SNAPSHOT/workflows/DataPipelineWorkflow/runs?status=COMPLETED&start=0&end=9223372036854775807&limit=2147483647
10-Nov-2018 02:54:51 2018-11-10 02:54:51,202 - INFO  [main:c.c.c.t.AudiTestBase$1@134] - Received response: [200] Response Body: []
10-Nov-2018 02:54:51 2018-11-10 02:54:51,253 - INFO  [main:c.c.c.t.AudiTestBase$1@125] - Making request: GET http://10.210.0.16:11015/v3/namespaces/default/apps/XMLInvalidNodePathTest/versions/-SNAPSHOT/workflows/DataPipelineWorkflow/runs?status=COMPLETED&start=0&end=9223372036854775807&limit=2147483647
10-Nov-2018 02:54:51 2018-11-10 02:54:51,340 - INFO  [main:c.c.c.t.AudiTestBase$1@134] - Received response: [200] Response Body: []
10-Nov-2018 02:54:51 2018-11-10 02:54:51,391 - INFO  [main:c.c.c.t.AudiTestBase$1@125] - Making request: GET http://10.210.0.16:11015/v3/namespaces/default/apps/XMLInvalidNodePathTest/versions/-SNAPSHOT/workflows/DataPipelineWorkflow/runs?status=COMPLETED&start=0&end=9223372036854775807&limit=2147483647
10-Nov-2018 02:54:51 2018-11-10 02:54:51,480 - INFO  [main:c.c.c.t.AudiTestBase$1@134] - Received response: [200] Response Body: []
10-Nov-2018 02:54:51 2018-11-10 02:54:51,530 - INFO  [main:c.c.c.t.AudiTestBase$1@125] - Making request: GET http://10.210.0.16:11015/v3/namespaces/default/apps/XMLInvalidNodePathTest/versions/-SNAPSHOT/workflows/DataPipelineWorkflow/runs?status=COMPLETED&start=0&end=9223372036854775807&limit=2147483647
10-Nov-2018 02:54:51 2018-11-10 02:54:51,619 - INFO  [main:c.c.c.t.AudiTestBase$1@134] - Received response: [200] Response Body: []
10-Nov-2018 02:54:51 2018-11-10 02:54:51,669 - INFO  [main:c.c.c.t.AudiTestBase$1@125] - Making request: GET http://10.210.0.16:11015/v3/namespaces/default/apps/XMLInvalidNodePathTest/versions/-SNAPSHOT/workflows/DataPipelineWorkflow/runs?status=COMPLETED&start=0&end=9223372036854775807&limit=2147483647
10-Nov-2018 02:54:51 2018-11-10 02:54:51,757 - INFO  [main:c.c.c.t.AudiTestBase$1@134] - Received response: [200] Response Body: []
10-Nov-2018 02:54:51 2018-11-10 02:54:51,808 - INFO  [main:c.c.c.t.AudiTestBase$1@125] - Making request: GET http://10.210.0.16:11015/v3/namespaces/default/apps/XMLInvalidNodePathTest/versions/-SNAPSHOT/workflows/DataPipelineWorkflow/runs?status=COMPLETED&start=0&end=9223372036854775807&limit=2147483647
10-Nov-2018 02:54:51 2018-11-10 02:54:51,895 - INFO  [main:c.c.c.t.AudiTestBase$1@134] - Received response: [200] Response Body: []
10-Nov-2018 02:54:51 2018-11-10 02:54:51,946 - INFO  [main:c.c.c.t.AudiTestBase$1@125] - Making request: GET http://10.210.0.16:11015/v3/namespaces/default/apps/XMLInvalidNodePathTest/versions/-SNAPSHOT/workflows/DataPipelineWorkflow/runs?status=COMPLETED&start=0&end=9223372036854775807&limit=2147483647
10-Nov-2018 02:54:52 2018-11-10 02:54:52,034 - INFO  [main:c.c.c.t.AudiTestBase$1@134] - Received response: [200] Response Body: []
10-Nov-2018 02:54:52 2018-11-10 02:54:52,085 - INFO  [main:c.c.c.t.AudiTestBase$1@125] - Making request: GET http://10.210.0.16:11015/v3/namespaces/default/apps/XMLInvalidNodePathTest/versions/-SNAPSHOT/workflows/DataPipelineWorkflow/runs?status=COMPLETED&start=0&end=9223372036854775807&limit=2147483647
10-Nov-2018 02:54:52 2018-11-10 02:54:52,173 - INFO  [main:c.c.c.t.AudiTestBase$1@134] - Received response: [200] Response Body: []
10-Nov-2018 02:54:52 2018-11-10 02:54:52,224 - INFO  [main:c.c.c.t.AudiTestBase$1@125] - Making request: GET http://10.210.0.16:11015/v3/namespaces/default/apps/XMLInvalidNodePathTest/versions/-SNAPSHOT/workflows/DataPipelineWorkflow/runs?status=COMPLETED&start=0&end=9223372036854775807&limit=2147483647
10-Nov-2018 02:54:52 2018-11-10 02:54:52,310 - INFO  [main:c.c.c.t.AudiTestBase$1@134] - Received response: [200] Response Body: []
10-Nov-2018 02:54:52 2018-11-10 02:54:52,361 - INFO  [main:c.c.c.t.AudiTestBase$1@125] - Making request: GET http://10.210.0.16:11015/v3/namespaces/default/apps/XMLInvalidNodePathTest/versions/-SNAPSHOT/workflows/DataPipelineWorkflow/runs?status=COMPLETED&start=0&end=9223372036854775807&limit=2147483647
10-Nov-2018 02:54:52 2018-11-10 02:54:52,450 - INFO  [main:c.c.c.t.AudiTestBase$1@134] - Received response: [200] Response Body: []
10-Nov-2018 02:54:52 2018-11-10 02:54:52,501 - INFO  [main:c.c.c.t.AudiTestBase$1@125] - Making request: GET http://10.210.0.16:11015/v3/namespaces/default/apps/XMLInvalidNodePathTest/versions/-SNAPSHOT/workflows/DataPipelineWorkflow/runs?status=COMPLETED&start=0&end=9223372036854775807&limit=2147483647
10-Nov-2018 02:54:52 2018-11-10 02:54:52,589 - INFO  [main:c.c.c.t.AudiTestBase$1@134] - Received response: [200] Response Body: []
10-Nov-2018 02:54:52 2018-11-10 02:54:52,640 - INFO  [main:c.c.c.t.AudiTestBase$1@125] - Making request: GET http://10.210.0.16:11015/v3/namespaces/default/apps/XMLInvalidNodePathTest/versions/-SNAPSHOT/workflows/DataPipelineWorkflow/runs?status=COMPLETED&start=0&end=9223372036854775807&limit=2147483647
10-Nov-2018 02:54:52 2018-11-10 02:54:52,728 - INFO  [main:c.c.c.t.AudiTestBase$1@134] - Received response: [200] Response Body: []
10-Nov-2018 02:54:52 2018-11-10 02:54:52,779 - INFO  [main:c.c.c.t.AudiTestBase$1@125] - Making request: GET http://10.210.0.16:11015/v3/namespaces/default/apps/XMLInvalidNodePathTest/versions/-SNAPSHOT/workflows/DataPipelineWorkflow/runs?status=COMPLETED&start=0&end=9223372036854775807&limit=2147483647
10-Nov-2018 02:54:52 2018-11-10 02:54:52,867 - INFO  [main:c.c.c.t.AudiTestBase$1@134] - Received response: [200] Response Body: []
10-Nov-2018 02:54:52 2018-11-10 02:54:52,918 - INFO  [main:c.c.c.t.AudiTestBase$1@125] - Making request: GET http://10.210.0.16:11015/v3/namespaces/default/apps/XMLInvalidNodePathTest/versions/-SNAPSHOT/workflows/DataPipelineWorkflow/runs?status=COMPLETED&start=0&end=9223372036854775807&limit=2147483647
10-Nov-2018 02:54:53 2018-11-10 02:54:53,007 - INFO  [main:c.c.c.t.AudiTestBase$1@134] - Received response: [200] Response Body: []
10-Nov-2018 02:54:53 2018-11-10 02:54:53,058 - INFO  [main:c.c.c.t.AudiTestBase$1@125] - Making request: GET http://10.210.0.16:11015/v3/namespaces/default/apps/XMLInvalidNodePathTest/versions/-SNAPSHOT/workflows/DataPipelineWorkflow/runs?status=COMPLETED&start=0&end=9223372036854775807&limit=2147483647
10-Nov-2018 02:54:53 2018-11-10 02:54:53,146 - INFO  [main:c.c.c.t.AudiTestBase$1@134] - Received response: [200] Response Body: []
10-Nov-2018 02:54:53 2018-11-10 02:54:53,196 - INFO  [main:c.c.c.t.AudiTestBase$1@125] - Making request: GET http://10.210.0.16:11015/v3/namespaces/default/apps/XMLInvalidNodePathTest/versions/-SNAPSHOT/workflows/DataPipelineWorkflow/runs?status=COMPLETED&start=0&end=9223372036854775807&limit=2147483647
10-Nov-2018 02:54:53 2018-11-10 02:54:53,286 - INFO  [main:c.c.c.t.AudiTestBase$1@134] - Received response: [200] Response Body: []
10-Nov-2018 02:54:53 2018-11-10 02:54:53,336 - INFO  [main:c.c.c.t.AudiTestBase$1@125] - Making request: GET http://10.210.0.16:11015/v3/namespaces/default/apps/XMLInvalidNodePathTest/versions/-SNAPSHOT/workflows/DataPipelineWorkflow/runs?status=COMPLETED&start=0&end=9223372036854775807&limit=2147483647
10-Nov-2018 02:54:53 2018-11-10 02:54:53,425 - INFO  [main:c.c.c.t.AudiTestBase$1@134] - Received response: [200] Response Body: []
10-Nov-2018 02:54:53 2018-11-10 02:54:53,476 - INFO  [main:c.c.c.t.AudiTestBase$1@125] - Making request: GET http://10.210.0.16:11015/v3/namespaces/default/apps/XMLInvalidNodePathTest/versions/-SNAPSHOT/workflows/DataPipelineWorkflow/runs?status=COMPLETED&start=0&end=9223372036854775807&limit=2147483647
10-Nov-2018 02:54:53 2018-11-10 02:54:53,564 - INFO  [main:c.c.c.t.AudiTestBase$1@134] - Received response: [200] Response Body: []
10-Nov-2018 02:54:53 2018-11-10 02:54:53,615 - INFO  [main:c.c.c.t.AudiTestBase$1@125] - Making request: GET http://10.210.0.16:11015/v3/namespaces/default/apps/XMLInvalidNodePathTest/versions/-SNAPSHOT/workflows/DataPipelineWorkflow/runs?status=COMPLETED&start=0&end=9223372036854775807&limit=2147483647
10-Nov-2018 02:54:53 2018-11-10 02:54:53,704 - INFO  [main:c.c.c.t.AudiTestBase$1@134] - Received response: [200] Response Body: []
10-Nov-2018 02:54:53 2018-11-10 02:54:53,755 - INFO  [main:c.c.c.t.AudiTestBase$1@125] - Making request: GET http://10.210.0.16:11015/v3/namespaces/default/apps/XMLInvalidNodePathTest/versions/-SNAPSHOT/workflows/DataPipelineWorkflow/runs?status=COMPLETED&start=0&end=9223372036854775807&limit=2147483647
10-Nov-2018 02:54:53 2018-11-10 02:54:53,844 - INFO  [main:c.c.c.t.AudiTestBase$1@134] - Received response: [200] Response Body: []
10-Nov-2018 02:54:53 2018-11-10 02:54:53,894 - INFO  [main:c.c.c.t.AudiTestBase$1@125] - Making request: GET http://10.210.0.16:11015/v3/namespaces/default/apps/XMLInvalidNodePathTest/versions/-SNAPSHOT/workflows/DataPipelineWorkflow/runs?status=COMPLETED&start=0&end=9223372036854775807&limit=2147483647
10-Nov-2018 02:54:53 2018-11-10 02:54:53,983 - INFO  [main:c.c.c.t.AudiTestBase$1@134] - Received response: [200] Response Body: []
10-Nov-2018 02:54:54 2018-11-10 02:54:54,034 - INFO  [main:c.c.c.t.AudiTestBase$1@125] - Making request: GET http://10.210.0.16:11015/v3/namespaces/default/apps/XMLInvalidNodePathTest/versions/-SNAPSHOT/workflows/DataPipelineWorkflow/runs?status=COMPLETED&start=0&end=9223372036854775807&limit=2147483647
10-Nov-2018 02:54:54 2018-11-10 02:54:54,122 - INFO  [main:c.c.c.t.AudiTestBase$1@134] - Received response: [200] Response Body: []
10-Nov-2018 02:54:54 2018-11-10 02:54:54,173 - INFO  [main:c.c.c.t.AudiTestBase$1@125] - Making request: GET http://10.210.0.16:11015/v3/namespaces/default/apps/XMLInvalidNodePathTest/versions/-SNAPSHOT/workflows/DataPipelineWorkflow/runs?status=COMPLETED&start=0&end=9223372036854775807&limit=2147483647
10-Nov-2018 02:54:54 2018-11-10 02:54:54,262 - INFO  [main:c.c.c.t.AudiTestBase$1@134] - Received response: [200] Response Body: []
10-Nov-2018 02:54:54 2018-11-10 02:54:54,313 - INFO  [main:c.c.c.t.AudiTestBase$1@125] - Making request: GET http://10.210.0.16:11015/v3/namespaces/default/apps/XMLInvalidNodePathTest/versions/-SNAPSHOT/workflows/DataPipelineWorkflow/runs?status=COMPLETED&start=0&end=9223372036854775807&limit=2147483647
10-Nov-2018 02:54:54 2018-11-10 02:54:54,401 - INFO  [main:c.c.c.t.AudiTestBase$1@134] - Received response: [200] Response Body: []
10-Nov-2018 02:54:54 2018-11-10 02:54:54,452 - INFO  [main:c.c.c.t.AudiTestBase$1@125] - Making request: GET http://10.210.0.16:11015/v3/namespaces/default/apps/XMLInvalidNodePathTest/versions/-SNAPSHOT/workflows/DataPipelineWorkflow/runs?status=COMPLETED&start=0&end=9223372036854775807&limit=2147483647
10-Nov-2018 02:54:54 2018-11-10 02:54:54,539 - INFO  [main:c.c.c.t.AudiTestBase$1@134] - Received response: [200] Response Body: []
10-Nov-2018 02:54:54 2018-11-10 02:54:54,590 - INFO  [main:c.c.c.t.AudiTestBase$1@125] - Making request: GET http://10.210.0.16:11015/v3/namespaces/default/apps/XMLInvalidNodePathTest/versions/-SNAPSHOT/workflows/DataPipelineWorkflow/runs?status=COMPLETED&start=0&end=9223372036854775807&limit=2147483647
10-Nov-2018 02:54:54 2018-11-10 02:54:54,677 - INFO  [main:c.c.c.t.AudiTestBase$1@134] - Received response: [200] Response Body: []
10-Nov-2018 02:54:54 2018-11-10 02:54:54,728 - INFO  [main:c.c.c.t.AudiTestBase$1@125] - Making request: GET http://10.210.0.16:11015/v3/namespaces/default/apps/XMLInvalidNodePathTest/versions/-SNAPSHOT/workflows/DataPipelineWorkflow/runs?status=COMPLETED&start=0&end=9223372036854775807&limit=2147483647
10-Nov-2018 02:54:54 2018-11-10 02:54:54,821 - INFO  [main:c.c.c.t.AudiTestBase$1@134] - Received response: [200] Response Body: []
10-Nov-2018 02:54:54 2018-11-10 02:54:54,872 - INFO  [main:c.c.c.t.AudiTestBase$1@125] - Making request: GET http://10.210.0.16:11015/v3/namespaces/default/apps/XMLInvalidNodePathTest/versions/-SNAPSHOT/workflows/DataPipelineWorkflow/runs?status=COMPLETED&start=0&end=9223372036854775807&limit=2147483647
10-Nov-2018 02:54:54 2018-11-10 02:54:54,961 - INFO  [main:c.c.c.t.AudiTestBase$1@134] - Received response: [200] Response Body: []
10-Nov-2018 02:54:55 2018-11-10 02:54:55,012 - INFO  [main:c.c.c.t.AudiTestBase$1@125] - Making request: GET http://10.210.0.16:11015/v3/namespaces/default/apps/XMLInvalidNodePathTest/versions/-SNAPSHOT/workflows/DataPipelineWorkflow/runs?status=COMPLETED&start=0&end=9223372036854775807&limit=2147483647
10-Nov-2018 02:54:55 2018-11-10 02:54:55,100 - INFO  [main:c.c.c.t.AudiTestBase$1@134] - Received response: [200] Response Body: []
10-Nov-2018 02:54:55 2018-11-10 02:54:55,151 - INFO  [main:c.c.c.t.AudiTestBase$1@125] - Making request: GET http://10.210.0.16:11015/v3/namespaces/default/apps/XMLInvalidNodePathTest/versions/-SNAPSHOT/workflows/DataPipelineWorkflow/runs?status=COMPLETED&start=0&end=9223372036854775807&limit=2147483647
10-Nov-2018 02:54:55 2018-11-10 02:54:55,240 - INFO  [main:c.c.c.t.AudiTestBase$1@134] - Received response: [200] Response Body: []
10-Nov-2018 02:54:55 2018-11-10 02:54:55,290 - INFO  [main:c.c.c.t.AudiTestBase$1@125] - Making request: GET http://10.210.0.16:11015/v3/namespaces/default/apps/XMLInvalidNodePathTest/versions/-SNAPSHOT/workflows/DataPipelineWorkflow/runs?status=COMPLETED&start=0&end=9223372036854775807&limit=2147483647
10-Nov-2018 02:54:55 2018-11-10 02:54:55,378 - INFO  [main:c.c.c.t.AudiTestBase$1@134] - Received response: [200] Response Body: []
10-Nov-2018 02:54:55 2018-11-10 02:54:55,429 - INFO  [main:c.c.c.t.AudiTestBase$1@125] - Making request: GET http://10.210.0.16:11015/v3/namespaces/default/apps/XMLInvalidNodePathTest/versions/-SNAPSHOT/workflows/DataPipelineWorkflow/runs?status=COMPLETED&start=0&end=9223372036854775807&limit=2147483647
10-Nov-2018 02:54:55 2018-11-10 02:54:55,516 - INFO  [main:c.c.c.t.AudiTestBase$1@134] - Received response: [200] Response Body: []
10-Nov-2018 02:54:55 2018-11-10 02:54:55,567 - INFO  [main:c.c.c.t.AudiTestBase$1@125] - Making request: GET http://10.210.0.16:11015/v3/namespaces/default/apps/XMLInvalidNodePathTest/versions/-SNAPSHOT/workflows/DataPipelineWorkflow/runs?status=COMPLETED&start=0&end=9223372036854775807&limit=2147483647
10-Nov-2018 02:54:55 2018-11-10 02:54:55,657 - INFO  [main:c.c.c.t.AudiTestBase$1@134] - Received response: [200] Response Body: []
10-Nov-2018 02:54:55 2018-11-10 02:54:55,707 - INFO  [main:c.c.c.t.AudiTestBase$1@125] - Making request: GET http://10.210.0.16:11015/v3/namespaces/default/apps/XMLInvalidNodePathTest/versions/-SNAPSHOT/workflows/DataPipelineWorkflow/runs?status=COMPLETED&start=0&end=9223372036854775807&limit=2147483647
10-Nov-2018 02:54:55 2018-11-10 02:54:55,795 - INFO  [main:c.c.c.t.AudiTestBase$1@134] - Received response: [200] Response Body: []
10-Nov-2018 02:54:55 2018-11-10 02:54:55,846 - INFO  [main:c.c.c.t.AudiTestBase$1@125] - Making request: GET http://10.210.0.16:11015/v3/namespaces/default/apps/XMLInvalidNodePathTest/versions/-SNAPSHOT/workflows/DataPipelineWorkflow/runs?status=COMPLETED&start=0&end=9223372036854775807&limit=2147483647
10-Nov-2018 02:54:55 2018-11-10 02:54:55,936 - INFO  [main:c.c.c.t.AudiTestBase$1@134] - Received response: [200] Response Body: []
10-Nov-2018 02:54:55 2018-11-10 02:54:55,987 - INFO  [main:c.c.c.t.AudiTestBase$1@125] - Making request: GET http://10.210.0.16:11015/v3/namespaces/default/apps/XMLInvalidNodePathTest/versions/-SNAPSHOT/workflows/DataPipelineWorkflow/runs?status=COMPLETED&start=0&end=9223372036854775807&limit=2147483647
10-Nov-2018 02:54:56 2018-11-10 02:54:56,074 - INFO  [main:c.c.c.t.AudiTestBase$1@134] - Received response: [200] Response Body: []
10-Nov-2018 02:54:56 2018-11-10 02:54:56,125 - INFO  [main:c.c.c.t.AudiTestBase$1@125] - Making request: GET http://10.210.0.16:11015/v3/namespaces/default/apps/XMLInvalidNodePathTest/versions/-SNAPSHOT/workflows/DataPipelineWorkflow/runs?status=COMPLETED&start=0&end=9223372036854775807&limit=2147483647
10-Nov-2018 02:54:56 2018-11-10 02:54:56,211 - INFO  [main:c.c.c.t.AudiTestBase$1@134] - Received response: [200] Response Body: []
10-Nov-2018 02:54:56 2018-11-10 02:54:56,262 - INFO  [main:c.c.c.t.AudiTestBase$1@125] - Making request: GET http://10.210.0.16:11015/v3/namespaces/default/apps/XMLInvalidNodePathTest/versions/-SNAPSHOT/workflows/DataPipelineWorkflow/runs?status=COMPLETED&start=0&end=9223372036854775807&limit=2147483647
10-Nov-2018 02:54:56 2018-11-10 02:54:56,348 - INFO  [main:c.c.c.t.AudiTestBase$1@134] - Received response: [200] Response Body: []
10-Nov-2018 02:54:56 2018-11-10 02:54:56,399 - INFO  [main:c.c.c.t.AudiTestBase$1@125] - Making request: GET http://10.210.0.16:11015/v3/namespaces/default/apps/XMLInvalidNodePathTest/versions/-SNAPSHOT/workflows/DataPipelineWorkflow/runs?status=COMPLETED&start=0&end=9223372036854775807&limit=2147483647
10-Nov-2018 02:54:56 2018-11-10 02:54:56,486 - INFO  [main:c.c.c.t.AudiTestBase$1@134] - Received response: [200] Response Body: []
10-Nov-2018 02:54:56 2018-11-10 02:54:56,537 - INFO  [main:c.c.c.t.AudiTestBase$1@125] - Making request: GET http://10.210.0.16:11015/v3/namespaces/default/apps/XMLInvalidNodePathTest/versions/-SNAPSHOT/workflows/DataPipelineWorkflow/runs?status=COMPLETED&start=0&end=9223372036854775807&limit=2147483647
10-Nov-2018 02:54:56 2018-11-10 02:54:56,623 - INFO  [main:c.c.c.t.AudiTestBase$1@134] - Received response: [200] Response Body: []
10-Nov-2018 02:54:56 2018-11-10 02:54:56,674 - INFO  [main:c.c.c.t.AudiTestBase$1@125] - Making request: GET http://10.210.0.16:11015/v3/namespaces/default/apps/XMLInvalidNodePathTest/versions/-SNAPSHOT/workflows/DataPipelineWorkflow/runs?status=COMPLETED&start=0&end=9223372036854775807&limit=2147483647
10-Nov-2018 02:54:56 2018-11-10 02:54:56,760 - INFO  [main:c.c.c.t.AudiTestBase$1@134] - Received response: [200] Response Body: []
10-Nov-2018 02:54:56 2018-11-10 02:54:56,811 - INFO  [main:c.c.c.t.AudiTestBase$1@125] - Making request: GET http://10.210.0.16:11015/v3/namespaces/default/apps/XMLInvalidNodePathTest/versions/-SNAPSHOT/workflows/DataPipelineWorkflow/runs?status=COMPLETED&start=0&end=9223372036854775807&limit=2147483647
10-Nov-2018 02:54:56 2018-11-10 02:54:56,896 - INFO  [main:c.c.c.t.AudiTestBase$1@134] - Received response: [200] Response Body: []
10-Nov-2018 02:54:56 2018-11-10 02:54:56,946 - INFO  [main:c.c.c.t.AudiTestBase$1@125] - Making request: GET http://10.210.0.16:11015/v3/namespaces/default/apps/XMLInvalidNodePathTest/versions/-SNAPSHOT/workflows/DataPipelineWorkflow/runs?status=COMPLETED&start=0&end=9223372036854775807&limit=2147483647
10-Nov-2018 02:54:57 2018-11-10 02:54:57,034 - INFO  [main:c.c.c.t.AudiTestBase$1@134] - Received response: [200] Response Body: []
10-Nov-2018 02:54:57 2018-11-10 02:54:57,084 - INFO  [main:c.c.c.t.AudiTestBase$1@125] - Making request: GET http://10.210.0.16:11015/v3/namespaces/default/apps/XMLInvalidNodePathTest/versions/-SNAPSHOT/workflows/DataPipelineWorkflow/runs?status=COMPLETED&start=0&end=9223372036854775807&limit=2147483647
10-Nov-2018 02:54:57 2018-11-10 02:54:57,171 - INFO  [main:c.c.c.t.AudiTestBase$1@134] - Received response: [200] Response Body: []
10-Nov-2018 02:54:57 2018-11-10 02:54:57,222 - INFO  [main:c.c.c.t.AudiTestBase$1@125] - Making request: GET http://10.210.0.16:11015/v3/namespaces/default/apps/XMLInvalidNodePathTest/versions/-SNAPSHOT/workflows/DataPipelineWorkflow/runs?status=COMPLETED&start=0&end=9223372036854775807&limit=2147483647
10-Nov-2018 02:54:57 2018-11-10 02:54:57,309 - INFO  [main:c.c.c.t.AudiTestBase$1@134] - Received response: [200] Response Body: []
10-Nov-2018 02:54:57 2018-11-10 02:54:57,359 - INFO  [main:c.c.c.t.AudiTestBase$1@125] - Making request: GET http://10.210.0.16:11015/v3/namespaces/default/apps/XMLInvalidNodePathTest/versions/-SNAPSHOT/workflows/DataPipelineWorkflow/runs?status=COMPLETED&start=0&end=9223372036854775807&limit=2147483647
10-Nov-2018 02:54:57 2018-11-10 02:54:57,446 - INFO  [main:c.c.c.t.AudiTestBase$1@134] - Received response: [200] Response Body: []
10-Nov-2018 02:54:57 2018-11-10 02:54:57,497 - INFO  [main:c.c.c.t.AudiTestBase$1@125] - Making request: GET http://10.210.0.16:11015/v3/namespaces/default/apps/XMLInvalidNodePathTest/versions/-SNAPSHOT/workflows/DataPipelineWorkflow/runs?status=COMPLETED&start=0&end=9223372036854775807&limit=2147483647
10-Nov-2018 02:54:57 2018-11-10 02:54:57,583 - INFO  [main:c.c.c.t.AudiTestBase$1@134] - Received response: [200] Response Body: []
10-Nov-2018 02:54:57 2018-11-10 02:54:57,634 - INFO  [main:c.c.c.t.AudiTestBase$1@125] - Making request: GET http://10.210.0.16:11015/v3/namespaces/default/apps/XMLInvalidNodePathTest/versions/-SNAPSHOT/workflows/DataPipelineWorkflow/runs?status=COMPLETED&start=0&end=9223372036854775807&limit=2147483647
10-Nov-2018 02:54:57 2018-11-10 02:54:57,721 - INFO  [main:c.c.c.t.AudiTestBase$1@134] - Received response: [200] Response Body: []
10-Nov-2018 02:54:57 2018-11-10 02:54:57,772 - INFO  [main:c.c.c.t.AudiTestBase$1@125] - Making request: GET http://10.210.0.16:11015/v3/namespaces/default/apps/XMLInvalidNodePathTest/versions/-SNAPSHOT/workflows/DataPipelineWorkflow/runs?status=COMPLETED&start=0&end=9223372036854775807&limit=2147483647
10-Nov-2018 02:54:57 2018-11-10 02:54:57,858 - INFO  [main:c.c.c.t.AudiTestBase$1@134] - Received response: [200] Response Body: []
10-Nov-2018 02:54:57 2018-11-10 02:54:57,909 - INFO  [main:c.c.c.t.AudiTestBase$1@125] - Making request: GET http://10.210.0.16:11015/v3/namespaces/default/apps/XMLInvalidNodePathTest/versions/-SNAPSHOT/workflows/DataPipelineWorkflow/runs?status=COMPLETED&start=0&end=9223372036854775807&limit=2147483647
10-Nov-2018 02:54:57 2018-11-10 02:54:57,996 - INFO  [main:c.c.c.t.AudiTestBase$1@134] - Received response: [200] Response Body: []
10-Nov-2018 02:54:58 2018-11-10 02:54:58,047 - INFO  [main:c.c.c.t.AudiTestBase$1@125] - Making request: GET http://10.210.0.16:11015/v3/namespaces/default/apps/XMLInvalidNodePathTest/versions/-SNAPSHOT/workflows/DataPipelineWorkflow/runs?status=COMPLETED&start=0&end=9223372036854775807&limit=2147483647
10-Nov-2018 02:54:58 2018-11-10 02:54:58,134 - INFO  [main:c.c.c.t.AudiTestBase$1@134] - Received response: [200] Response Body: []
10-Nov-2018 02:54:58 2018-11-10 02:54:58,184 - INFO  [main:c.c.c.t.AudiTestBase$1@125] - Making request: GET http://10.210.0.16:11015/v3/namespaces/default/apps/XMLInvalidNodePathTest/versions/-SNAPSHOT/workflows/DataPipelineWorkflow/runs?status=COMPLETED&start=0&end=9223372036854775807&limit=2147483647
10-Nov-2018 02:54:58 2018-11-10 02:54:58,271 - INFO  [main:c.c.c.t.AudiTestBase$1@134] - Received response: [200] Response Body: []
10-Nov-2018 02:54:58 2018-11-10 02:54:58,322 - INFO  [main:c.c.c.t.AudiTestBase$1@125] - Making request: GET http://10.210.0.16:11015/v3/namespaces/default/apps/XMLInvalidNodePathTest/versions/-SNAPSHOT/workflows/DataPipelineWorkflow/runs?status=COMPLETED&start=0&end=9223372036854775807&limit=2147483647
10-Nov-2018 02:54:58 2018-11-10 02:54:58,409 - INFO  [main:c.c.c.t.AudiTestBase$1@134] - Received response: [200] Response Body: []
10-Nov-2018 02:54:58 2018-11-10 02:54:58,460 - INFO  [main:c.c.c.t.AudiTestBase$1@125] - Making request: GET http://10.210.0.16:11015/v3/namespaces/default/apps/XMLInvalidNodePathTest/versions/-SNAPSHOT/workflows/DataPipelineWorkflow/runs?status=COMPLETED&start=0&end=9223372036854775807&limit=2147483647
10-Nov-2018 02:54:58 2018-11-10 02:54:58,557 - INFO  [main:c.c.c.t.AudiTestBase$1@134] - Received response: [200] Response Body: []
10-Nov-2018 02:54:58 2018-11-10 02:54:58,608 - INFO  [main:c.c.c.t.AudiTestBase$1@125] - Making request: GET http://10.210.0.16:11015/v3/namespaces/default/apps/XMLInvalidNodePathTest/versions/-SNAPSHOT/workflows/DataPipelineWorkflow/runs?status=COMPLETED&start=0&end=9223372036854775807&limit=2147483647
10-Nov-2018 02:54:58 2018-11-10 02:54:58,695 - INFO  [main:c.c.c.t.AudiTestBase$1@134] - Received response: [200] Response Body: []
10-Nov-2018 02:54:58 2018-11-10 02:54:58,746 - INFO  [main:c.c.c.t.AudiTestBase$1@125] - Making request: GET http://10.210.0.16:11015/v3/namespaces/default/apps/XMLInvalidNodePathTest/versions/-SNAPSHOT/workflows/DataPipelineWorkflow/runs?status=COMPLETED&start=0&end=9223372036854775807&limit=2147483647
10-Nov-2018 02:54:58 2018-11-10 02:54:58,832 - INFO  [main:c.c.c.t.AudiTestBase$1@134] - Received response: [200] Response Body: []
10-Nov-2018 02:54:58 2018-11-10 02:54:58,883 - INFO  [main:c.c.c.t.AudiTestBase$1@125] - Making request: GET http://10.210.0.16:11015/v3/namespaces/default/apps/XMLInvalidNodePathTest/versions/-SNAPSHOT/workflows/DataPipelineWorkflow/runs?status=COMPLETED&start=0&end=9223372036854775807&limit=2147483647
10-Nov-2018 02:54:58 2018-11-10 02:54:58,971 - INFO  [main:c.c.c.t.AudiTestBase$1@134] - Received response: [200] Response Body: []
10-Nov-2018 02:54:59 2018-11-10 02:54:59,021 - INFO  [main:c.c.c.t.AudiTestBase$1@125] - Making request: GET http://10.210.0.16:11015/v3/namespaces/default/apps/XMLInvalidNodePathTest/versions/-SNAPSHOT/workflows/DataPipelineWorkflow/runs?status=COMPLETED&start=0&end=9223372036854775807&limit=2147483647
10-Nov-2018 02:54:59 2018-11-10 02:54:59,109 - INFO  [main:c.c.c.t.AudiTestBase$1@134] - Received response: [200] Response Body: []
10-Nov-2018 02:54:59 2018-11-10 02:54:59,160 - INFO  [main:c.c.c.t.AudiTestBase$1@125] - Making request: GET http://10.210.0.16:11015/v3/namespaces/default/apps/XMLInvalidNodePathTest/versions/-SNAPSHOT/workflows/DataPipelineWorkflow/runs?status=COMPLETED&start=0&end=9223372036854775807&limit=2147483647
10-Nov-2018 02:54:59 2018-11-10 02:54:59,247 - INFO  [main:c.c.c.t.AudiTestBase$1@134] - Received response: [200] Response Body: []
10-Nov-2018 02:54:59 2018-11-10 02:54:59,297 - INFO  [main:c.c.c.t.AudiTestBase$1@125] - Making request: GET http://10.210.0.16:11015/v3/namespaces/default/apps/XMLInvalidNodePathTest/versions/-SNAPSHOT/workflows/DataPipelineWorkflow/runs?status=COMPLETED&start=0&end=9223372036854775807&limit=2147483647
10-Nov-2018 02:54:59 2018-11-10 02:54:59,383 - INFO  [main:c.c.c.t.AudiTestBase$1@134] - Received response: [200] Response Body: []
10-Nov-2018 02:54:59 2018-11-10 02:54:59,434 - INFO  [main:c.c.c.t.AudiTestBase$1@125] - Making request: GET http://10.210.0.16:11015/v3/namespaces/default/apps/XMLInvalidNodePathTest/versions/-SNAPSHOT/workflows/DataPipelineWorkflow/runs?status=COMPLETED&start=0&end=9223372036854775807&limit=2147483647
10-Nov-2018 02:54:59 2018-11-10 02:54:59,522 - INFO  [main:c.c.c.t.AudiTestBase$1@134] - Received response: [200] Response Body: []
10-Nov-2018 02:54:59 2018-11-10 02:54:59,572 - INFO  [main:c.c.c.t.AudiTestBase$1@125] - Making request: GET http://10.210.0.16:11015/v3/namespaces/default/apps/XMLInvalidNodePathTest/versions/-SNAPSHOT/workflows/DataPipelineWorkflow/runs?status=COMPLETED&start=0&end=9223372036854775807&limit=2147483647
10-Nov-2018 02:54:59 2018-11-10 02:54:59,658 - INFO  [main:c.c.c.t.AudiTestBase$1@134] - Received response: [200] Response Body: []
10-Nov-2018 02:54:59 2018-11-10 02:54:59,709 - INFO  [main:c.c.c.t.AudiTestBase$1@125] - Making request: GET http://10.210.0.16:11015/v3/namespaces/default/apps/XMLInvalidNodePathTest/versions/-SNAPSHOT/workflows/DataPipelineWorkflow/runs?status=COMPLETED&start=0&end=9223372036854775807&limit=2147483647
10-Nov-2018 02:54:59 2018-11-10 02:54:59,796 - INFO  [main:c.c.c.t.AudiTestBase$1@134] - Received response: [200] Response Body: []
10-Nov-2018 02:54:59 2018-11-10 02:54:59,847 - INFO  [main:c.c.c.t.AudiTestBase$1@125] - Making request: GET http://10.210.0.16:11015/v3/namespaces/default/apps/XMLInvalidNodePathTest/versions/-SNAPSHOT/workflows/DataPipelineWorkflow/runs?status=COMPLETED&start=0&end=9223372036854775807&limit=2147483647
10-Nov-2018 02:54:59 2018-11-10 02:54:59,936 - INFO  [main:c.c.c.t.AudiTestBase$1@134] - Received response: [200] Response Body: []
10-Nov-2018 02:54:59 2018-11-10 02:54:59,987 - INFO  [main:c.c.c.t.AudiTestBase$1@125] - Making request: GET http://10.210.0.16:11015/v3/namespaces/default/apps/XMLInvalidNodePathTest/versions/-SNAPSHOT/workflows/DataPipelineWorkflow/runs?status=COMPLETED&start=0&end=9223372036854775807&limit=2147483647
10-Nov-2018 02:55:00 2018-11-10 02:55:00,078 - INFO  [main:c.c.c.t.AudiTestBase$1@134] - Received response: [200] Response Body: []
10-Nov-2018 02:55:00 2018-11-10 02:55:00,129 - INFO  [main:c.c.c.t.AudiTestBase$1@125] - Making request: GET http://10.210.0.16:11015/v3/namespaces/default/apps/XMLInvalidNodePathTest/versions/-SNAPSHOT/workflows/DataPipelineWorkflow/runs?status=COMPLETED&start=0&end=9223372036854775807&limit=2147483647
10-Nov-2018 02:55:00 2018-11-10 02:55:00,215 - INFO  [main:c.c.c.t.AudiTestBase$1@134] - Received response: [200] Response Body: []
10-Nov-2018 02:55:00 2018-11-10 02:55:00,265 - INFO  [main:c.c.c.t.AudiTestBase$1@125] - Making request: GET http://10.210.0.16:11015/v3/namespaces/default/apps/XMLInvalidNodePathTest/versions/-SNAPSHOT/workflows/DataPipelineWorkflow/runs?status=COMPLETED&start=0&end=9223372036854775807&limit=2147483647
10-Nov-2018 02:55:00 2018-11-10 02:55:00,352 - INFO  [main:c.c.c.t.AudiTestBase$1@134] - Received response: [200] Response Body: []
10-Nov-2018 02:55:00 2018-11-10 02:55:00,402 - INFO  [main:c.c.c.t.AudiTestBase$1@125] - Making request: GET http://10.210.0.16:11015/v3/namespaces/default/apps/XMLInvalidNodePathTest/versions/-SNAPSHOT/workflows/DataPipelineWorkflow/runs?status=COMPLETED&start=0&end=9223372036854775807&limit=2147483647
10-Nov-2018 02:55:00 2018-11-10 02:55:00,490 - INFO  [main:c.c.c.t.AudiTestBase$1@134] - Received response: [200] Response Body: []
10-Nov-2018 02:55:00 2018-11-10 02:55:00,540 - INFO  [main:c.c.c.t.AudiTestBase$1@125] - Making request: GET http://10.210.0.16:11015/v3/namespaces/default/apps/XMLInvalidNodePathTest/versions/-SNAPSHOT/workflows/DataPipelineWorkflow/runs?status=COMPLETED&start=0&end=9223372036854775807&limit=2147483647
10-Nov-2018 02:55:00 2018-11-10 02:55:00,628 - INFO  [main:c.c.c.t.AudiTestBase$1@134] - Received response: [200] Response Body: []
10-Nov-2018 02:55:00 2018-11-10 02:55:00,679 - INFO  [main:c.c.c.t.AudiTestBase$1@125] - Making request: GET http://10.210.0.16:11015/v3/namespaces/default/apps/XMLInvalidNodePathTest/versions/-SNAPSHOT/workflows/DataPipelineWorkflow/runs?status=COMPLETED&start=0&end=9223372036854775807&limit=2147483647
10-Nov-2018 02:55:00 2018-11-10 02:55:00,766 - INFO  [main:c.c.c.t.AudiTestBase$1@134] - Received response: [200] Response Body: []
10-Nov-2018 02:55:00 2018-11-10 02:55:00,817 - INFO  [main:c.c.c.t.AudiTestBase$1@125] - Making request: GET http://10.210.0.16:11015/v3/namespaces/default/apps/XMLInvalidNodePathTest/versions/-SNAPSHOT/workflows/DataPipelineWorkflow/runs?status=COMPLETED&start=0&end=9223372036854775807&limit=2147483647
10-Nov-2018 02:55:00 2018-11-10 02:55:00,904 - INFO  [main:c.c.c.t.AudiTestBase$1@134] - Received response: [200] Response Body: []
10-Nov-2018 02:55:00 2018-11-10 02:55:00,955 - INFO  [main:c.c.c.t.AudiTestBase$1@125] - Making request: GET http://10.210.0.16:11015/v3/namespaces/default/apps/XMLInvalidNodePathTest/versions/-SNAPSHOT/workflows/DataPipelineWorkflow/runs?status=COMPLETED&start=0&end=9223372036854775807&limit=2147483647
10-Nov-2018 02:55:01 2018-11-10 02:55:01,043 - INFO  [main:c.c.c.t.AudiTestBase$1@134] - Received response: [200] Response Body: []
10-Nov-2018 02:55:01 2018-11-10 02:55:01,094 - INFO  [main:c.c.c.t.AudiTestBase$1@125] - Making request: GET http://10.210.0.16:11015/v3/namespaces/default/apps/XMLInvalidNodePathTest/versions/-SNAPSHOT/workflows/DataPipelineWorkflow/runs?status=COMPLETED&start=0&end=9223372036854775807&limit=2147483647
10-Nov-2018 02:55:01 2018-11-10 02:55:01,181 - INFO  [main:c.c.c.t.AudiTestBase$1@134] - Received response: [200] Response Body: []
10-Nov-2018 02:55:01 2018-11-10 02:55:01,232 - INFO  [main:c.c.c.t.AudiTestBase$1@125] - Making request: GET http://10.210.0.16:11015/v3/namespaces/default/apps/XMLInvalidNodePathTest/versions/-SNAPSHOT/workflows/DataPipelineWorkflow/runs?status=COMPLETED&start=0&end=9223372036854775807&limit=2147483647
10-Nov-2018 02:55:01 2018-11-10 02:55:01,319 - INFO  [main:c.c.c.t.AudiTestBase$1@134] - Received response: [200] Response Body: []
10-Nov-2018 02:55:01 2018-11-10 02:55:01,370 - INFO  [main:c.c.c.t.AudiTestBase$1@125] - Making request: GET http://10.210.0.16:11015/v3/namespaces/default/apps/XMLInvalidNodePathTest/versions/-SNAPSHOT/workflows/DataPipelineWorkflow/runs?status=COMPLETED&start=0&end=9223372036854775807&limit=2147483647
10-Nov-2018 02:55:01 2018-11-10 02:55:01,471 - INFO  [main:c.c.c.t.AudiTestBase$1@134] - Received response: [200] Response Body: []
10-Nov-2018 02:55:01 2018-11-10 02:55:01,522 - INFO  [main:c.c.c.t.AudiTestBase$1@125] - Making request: GET http://10.210.0.16:11015/v3/namespaces/default/apps/XMLInvalidNodePathTest/versions/-SNAPSHOT/workflows/DataPipelineWorkflow/runs?status=COMPLETED&start=0&end=9223372036854775807&limit=2147483647
10-Nov-2018 02:55:01 2018-11-10 02:55:01,609 - INFO  [main:c.c.c.t.AudiTestBase$1@134] - Received response: [200] Response Body: []
10-Nov-2018 02:55:01 2018-11-10 02:55:01,660 - INFO  [main:c.c.c.t.AudiTestBase$1@125] - Making request: GET http://10.210.0.16:11015/v3/namespaces/default/apps/XMLInvalidNodePathTest/versions/-SNAPSHOT/workflows/DataPipelineWorkflow/runs?status=COMPLETED&start=0&end=9223372036854775807&limit=2147483647
10-Nov-2018 02:55:01 2018-11-10 02:55:01,747 - INFO  [main:c.c.c.t.AudiTestBase$1@134] - Received response: [200] Response Body: []
10-Nov-2018 02:55:01 2018-11-10 02:55:01,798 - INFO  [main:c.c.c.t.AudiTestBase$1@125] - Making request: GET http://10.210.0.16:11015/v3/namespaces/default/apps/XMLInvalidNodePathTest/versions/-SNAPSHOT/workflows/DataPipelineWorkflow/runs?status=COMPLETED&start=0&end=9223372036854775807&limit=2147483647
10-Nov-2018 02:55:01 2018-11-10 02:55:01,884 - INFO  [main:c.c.c.t.AudiTestBase$1@134] - Received response: [200] Response Body: []
10-Nov-2018 02:55:01 2018-11-10 02:55:01,935 - INFO  [main:c.c.c.t.AudiTestBase$1@125] - Making request: GET http://10.210.0.16:11015/v3/namespaces/default/apps/XMLInvalidNodePathTest/versions/-SNAPSHOT/workflows/DataPipelineWorkflow/runs?status=COMPLETED&start=0&end=9223372036854775807&limit=2147483647
10-Nov-2018 02:55:02 2018-11-10 02:55:02,023 - INFO  [main:c.c.c.t.AudiTestBase$1@134] - Received response: [200] Response Body: []
10-Nov-2018 02:55:02 2018-11-10 02:55:02,074 - INFO  [main:c.c.c.t.AudiTestBase$1@125] - Making request: GET http://10.210.0.16:11015/v3/namespaces/default/apps/XMLInvalidNodePathTest/versions/-SNAPSHOT/workflows/DataPipelineWorkflow/runs?status=COMPLETED&start=0&end=9223372036854775807&limit=2147483647
10-Nov-2018 02:55:02 2018-11-10 02:55:02,161 - INFO  [main:c.c.c.t.AudiTestBase$1@134] - Received response: [200] Response Body: []
10-Nov-2018 02:55:02 2018-11-10 02:55:02,212 - INFO  [main:c.c.c.t.AudiTestBase$1@125] - Making request: GET http://10.210.0.16:11015/v3/namespaces/default/apps/XMLInvalidNodePathTest/versions/-SNAPSHOT/workflows/DataPipelineWorkflow/runs?status=COMPLETED&start=0&end=9223372036854775807&limit=2147483647
10-Nov-2018 02:55:02 2018-11-10 02:55:02,299 - INFO  [main:c.c.c.t.AudiTestBase$1@134] - Received response: [200] Response Body: []
10-Nov-2018 02:55:02 2018-11-10 02:55:02,349 - INFO  [main:c.c.c.t.AudiTestBase$1@125] - Making request: GET http://10.210.0.16:11015/v3/namespaces/default/apps/XMLInvalidNodePathTest/versions/-SNAPSHOT/workflows/DataPipelineWorkflow/runs?status=COMPLETED&start=0&end=9223372036854775807&limit=2147483647
10-Nov-2018 02:55:02 2018-11-10 02:55:02,436 - INFO  [main:c.c.c.t.AudiTestBase$1@134] - Received response: [200] Response Body: []
10-Nov-2018 02:55:02 2018-11-10 02:55:02,487 - INFO  [main:c.c.c.t.AudiTestBase$1@125] - Making request: GET http://10.210.0.16:11015/v3/namespaces/default/apps/XMLInvalidNodePathTest/versions/-SNAPSHOT/workflows/DataPipelineWorkflow/runs?status=COMPLETED&start=0&end=9223372036854775807&limit=2147483647
10-Nov-2018 02:55:02 2018-11-10 02:55:02,574 - INFO  [main:c.c.c.t.AudiTestBase$1@134] - Received response: [200] Response Body: []
10-Nov-2018 02:55:02 2018-11-10 02:55:02,624 - INFO  [main:c.c.c.t.AudiTestBase$1@125] - Making request: GET http://10.210.0.16:11015/v3/namespaces/default/apps/XMLInvalidNodePathTest/versions/-SNAPSHOT/workflows/DataPipelineWorkflow/runs?status=COMPLETED&start=0&end=9223372036854775807&limit=2147483647
10-Nov-2018 02:55:02 2018-11-10 02:55:02,712 - INFO  [main:c.c.c.t.AudiTestBase$1@134] - Received response: [200] Response Body: []
10-Nov-2018 02:55:02 2018-11-10 02:55:02,763 - INFO  [main:c.c.c.t.AudiTestBase$1@125] - Making request: GET http://10.210.0.16:11015/v3/namespaces/default/apps/XMLInvalidNodePathTest/versions/-SNAPSHOT/workflows/DataPipelineWorkflow/runs?status=COMPLETED&start=0&end=9223372036854775807&limit=2147483647
10-Nov-2018 02:55:02 2018-11-10 02:55:02,849 - INFO  [main:c.c.c.t.AudiTestBase$1@134] - Received response: [200] Response Body: []
10-Nov-2018 02:55:02 2018-11-10 02:55:02,899 - INFO  [main:c.c.c.t.AudiTestBase$1@125] - Making request: GET http://10.210.0.16:11015/v3/namespaces/default/apps/XMLInvalidNodePathTest/versions/-SNAPSHOT/workflows/DataPipelineWorkflow/runs?status=COMPLETED&start=0&end=9223372036854775807&limit=2147483647
10-Nov-2018 02:55:02 2018-11-10 02:55:02,989 - INFO  [main:c.c.c.t.AudiTestBase$1@134] - Received response: [200] Response Body: []
10-Nov-2018 02:55:03 2018-11-10 02:55:03,040 - INFO  [main:c.c.c.t.AudiTestBase$1@125] - Making request: GET http://10.210.0.16:11015/v3/namespaces/default/apps/XMLInvalidNodePathTest/versions/-SNAPSHOT/workflows/DataPipelineWorkflow/runs?status=COMPLETED&start=0&end=9223372036854775807&limit=2147483647
10-Nov-2018 02:55:03 2018-11-10 02:55:03,127 - INFO  [main:c.c.c.t.AudiTestBase$1@134] - Received response: [200] Response Body: []
10-Nov-2018 02:55:03 2018-11-10 02:55:03,178 - INFO  [main:c.c.c.t.AudiTestBase$1@125] - Making request: GET http://10.210.0.16:11015/v3/namespaces/default/apps/XMLInvalidNodePathTest/versions/-SNAPSHOT/workflows/DataPipelineWorkflow/runs?status=COMPLETED&start=0&end=9223372036854775807&limit=2147483647
10-Nov-2018 02:55:03 2018-11-10 02:55:03,269 - INFO  [main:c.c.c.t.AudiTestBase$1@134] - Received response: [200] Response Body: []
10-Nov-2018 02:55:03 2018-11-10 02:55:03,320 - INFO  [main:c.c.c.t.AudiTestBase$1@125] - Making request: GET http://10.210.0.16:11015/v3/namespaces/default/apps/XMLInvalidNodePathTest/versions/-SNAPSHOT/workflows/DataPipelineWorkflow/runs?status=COMPLETED&start=0&end=9223372036854775807&limit=2147483647
10-Nov-2018 02:55:03 2018-11-10 02:55:03,407 - INFO  [main:c.c.c.t.AudiTestBase$1@134] - Received response: [200] Response Body: []
10-Nov-2018 02:55:03 2018-11-10 02:55:03,458 - INFO  [main:c.c.c.t.AudiTestBase$1@125] - Making request: GET http://10.210.0.16:11015/v3/namespaces/default/apps/XMLInvalidNodePathTest/versions/-SNAPSHOT/workflows/DataPipelineWorkflow/runs?status=COMPLETED&start=0&end=9223372036854775807&limit=2147483647
10-Nov-2018 02:55:03 2018-11-10 02:55:03,545 - INFO  [main:c.c.c.t.AudiTestBase$1@134] - Received response: [200] Response Body: []
10-Nov-2018 02:55:03 2018-11-10 02:55:03,596 - INFO  [main:c.c.c.t.AudiTestBase$1@125] - Making request: GET http://10.210.0.16:11015/v3/namespaces/default/apps/XMLInvalidNodePathTest/versions/-SNAPSHOT/workflows/DataPipelineWorkflow/runs?status=COMPLETED&start=0&end=9223372036854775807&limit=2147483647
10-Nov-2018 02:55:03 2018-11-10 02:55:03,683 - INFO  [main:c.c.c.t.AudiTestBase$1@134] - Received response: [200] Response Body: []
10-Nov-2018 02:55:03 2018-11-10 02:55:03,734 - INFO  [main:c.c.c.t.AudiTestBase$1@125] - Making request: GET http://10.210.0.16:11015/v3/namespaces/default/apps/XMLInvalidNodePathTest/versions/-SNAPSHOT/workflows/DataPipelineWorkflow/runs?status=COMPLETED&start=0&end=9223372036854775807&limit=2147483647
10-Nov-2018 02:55:03 2018-11-10 02:55:03,822 - INFO  [main:c.c.c.t.AudiTestBase$1@134] - Received response: [200] Response Body: []
10-Nov-2018 02:55:03 2018-11-10 02:55:03,873 - INFO  [main:c.c.c.t.AudiTestBase$1@125] - Making request: GET http://10.210.0.16:11015/v3/namespaces/default/apps/XMLInvalidNodePathTest/versions/-SNAPSHOT/workflows/DataPipelineWorkflow/runs?status=COMPLETED&start=0&end=9223372036854775807&limit=2147483647
10-Nov-2018 02:55:03 2018-11-10 02:55:03,959 - INFO  [main:c.c.c.t.AudiTestBase$1@134] - Received response: [200] Response Body: []
10-Nov-2018 02:55:04 2018-11-10 02:55:04,010 - INFO  [main:c.c.c.t.AudiTestBase$1@125] - Making request: GET http://10.210.0.16:11015/v3/namespaces/default/apps/XMLInvalidNodePathTest/versions/-SNAPSHOT/workflows/DataPipelineWorkflow/runs?status=COMPLETED&start=0&end=9223372036854775807&limit=2147483647
10-Nov-2018 02:55:04 2018-11-10 02:55:04,097 - INFO  [main:c.c.c.t.AudiTestBase$1@134] - Received response: [200] Response Body: []
10-Nov-2018 02:55:04 2018-11-10 02:55:04,148 - INFO  [main:c.c.c.t.AudiTestBase$1@125] - Making request: GET http://10.210.0.16:11015/v3/namespaces/default/apps/XMLInvalidNodePathTest/versions/-SNAPSHOT/workflows/DataPipelineWorkflow/runs?status=COMPLETED&start=0&end=9223372036854775807&limit=2147483647
10-Nov-2018 02:55:04 2018-11-10 02:55:04,235 - INFO  [main:c.c.c.t.AudiTestBase$1@134] - Received response: [200] Response Body: []
10-Nov-2018 02:55:04 2018-11-10 02:55:04,286 - INFO  [main:c.c.c.t.AudiTestBase$1@125] - Making request: GET http://10.210.0.16:11015/v3/namespaces/default/apps/XMLInvalidNodePathTest/versions/-SNAPSHOT/workflows/DataPipelineWorkflow/runs?status=COMPLETED&start=0&end=9223372036854775807&limit=2147483647
10-Nov-2018 02:55:04 2018-11-10 02:55:04,373 - INFO  [main:c.c.c.t.AudiTestBase$1@134] - Received response: [200] Response Body: []
10-Nov-2018 02:55:04 2018-11-10 02:55:04,423 - INFO  [main:c.c.c.t.AudiTestBase$1@125] - Making request: GET http://10.210.0.16:11015/v3/namespaces/default/apps/XMLInvalidNodePathTest/versions/-SNAPSHOT/workflows/DataPipelineWorkflow/runs?status=COMPLETED&start=0&end=9223372036854775807&limit=2147483647
10-Nov-2018 02:55:04 2018-11-10 02:55:04,511 - INFO  [main:c.c.c.t.AudiTestBase$1@134] - Received response: [200] Response Body: []
10-Nov-2018 02:55:04 2018-11-10 02:55:04,561 - INFO  [main:c.c.c.t.AudiTestBase$1@125] - Making request: GET http://10.210.0.16:11015/v3/namespaces/default/apps/XMLInvalidNodePathTest/versions/-SNAPSHOT/workflows/DataPipelineWorkflow/runs?status=COMPLETED&start=0&end=9223372036854775807&limit=2147483647
10-Nov-2018 02:55:04 2018-11-10 02:55:04,648 - INFO  [main:c.c.c.t.AudiTestBase$1@134] - Received response: [200] Response Body: []
10-Nov-2018 02:55:04 2018-11-10 02:55:04,699 - INFO  [main:c.c.c.t.AudiTestBase$1@125] - Making request: GET http://10.210.0.16:11015/v3/namespaces/default/apps/XMLInvalidNodePathTest/versions/-SNAPSHOT/workflows/DataPipelineWorkflow/runs?status=COMPLETED&start=0&end=9223372036854775807&limit=2147483647
10-Nov-2018 02:55:04 2018-11-10 02:55:04,786 - INFO  [main:c.c.c.t.AudiTestBase$1@134] - Received response: [200] Response Body: []
10-Nov-2018 02:55:04 2018-11-10 02:55:04,837 - INFO  [main:c.c.c.t.AudiTestBase$1@125] - Making request: GET http://10.210.0.16:11015/v3/namespaces/default/apps/XMLInvalidNodePathTest/versions/-SNAPSHOT/workflows/DataPipelineWorkflow/runs?status=COMPLETED&start=0&end=9223372036854775807&limit=2147483647
10-Nov-2018 02:55:04 2018-11-10 02:55:04,924 - INFO  [main:c.c.c.t.AudiTestBase$1@134] - Received response: [200] Response Body: []
10-Nov-2018 02:55:04 2018-11-10 02:55:04,974 - INFO  [main:c.c.c.t.AudiTestBase$1@125] - Making request: GET http://10.210.0.16:11015/v3/namespaces/default/apps/XMLInvalidNodePathTest/versions/-SNAPSHOT/workflows/DataPipelineWorkflow/runs?status=COMPLETED&start=0&end=9223372036854775807&limit=2147483647
10-Nov-2018 02:55:05 2018-11-10 02:55:05,062 - INFO  [main:c.c.c.t.AudiTestBase$1@134] - Received response: [200] Response Body: []
10-Nov-2018 02:55:05 2018-11-10 02:55:05,112 - INFO  [main:c.c.c.t.AudiTestBase$1@125] - Making request: GET http://10.210.0.16:11015/v3/namespaces/default/apps/XMLInvalidNodePathTest/versions/-SNAPSHOT/workflows/DataPipelineWorkflow/runs?status=COMPLETED&start=0&end=9223372036854775807&limit=2147483647
10-Nov-2018 02:55:05 2018-11-10 02:55:05,200 - INFO  [main:c.c.c.t.AudiTestBase$1@134] - Received response: [200] Response Body: []
10-Nov-2018 02:55:05 2018-11-10 02:55:05,250 - INFO  [main:c.c.c.t.AudiTestBase$1@125] - Making request: GET http://10.210.0.16:11015/v3/namespaces/default/apps/XMLInvalidNodePathTest/versions/-SNAPSHOT/workflows/DataPipelineWorkflow/runs?status=COMPLETED&start=0&end=9223372036854775807&limit=2147483647
10-Nov-2018 02:55:05 2018-11-10 02:55:05,337 - INFO  [main:c.c.c.t.AudiTestBase$1@134] - Received response: [200] Response Body: []
10-Nov-2018 02:55:05 2018-11-10 02:55:05,388 - INFO  [main:c.c.c.t.AudiTestBase$1@125] - Making request: GET http://10.210.0.16:11015/v3/namespaces/default/apps/XMLInvalidNodePathTest/versions/-SNAPSHOT/workflows/DataPipelineWorkflow/runs?status=COMPLETED&start=0&end=9223372036854775807&limit=2147483647
10-Nov-2018 02:55:05 2018-11-10 02:55:05,476 - INFO  [main:c.c.c.t.AudiTestBase$1@134] - Received response: [200] Response Body: []
10-Nov-2018 02:55:05 2018-11-10 02:55:05,527 - INFO  [main:c.c.c.t.AudiTestBase$1@125] - Making request: GET http://10.210.0.16:11015/v3/namespaces/default/apps/XMLInvalidNodePathTest/versions/-SNAPSHOT/workflows/DataPipelineWorkflow/runs?status=COMPLETED&start=0&end=9223372036854775807&limit=2147483647
10-Nov-2018 02:55:05 2018-11-10 02:55:05,613 - INFO  [main:c.c.c.t.AudiTestBase$1@134] - Received response: [200] Response Body: []
10-Nov-2018 02:55:05 2018-11-10 02:55:05,664 - INFO  [main:c.c.c.t.AudiTestBase$1@125] - Making request: GET http://10.210.0.16:11015/v3/namespaces/default/apps/XMLInvalidNodePathTest/versions/-SNAPSHOT/workflows/DataPipelineWorkflow/runs?status=COMPLETED&start=0&end=9223372036854775807&limit=2147483647
10-Nov-2018 02:55:05 2018-11-10 02:55:05,751 - INFO  [main:c.c.c.t.AudiTestBase$1@134] - Received response: [200] Response Body: []
10-Nov-2018 02:55:05 2018-11-10 02:55:05,802 - INFO  [main:c.c.c.t.AudiTestBase$1@125] - Making request: GET http://10.210.0.16:11015/v3/namespaces/default/apps/XMLInvalidNodePathTest/versions/-SNAPSHOT/workflows/DataPipelineWorkflow/runs?status=COMPLETED&start=0&end=9223372036854775807&limit=2147483647
10-Nov-2018 02:55:05 2018-11-10 02:55:05,889 - INFO  [main:c.c.c.t.AudiTestBase$1@134] - Received response: [200] Response Body: []
10-Nov-2018 02:55:05 2018-11-10 02:55:05,940 - INFO  [main:c.c.c.t.AudiTestBase$1@125] - Making request: GET http://10.210.0.16:11015/v3/namespaces/default/apps/XMLInvalidNodePathTest/versions/-SNAPSHOT/workflows/DataPipelineWorkflow/runs?status=COMPLETED&start=0&end=9223372036854775807&limit=2147483647
10-Nov-2018 02:55:06 2018-11-10 02:55:06,028 - INFO  [main:c.c.c.t.AudiTestBase$1@134] - Received response: [200] Response Body: []
10-Nov-2018 02:55:06 2018-11-10 02:55:06,079 - INFO  [main:c.c.c.t.AudiTestBase$1@125] - Making request: GET http://10.210.0.16:11015/v3/namespaces/default/apps/XMLInvalidNodePathTest/versions/-SNAPSHOT/workflows/DataPipelineWorkflow/runs?status=COMPLETED&start=0&end=9223372036854775807&limit=2147483647
10-Nov-2018 02:55:06 2018-11-10 02:55:06,166 - INFO  [main:c.c.c.t.AudiTestBase$1@134] - Received response: [200] Response Body: []
10-Nov-2018 02:55:06 2018-11-10 02:55:06,217 - INFO  [main:c.c.c.t.AudiTestBase$1@125] - Making request: GET http://10.210.0.16:11015/v3/namespaces/default/apps/XMLInvalidNodePathTest/versions/-SNAPSHOT/workflows/DataPipelineWorkflow/runs?status=COMPLETED&start=0&end=9223372036854775807&limit=2147483647
10-Nov-2018 02:55:06 2018-11-10 02:55:06,303 - INFO  [main:c.c.c.t.AudiTestBase$1@134] - Received response: [200] Response Body: []
10-Nov-2018 02:55:06 2018-11-10 02:55:06,354 - INFO  [main:c.c.c.t.AudiTestBase$1@125] - Making request: GET http://10.210.0.16:11015/v3/namespaces/default/apps/XMLInvalidNodePathTest/versions/-SNAPSHOT/workflows/DataPipelineWorkflow/runs?status=COMPLETED&start=0&end=9223372036854775807&limit=2147483647
10-Nov-2018 02:55:06 2018-11-10 02:55:06,441 - INFO  [main:c.c.c.t.AudiTestBase$1@134] - Received response: [200] Response Body: []
10-Nov-2018 02:55:06 2018-11-10 02:55:06,491 - INFO  [main:c.c.c.t.AudiTestBase$1@125] - Making request: GET http://10.210.0.16:11015/v3/namespaces/default/apps/XMLInvalidNodePathTest/versions/-SNAPSHOT/workflows/DataPipelineWorkflow/runs?status=COMPLETED&start=0&end=9223372036854775807&limit=2147483647
10-Nov-2018 02:55:06 2018-11-10 02:55:06,579 - INFO  [main:c.c.c.t.AudiTestBase$1@134] - Received response: [200] Response Body: []
10-Nov-2018 02:55:06 2018-11-10 02:55:06,630 - INFO  [main:c.c.c.t.AudiTestBase$1@125] - Making request: GET http://10.210.0.16:11015/v3/namespaces/default/apps/XMLInvalidNodePathTest/versions/-SNAPSHOT/workflows/DataPipelineWorkflow/runs?status=COMPLETED&start=0&end=9223372036854775807&limit=2147483647
10-Nov-2018 02:55:06 2018-11-10 02:55:06,716 - INFO  [main:c.c.c.t.AudiTestBase$1@134] - Received response: [200] Response Body: []
10-Nov-2018 02:55:06 2018-11-10 02:55:06,767 - INFO  [main:c.c.c.t.AudiTestBase$1@125] - Making request: GET http://10.210.0.16:11015/v3/namespaces/default/apps/XMLInvalidNodePathTest/versions/-SNAPSHOT/workflows/DataPipelineWorkflow/runs?status=COMPLETED&start=0&end=9223372036854775807&limit=2147483647
10-Nov-2018 02:55:06 2018-11-10 02:55:06,854 - INFO  [main:c.c.c.t.AudiTestBase$1@134] - Received response: [200] Response Body: []
10-Nov-2018 02:55:06 2018-11-10 02:55:06,905 - INFO  [main:c.c.c.t.AudiTestBase$1@125] - Making request: GET http://10.210.0.16:11015/v3/namespaces/default/apps/XMLInvalidNodePathTest/versions/-SNAPSHOT/workflows/DataPipelineWorkflow/runs?status=COMPLETED&start=0&end=9223372036854775807&limit=2147483647
10-Nov-2018 02:55:06 2018-11-10 02:55:06,993 - INFO  [main:c.c.c.t.AudiTestBase$1@134] - Received response: [200] Response Body: []
10-Nov-2018 02:55:07 2018-11-10 02:55:07,043 - INFO  [main:c.c.c.t.AudiTestBase$1@125] - Making request: GET http://10.210.0.16:11015/v3/namespaces/default/apps/XMLInvalidNodePathTest/versions/-SNAPSHOT/workflows/DataPipelineWorkflow/runs?status=COMPLETED&start=0&end=9223372036854775807&limit=2147483647
10-Nov-2018 02:55:07 2018-11-10 02:55:07,130 - INFO  [main:c.c.c.t.AudiTestBase$1@134] - Received response: [200] Response Body: []
10-Nov-2018 02:55:07 2018-11-10 02:55:07,181 - INFO  [main:c.c.c.t.AudiTestBase$1@125] - Making request: GET http://10.210.0.16:11015/v3/namespaces/default/apps/XMLInvalidNodePathTest/versions/-SNAPSHOT/workflows/DataPipelineWorkflow/runs?status=COMPLETED&start=0&end=9223372036854775807&limit=2147483647
10-Nov-2018 02:55:07 2018-11-10 02:55:07,268 - INFO  [main:c.c.c.t.AudiTestBase$1@134] - Received response: [200] Response Body: []
10-Nov-2018 02:55:07 2018-11-10 02:55:07,319 - INFO  [main:c.c.c.t.AudiTestBase$1@125] - Making request: GET http://10.210.0.16:11015/v3/namespaces/default/apps/XMLInvalidNodePathTest/versions/-SNAPSHOT/workflows/DataPipelineWorkflow/runs?status=COMPLETED&start=0&end=9223372036854775807&limit=2147483647
10-Nov-2018 02:55:07 2018-11-10 02:55:07,406 - INFO  [main:c.c.c.t.AudiTestBase$1@134] - Received response: [200] Response Body: []
10-Nov-2018 02:55:07 2018-11-10 02:55:07,457 - INFO  [main:c.c.c.t.AudiTestBase$1@125] - Making request: GET http://10.210.0.16:11015/v3/namespaces/default/apps/XMLInvalidNodePathTest/versions/-SNAPSHOT/workflows/DataPipelineWorkflow/runs?status=COMPLETED&start=0&end=9223372036854775807&limit=2147483647
10-Nov-2018 02:55:07 2018-11-10 02:55:07,546 - INFO  [main:c.c.c.t.AudiTestBase$1@134] - Received response: [200] Response Body: []
10-Nov-2018 02:55:07 2018-11-10 02:55:07,596 - INFO  [main:c.c.c.t.AudiTestBase$1@125] - Making request: GET http://10.210.0.16:11015/v3/namespaces/default/apps/XMLInvalidNodePathTest/versions/-SNAPSHOT/workflows/DataPipelineWorkflow/runs?status=COMPLETED&start=0&end=9223372036854775807&limit=2147483647
10-Nov-2018 02:55:07 2018-11-10 02:55:07,687 - INFO  [main:c.c.c.t.AudiTestBase$1@134] - Received response: [200] Response Body: []
10-Nov-2018 02:55:07 2018-11-10 02:55:07,738 - INFO  [main:c.c.c.t.AudiTestBase$1@125] - Making request: GET http://10.210.0.16:11015/v3/namespaces/default/apps/XMLInvalidNodePathTest/versions/-SNAPSHOT/workflows/DataPipelineWorkflow/runs?status=COMPLETED&start=0&end=9223372036854775807&limit=2147483647
10-Nov-2018 02:55:07 2018-11-10 02:55:07,825 - INFO  [main:c.c.c.t.AudiTestBase$1@134] - Received response: [200] Response Body: []
10-Nov-2018 02:55:07 2018-11-10 02:55:07,875 - INFO  [main:c.c.c.t.AudiTestBase$1@125] - Making request: GET http://10.210.0.16:11015/v3/namespaces/default/apps/XMLInvalidNodePathTest/versions/-SNAPSHOT/workflows/DataPipelineWorkflow/runs?status=COMPLETED&start=0&end=9223372036854775807&limit=2147483647
10-Nov-2018 02:55:07 2018-11-10 02:55:07,963 - INFO  [main:c.c.c.t.AudiTestBase$1@134] - Received response: [200] Response Body: []
10-Nov-2018 02:55:08 2018-11-10 02:55:08,014 - INFO  [main:c.c.c.t.AudiTestBase$1@125] - Making request: GET http://10.210.0.16:11015/v3/namespaces/default/apps/XMLInvalidNodePathTest/versions/-SNAPSHOT/workflows/DataPipelineWorkflow/runs?status=COMPLETED&start=0&end=9223372036854775807&limit=2147483647
10-Nov-2018 02:55:08 2018-11-10 02:55:08,101 - INFO  [main:c.c.c.t.AudiTestBase$1@134] - Received response: [200] Response Body: []
10-Nov-2018 02:55:08 2018-11-10 02:55:08,151 - INFO  [main:c.c.c.t.AudiTestBase$1@125] - Making request: GET http://10.210.0.16:11015/v3/namespaces/default/apps/XMLInvalidNodePathTest/versions/-SNAPSHOT/workflows/DataPipelineWorkflow/runs?status=COMPLETED&start=0&end=9223372036854775807&limit=2147483647
10-Nov-2018 02:55:08 2018-11-10 02:55:08,239 - INFO  [main:c.c.c.t.AudiTestBase$1@134] - Received response: [200] Response Body: []
10-Nov-2018 02:55:08 2018-11-10 02:55:08,290 - INFO  [main:c.c.c.t.AudiTestBase$1@125] - Making request: GET http://10.210.0.16:11015/v3/namespaces/default/apps/XMLInvalidNodePathTest/versions/-SNAPSHOT/workflows/DataPipelineWorkflow/runs?status=COMPLETED&start=0&end=9223372036854775807&limit=2147483647
10-Nov-2018 02:55:08 2018-11-10 02:55:08,376 - INFO  [main:c.c.c.t.AudiTestBase$1@134] - Received response: [200] Response Body: []
10-Nov-2018 02:55:08 2018-11-10 02:55:08,427 - INFO  [main:c.c.c.t.AudiTestBase$1@125] - Making request: GET http://10.210.0.16:11015/v3/namespaces/default/apps/XMLInvalidNodePathTest/versions/-SNAPSHOT/workflows/DataPipelineWorkflow/runs?status=COMPLETED&start=0&end=9223372036854775807&limit=2147483647
10-Nov-2018 02:55:08 2018-11-10 02:55:08,514 - INFO  [main:c.c.c.t.AudiTestBase$1@134] - Received response: [200] Response Body: []
10-Nov-2018 02:55:08 2018-11-10 02:55:08,565 - INFO  [main:c.c.c.t.AudiTestBase$1@125] - Making request: GET http://10.210.0.16:11015/v3/namespaces/default/apps/XMLInvalidNodePathTest/versions/-SNAPSHOT/workflows/DataPipelineWorkflow/runs?status=COMPLETED&start=0&end=9223372036854775807&limit=2147483647
10-Nov-2018 02:55:08 2018-11-10 02:55:08,652 - INFO  [main:c.c.c.t.AudiTestBase$1@134] - Received response: [200] Response Body: []
10-Nov-2018 02:55:08 2018-11-10 02:55:08,703 - INFO  [main:c.c.c.t.AudiTestBase$1@125] - Making request: GET http://10.210.0.16:11015/v3/namespaces/default/apps/XMLInvalidNodePathTest/versions/-SNAPSHOT/workflows/DataPipelineWorkflow/runs?status=COMPLETED&start=0&end=9223372036854775807&limit=2147483647
10-Nov-2018 02:55:08 2018-11-10 02:55:08,789 - INFO  [main:c.c.c.t.AudiTestBase$1@134] - Received response: [200] Response Body: []
10-Nov-2018 02:55:08 2018-11-10 02:55:08,840 - INFO  [main:c.c.c.t.AudiTestBase$1@125] - Making request: GET http://10.210.0.16:11015/v3/namespaces/default/apps/XMLInvalidNodePathTest/versions/-SNAPSHOT/workflows/DataPipelineWorkflow/runs?status=COMPLETED&start=0&end=9223372036854775807&limit=2147483647
10-Nov-2018 02:55:08 2018-11-10 02:55:08,927 - INFO  [main:c.c.c.t.AudiTestBase$1@134] - Received response: [200] Response Body: []
10-Nov-2018 02:55:08 2018-11-10 02:55:08,979 - INFO  [main:c.c.c.t.AudiTestBase$1@125] - Making request: GET http://10.210.0.16:11015/v3/namespaces/default/apps/XMLInvalidNodePathTest/versions/-SNAPSHOT/workflows/DataPipelineWorkflow/runs?status=COMPLETED&start=0&end=9223372036854775807&limit=2147483647
10-Nov-2018 02:55:09 2018-11-10 02:55:09,067 - INFO  [main:c.c.c.t.AudiTestBase$1@134] - Received response: [200] Response Body: []
10-Nov-2018 02:55:09 2018-11-10 02:55:09,117 - INFO  [main:c.c.c.t.AudiTestBase$1@125] - Making request: GET http://10.210.0.16:11015/v3/namespaces/default/apps/XMLInvalidNodePathTest/versions/-SNAPSHOT/workflows/DataPipelineWorkflow/runs?status=COMPLETED&start=0&end=9223372036854775807&limit=2147483647
10-Nov-2018 02:55:09 2018-11-10 02:55:09,206 - INFO  [main:c.c.c.t.AudiTestBase$1@134] - Received response: [200] Response Body: []
10-Nov-2018 02:55:09 2018-11-10 02:55:09,257 - INFO  [main:c.c.c.t.AudiTestBase$1@125] - Making request: GET http://10.210.0.16:11015/v3/namespaces/default/apps/XMLInvalidNodePathTest/versions/-SNAPSHOT/workflows/DataPipelineWorkflow/runs?status=COMPLETED&start=0&end=9223372036854775807&limit=2147483647
10-Nov-2018 02:55:09 2018-11-10 02:55:09,344 - INFO  [main:c.c.c.t.AudiTestBase$1@134] - Received response: [200] Response Body: []
10-Nov-2018 02:55:09 2018-11-10 02:55:09,394 - INFO  [main:c.c.c.t.AudiTestBase$1@125] - Making request: GET http://10.210.0.16:11015/v3/namespaces/default/apps/XMLInvalidNodePathTest/versions/-SNAPSHOT/workflows/DataPipelineWorkflow/runs?status=COMPLETED&start=0&end=9223372036854775807&limit=2147483647
10-Nov-2018 02:55:09 2018-11-10 02:55:09,487 - INFO  [main:c.c.c.t.AudiTestBase$1@134] - Received response: [200] Response Body: []
10-Nov-2018 02:55:09 2018-11-10 02:55:09,537 - INFO  [main:c.c.c.t.AudiTestBase$1@125] - Making request: GET http://10.210.0.16:11015/v3/namespaces/default/apps/XMLInvalidNodePathTest/versions/-SNAPSHOT/workflows/DataPipelineWorkflow/runs?status=COMPLETED&start=0&end=9223372036854775807&limit=2147483647
10-Nov-2018 02:55:09 2018-11-10 02:55:09,624 - INFO  [main:c.c.c.t.AudiTestBase$1@134] - Received response: [200] Response Body: []
10-Nov-2018 02:55:09 2018-11-10 02:55:09,675 - INFO  [main:c.c.c.t.AudiTestBase$1@125] - Making request: GET http://10.210.0.16:11015/v3/namespaces/default/apps/XMLInvalidNodePathTest/versions/-SNAPSHOT/workflows/DataPipelineWorkflow/runs?status=COMPLETED&start=0&end=9223372036854775807&limit=2147483647
10-Nov-2018 02:55:09 2018-11-10 02:55:09,762 - INFO  [main:c.c.c.t.AudiTestBase$1@134] - Received response: [200] Response Body: []
10-Nov-2018 02:55:09 2018-11-10 02:55:09,813 - INFO  [main:c.c.c.t.AudiTestBase$1@125] - Making request: GET http://10.210.0.16:11015/v3/namespaces/default/apps/XMLInvalidNodePathTest/versions/-SNAPSHOT/workflows/DataPipelineWorkflow/runs?status=COMPLETED&start=0&end=9223372036854775807&limit=2147483647
10-Nov-2018 02:55:09 2018-11-10 02:55:09,899 - INFO  [main:c.c.c.t.AudiTestBase$1@134] - Received response: [200] Response Body: []
10-Nov-2018 02:55:09 2018-11-10 02:55:09,950 - INFO  [main:c.c.c.t.AudiTestBase$1@125] - Making request: GET http://10.210.0.16:11015/v3/namespaces/default/apps/XMLInvalidNodePathTest/versions/-SNAPSHOT/workflows/DataPipelineWorkflow/runs?status=COMPLETED&start=0&end=9223372036854775807&limit=2147483647
10-Nov-2018 02:55:10 2018-11-10 02:55:10,036 - INFO  [main:c.c.c.t.AudiTestBase$1@134] - Received response: [200] Response Body: []
10-Nov-2018 02:55:10 2018-11-10 02:55:10,087 - INFO  [main:c.c.c.t.AudiTestBase$1@125] - Making request: GET http://10.210.0.16:11015/v3/namespaces/default/apps/XMLInvalidNodePathTest/versions/-SNAPSHOT/workflows/DataPipelineWorkflow/runs?status=COMPLETED&start=0&end=9223372036854775807&limit=2147483647
10-Nov-2018 02:55:10 2018-11-10 02:55:10,174 - INFO  [main:c.c.c.t.AudiTestBase$1@134] - Received response: [200] Response Body: []
10-Nov-2018 02:55:10 2018-11-10 02:55:10,225 - INFO  [main:c.c.c.t.AudiTestBase$1@125] - Making request: GET http://10.210.0.16:11015/v3/namespaces/default/apps/XMLInvalidNodePathTest/versions/-SNAPSHOT/workflows/DataPipelineWorkflow/runs?status=COMPLETED&start=0&end=9223372036854775807&limit=2147483647
10-Nov-2018 02:55:10 2018-11-10 02:55:10,311 - INFO  [main:c.c.c.t.AudiTestBase$1@134] - Received response: [200] Response Body: []
10-Nov-2018 02:55:10 2018-11-10 02:55:10,362 - INFO  [main:c.c.c.t.AudiTestBase$1@125] - Making request: GET http://10.210.0.16:11015/v3/namespaces/default/apps/XMLInvalidNodePathTest/versions/-SNAPSHOT/workflows/DataPipelineWorkflow/runs?status=COMPLETED&start=0&end=9223372036854775807&limit=2147483647
10-Nov-2018 02:55:10 2018-11-10 02:55:10,450 - INFO  [main:c.c.c.t.AudiTestBase$1@134] - Received response: [200] Response Body: []
10-Nov-2018 02:55:10 2018-11-10 02:55:10,501 - INFO  [main:c.c.c.t.AudiTestBase$1@125] - Making request: GET http://10.210.0.16:11015/v3/namespaces/default/apps/XMLInvalidNodePathTest/versions/-SNAPSHOT/workflows/DataPipelineWorkflow/runs?status=COMPLETED&start=0&end=9223372036854775807&limit=2147483647
10-Nov-2018 02:55:10 2018-11-10 02:55:10,588 - INFO  [main:c.c.c.t.AudiTestBase$1@134] - Received response: [200] Response Body: []
10-Nov-2018 02:55:10 2018-11-10 02:55:10,639 - INFO  [main:c.c.c.t.AudiTestBase$1@125] - Making request: GET http://10.210.0.16:11015/v3/namespaces/default/apps/XMLInvalidNodePathTest/versions/-SNAPSHOT/workflows/DataPipelineWorkflow/runs?status=COMPLETED&start=0&end=9223372036854775807&limit=2147483647
10-Nov-2018 02:55:10 2018-11-10 02:55:10,725 - INFO  [main:c.c.c.t.AudiTestBase$1@134] - Received response: [200] Response Body: []
10-Nov-2018 02:55:10 2018-11-10 02:55:10,776 - INFO  [main:c.c.c.t.AudiTestBase$1@125] - Making request: GET http://10.210.0.16:11015/v3/namespaces/default/apps/XMLInvalidNodePathTest/versions/-SNAPSHOT/workflows/DataPipelineWorkflow/runs?status=COMPLETED&start=0&end=9223372036854775807&limit=2147483647
10-Nov-2018 02:55:10 2018-11-10 02:55:10,874 - INFO  [main:c.c.c.t.AudiTestBase$1@134] - Received response: [200] Response Body: []
10-Nov-2018 02:55:10 2018-11-10 02:55:10,925 - INFO  [main:c.c.c.t.AudiTestBase$1@125] - Making request: GET http://10.210.0.16:11015/v3/namespaces/default/apps/XMLInvalidNodePathTest/versions/-SNAPSHOT/workflows/DataPipelineWorkflow/runs?status=COMPLETED&start=0&end=9223372036854775807&limit=2147483647
10-Nov-2018 02:55:11 2018-11-10 02:55:11,013 - INFO  [main:c.c.c.t.AudiTestBase$1@134] - Received response: [200] Response Body: []
10-Nov-2018 02:55:11 2018-11-10 02:55:11,064 - INFO  [main:c.c.c.t.AudiTestBase$1@125] - Making request: GET http://10.210.0.16:11015/v3/namespaces/default/apps/XMLInvalidNodePathTest/versions/-SNAPSHOT/workflows/DataPipelineWorkflow/runs?status=COMPLETED&start=0&end=9223372036854775807&limit=2147483647
10-Nov-2018 02:55:11 2018-11-10 02:55:11,151 - INFO  [main:c.c.c.t.AudiTestBase$1@134] - Received response: [200] Response Body: []
10-Nov-2018 02:55:11 2018-11-10 02:55:11,202 - INFO  [main:c.c.c.t.AudiTestBase$1@125] - Making request: GET http://10.210.0.16:11015/v3/namespaces/default/apps/XMLInvalidNodePathTest/versions/-SNAPSHOT/workflows/DataPipelineWorkflow/runs?status=COMPLETED&start=0&end=9223372036854775807&limit=2147483647
10-Nov-2018 02:55:11 2018-11-10 02:55:11,289 - INFO  [main:c.c.c.t.AudiTestBase$1@134] - Received response: [200] Response Body: []
10-Nov-2018 02:55:11 2018-11-10 02:55:11,339 - INFO  [main:c.c.c.t.AudiTestBase$1@125] - Making request: GET http://10.210.0.16:11015/v3/namespaces/default/apps/XMLInvalidNodePathTest/versions/-SNAPSHOT/workflows/DataPipelineWorkflow/runs?status=COMPLETED&start=0&end=9223372036854775807&limit=2147483647
10-Nov-2018 02:55:11 2018-11-10 02:55:11,426 - INFO  [main:c.c.c.t.AudiTestBase$1@134] - Received response: [200] Response Body: []
10-Nov-2018 02:55:11 2018-11-10 02:55:11,477 - INFO  [main:c.c.c.t.AudiTestBase$1@125] - Making request: GET http://10.210.0.16:11015/v3/namespaces/default/apps/XMLInvalidNodePathTest/versions/-SNAPSHOT/workflows/DataPipelineWorkflow/runs?status=COMPLETED&start=0&end=9223372036854775807&limit=2147483647
10-Nov-2018 02:55:11 2018-11-10 02:55:11,564 - INFO  [main:c.c.c.t.AudiTestBase$1@134] - Received response: [200] Response Body: []
10-Nov-2018 02:55:11 2018-11-10 02:55:11,615 - INFO  [main:c.c.c.t.AudiTestBase$1@125] - Making request: GET http://10.210.0.16:11015/v3/namespaces/default/apps/XMLInvalidNodePathTest/versions/-SNAPSHOT/workflows/DataPipelineWorkflow/runs?status=COMPLETED&start=0&end=9223372036854775807&limit=2147483647
10-Nov-2018 02:55:11 2018-11-10 02:55:11,703 - INFO  [main:c.c.c.t.AudiTestBase$1@134] - Received response: [200] Response Body: []
10-Nov-2018 02:55:11 2018-11-10 02:55:11,754 - INFO  [main:c.c.c.t.AudiTestBase$1@125] - Making request: GET http://10.210.0.16:11015/v3/namespaces/default/apps/XMLInvalidNodePathTest/versions/-SNAPSHOT/workflows/DataPipelineWorkflow/runs?status=COMPLETED&start=0&end=9223372036854775807&limit=2147483647
10-Nov-2018 02:55:11 2018-11-10 02:55:11,841 - INFO  [main:c.c.c.t.AudiTestBase$1@134] - Received response: [200] Response Body: []
10-Nov-2018 02:55:11 2018-11-10 02:55:11,892 - INFO  [main:c.c.c.t.AudiTestBase$1@125] - Making request: GET http://10.210.0.16:11015/v3/namespaces/default/apps/XMLInvalidNodePathTest/versions/-SNAPSHOT/workflows/DataPipelineWorkflow/runs?status=COMPLETED&start=0&end=9223372036854775807&limit=2147483647
10-Nov-2018 02:55:11 2018-11-10 02:55:11,979 - INFO  [main:c.c.c.t.AudiTestBase$1@134] - Received response: [200] Response Body: []
10-Nov-2018 02:55:12 2018-11-10 02:55:12,030 - INFO  [main:c.c.c.t.AudiTestBase$1@125] - Making request: GET http://10.210.0.16:11015/v3/namespaces/default/apps/XMLInvalidNodePathTest/versions/-SNAPSHOT/workflows/DataPipelineWorkflow/runs?status=COMPLETED&start=0&end=9223372036854775807&limit=2147483647
10-Nov-2018 02:55:12 2018-11-10 02:55:12,119 - INFO  [main:c.c.c.t.AudiTestBase$1@134] - Received response: [200] Response Body: []
10-Nov-2018 02:55:12 2018-11-10 02:55:12,170 - INFO  [main:c.c.c.t.AudiTestBase$1@125] - Making request: GET http://10.210.0.16:11015/v3/namespaces/default/apps/XMLInvalidNodePathTest/versions/-SNAPSHOT/workflows/DataPipelineWorkflow/runs?status=COMPLETED&start=0&end=9223372036854775807&limit=2147483647
10-Nov-2018 02:55:12 2018-11-10 02:55:12,257 - INFO  [main:c.c.c.t.AudiTestBase$1@134] - Received response: [200] Response Body: []
10-Nov-2018 02:55:12 2018-11-10 02:55:12,308 - INFO  [main:c.c.c.t.AudiTestBase$1@125] - Making request: GET http://10.210.0.16:11015/v3/namespaces/default/apps/XMLInvalidNodePathTest/versions/-SNAPSHOT/workflows/DataPipelineWorkflow/runs?status=COMPLETED&start=0&end=9223372036854775807&limit=2147483647
10-Nov-2018 02:55:12 2018-11-10 02:55:12,396 - INFO  [main:c.c.c.t.AudiTestBase$1@134] - Received response: [200] Response Body: []
10-Nov-2018 02:55:12 2018-11-10 02:55:12,447 - INFO  [main:c.c.c.t.AudiTestBase$1@125] - Making request: GET http://10.210.0.16:11015/v3/namespaces/default/apps/XMLInvalidNodePathTest/versions/-SNAPSHOT/workflows/DataPipelineWorkflow/runs?status=COMPLETED&start=0&end=9223372036854775807&limit=2147483647
10-Nov-2018 02:55:12 2018-11-10 02:55:12,534 - INFO  [main:c.c.c.t.AudiTestBase$1@134] - Received response: [200] Response Body: []
10-Nov-2018 02:55:12 2018-11-10 02:55:12,584 - INFO  [main:c.c.c.t.AudiTestBase$1@125] - Making request: GET http://10.210.0.16:11015/v3/namespaces/default/apps/XMLInvalidNodePathTest/versions/-SNAPSHOT/workflows/DataPipelineWorkflow/runs?status=COMPLETED&start=0&end=9223372036854775807&limit=2147483647
10-Nov-2018 02:55:12 2018-11-10 02:55:12,673 - INFO  [main:c.c.c.t.AudiTestBase$1@134] - Received response: [200] Response Body: []
10-Nov-2018 02:55:12 2018-11-10 02:55:12,724 - INFO  [main:c.c.c.t.AudiTestBase$1@125] - Making request: GET http://10.210.0.16:11015/v3/namespaces/default/apps/XMLInvalidNodePathTest/versions/-SNAPSHOT/workflows/DataPipelineWorkflow/runs?status=COMPLETED&start=0&end=9223372036854775807&limit=2147483647
10-Nov-2018 02:55:12 2018-11-10 02:55:12,813 - INFO  [main:c.c.c.t.AudiTestBase$1@134] - Received response: [200] Response Body: []
10-Nov-2018 02:55:12 2018-11-10 02:55:12,864 - INFO  [main:c.c.c.t.AudiTestBase$1@125] - Making request: GET http://10.210.0.16:11015/v3/namespaces/default/apps/XMLInvalidNodePathTest/versions/-SNAPSHOT/workflows/DataPipelineWorkflow/runs?status=COMPLETED&start=0&end=9223372036854775807&limit=2147483647
10-Nov-2018 02:55:12 2018-11-10 02:55:12,951 - INFO  [main:c.c.c.t.AudiTestBase$1@134] - Received response: [200] Response Body: []
10-Nov-2018 02:55:13 2018-11-10 02:55:13,001 - INFO  [main:c.c.c.t.AudiTestBase$1@125] - Making request: GET http://10.210.0.16:11015/v3/namespaces/default/apps/XMLInvalidNodePathTest/versions/-SNAPSHOT/workflows/DataPipelineWorkflow/runs?status=COMPLETED&start=0&end=9223372036854775807&limit=2147483647
10-Nov-2018 02:55:13 2018-11-10 02:55:13,088 - INFO  [main:c.c.c.t.AudiTestBase$1@134] - Received response: [200] Response Body: []
10-Nov-2018 02:55:13 2018-11-10 02:55:13,139 - INFO  [main:c.c.c.t.AudiTestBase$1@125] - Making request: GET http://10.210.0.16:11015/v3/namespaces/default/apps/XMLInvalidNodePathTest/versions/-SNAPSHOT/workflows/DataPipelineWorkflow/runs?status=COMPLETED&start=0&end=9223372036854775807&limit=2147483647
10-Nov-2018 02:55:13 2018-11-10 02:55:13,226 - INFO  [main:c.c.c.t.AudiTestBase$1@134] - Received response: [200] Response Body: []
10-Nov-2018 02:55:13 2018-11-10 02:55:13,277 - INFO  [main:c.c.c.t.AudiTestBase$1@125] - Making request: GET http://10.210.0.16:11015/v3/namespaces/default/apps/XMLInvalidNodePathTest/versions/-SNAPSHOT/workflows/DataPipelineWorkflow/runs?status=COMPLETED&start=0&end=9223372036854775807&limit=2147483647
10-Nov-2018 02:55:13 2018-11-10 02:55:13,362 - INFO  [main:c.c.c.t.AudiTestBase$1@134] - Received response: [200] Response Body: []
10-Nov-2018 02:55:13 2018-11-10 02:55:13,413 - INFO  [main:c.c.c.t.AudiTestBase$1@125] - Making request: GET http://10.210.0.16:11015/v3/namespaces/default/apps/XMLInvalidNodePathTest/versions/-SNAPSHOT/workflows/DataPipelineWorkflow/runs?status=COMPLETED&start=0&end=9223372036854775807&limit=2147483647
10-Nov-2018 02:55:13 2018-11-10 02:55:13,500 - INFO  [main:c.c.c.t.AudiTestBase$1@134] - Received response: [200] Response Body: []
10-Nov-2018 02:55:13 2018-11-10 02:55:13,551 - INFO  [main:c.c.c.t.AudiTestBase$1@125] - Making request: GET http://10.210.0.16:11015/v3/namespaces/default/apps/XMLInvalidNodePathTest/versions/-SNAPSHOT/workflows/DataPipelineWorkflow/runs?status=COMPLETED&start=0&end=9223372036854775807&limit=2147483647
10-Nov-2018 02:55:13 2018-11-10 02:55:13,638 - INFO  [main:c.c.c.t.AudiTestBase$1@134] - Received response: [200] Response Body: []
10-Nov-2018 02:55:13 2018-11-10 02:55:13,689 - INFO  [main:c.c.c.t.AudiTestBase$1@125] - Making request: GET http://10.210.0.16:11015/v3/namespaces/default/apps/XMLInvalidNodePathTest/versions/-SNAPSHOT/workflows/DataPipelineWorkflow/runs?status=COMPLETED&start=0&end=9223372036854775807&limit=2147483647
10-Nov-2018 02:55:13 2018-11-10 02:55:13,776 - INFO  [main:c.c.c.t.AudiTestBase$1@134] - Received response: [200] Response Body: []
10-Nov-2018 02:55:13 2018-11-10 02:55:13,827 - INFO  [main:c.c.c.t.AudiTestBase$1@125] - Making request: GET http://10.210.0.16:11015/v3/namespaces/default/apps/XMLInvalidNodePathTest/versions/-SNAPSHOT/workflows/DataPipelineWorkflow/runs?status=COMPLETED&start=0&end=9223372036854775807&limit=2147483647
10-Nov-2018 02:55:13 2018-11-10 02:55:13,913 - INFO  [main:c.c.c.t.AudiTestBase$1@134] - Received response: [200] Response Body: []
10-Nov-2018 02:55:13 2018-11-10 02:55:13,964 - INFO  [main:c.c.c.t.AudiTestBase$1@125] - Making request: GET http://10.210.0.16:11015/v3/namespaces/default/apps/XMLInvalidNodePathTest/versions/-SNAPSHOT/workflows/DataPipelineWorkflow/runs?status=COMPLETED&start=0&end=9223372036854775807&limit=2147483647
10-Nov-2018 02:55:14 2018-11-10 02:55:14,051 - INFO  [main:c.c.c.t.AudiTestBase$1@134] - Received response: [200] Response Body: []
10-Nov-2018 02:55:14 2018-11-10 02:55:14,102 - INFO  [main:c.c.c.t.AudiTestBase$1@125] - Making request: GET http://10.210.0.16:11015/v3/namespaces/default/apps/XMLInvalidNodePathTest/versions/-SNAPSHOT/workflows/DataPipelineWorkflow/runs?status=COMPLETED&start=0&end=9223372036854775807&limit=2147483647
10-Nov-2018 02:55:14 2018-11-10 02:55:14,189 - INFO  [main:c.c.c.t.AudiTestBase$1@134] - Received response: [200] Response Body: []
10-Nov-2018 02:55:14 2018-11-10 02:55:14,240 - INFO  [main:c.c.c.t.AudiTestBase$1@125] - Making request: GET http://10.210.0.16:11015/v3/namespaces/default/apps/XMLInvalidNodePathTest/versions/-SNAPSHOT/workflows/DataPipelineWorkflow/runs?status=COMPLETED&start=0&end=9223372036854775807&limit=2147483647
10-Nov-2018 02:55:14 2018-11-10 02:55:14,326 - INFO  [main:c.c.c.t.AudiTestBase$1@134] - Received response: [200] Response Body: []
10-Nov-2018 02:55:14 2018-11-10 02:55:14,377 - INFO  [main:c.c.c.t.AudiTestBase$1@125] - Making request: GET http://10.210.0.16:11015/v3/namespaces/default/apps/XMLInvalidNodePathTest/versions/-SNAPSHOT/workflows/DataPipelineWorkflow/runs?status=COMPLETED&start=0&end=9223372036854775807&limit=2147483647
10-Nov-2018 02:55:14 2018-11-10 02:55:14,464 - INFO  [main:c.c.c.t.AudiTestBase$1@134] - Received response: [200] Response Body: []
10-Nov-2018 02:55:14 2018-11-10 02:55:14,515 - INFO  [main:c.c.c.t.AudiTestBase$1@125] - Making request: GET http://10.210.0.16:11015/v3/namespaces/default/apps/XMLInvalidNodePathTest/versions/-SNAPSHOT/workflows/DataPipelineWorkflow/runs?status=COMPLETED&start=0&end=9223372036854775807&limit=2147483647
10-Nov-2018 02:55:14 2018-11-10 02:55:14,602 - INFO  [main:c.c.c.t.AudiTestBase$1@134] - Received response: [200] Response Body: []
10-Nov-2018 02:55:14 2018-11-10 02:55:14,653 - INFO  [main:c.c.c.t.AudiTestBase$1@125] - Making request: GET http://10.210.0.16:11015/v3/namespaces/default/apps/XMLInvalidNodePathTest/versions/-SNAPSHOT/workflows/DataPipelineWorkflow/runs?status=COMPLETED&start=0&end=9223372036854775807&limit=2147483647
10-Nov-2018 02:55:14 2018-11-10 02:55:14,739 - INFO  [main:c.c.c.t.AudiTestBase$1@134] - Received response: [200] Response Body: []
10-Nov-2018 02:55:14 2018-11-10 02:55:14,790 - INFO  [main:c.c.c.t.AudiTestBase$1@125] - Making request: GET http://10.210.0.16:11015/v3/namespaces/default/apps/XMLInvalidNodePathTest/versions/-SNAPSHOT/workflows/DataPipelineWorkflow/runs?status=COMPLETED&start=0&end=9223372036854775807&limit=2147483647
10-Nov-2018 02:55:14 2018-11-10 02:55:14,879 - INFO  [main:c.c.c.t.AudiTestBase$1@134] - Received response: [200] Response Body: []
10-Nov-2018 02:55:14 2018-11-10 02:55:14,929 - INFO  [main:c.c.c.t.AudiTestBase$1@125] - Making request: GET http://10.210.0.16:11015/v3/namespaces/default/apps/XMLInvalidNodePathTest/versions/-SNAPSHOT/workflows/DataPipelineWorkflow/runs?status=COMPLETED&start=0&end=9223372036854775807&limit=2147483647
10-Nov-2018 02:55:15 2018-11-10 02:55:15,026 - INFO  [main:c.c.c.t.AudiTestBase$1@134] - Received response: [200] Response Body: []
10-Nov-2018 02:55:15 2018-11-10 02:55:15,077 - INFO  [main:c.c.c.t.AudiTestBase$1@125] - Making request: GET http://10.210.0.16:11015/v3/namespaces/default/apps/XMLInvalidNodePathTest/versions/-SNAPSHOT/workflows/DataPipelineWorkflow/runs?status=COMPLETED&start=0&end=9223372036854775807&limit=2147483647
10-Nov-2018 02:55:15 2018-11-10 02:55:15,164 - INFO  [main:c.c.c.t.AudiTestBase$1@134] - Received response: [200] Response Body: []
10-Nov-2018 02:55:15 2018-11-10 02:55:15,215 - INFO  [main:c.c.c.t.AudiTestBase$1@125] - Making request: GET http://10.210.0.16:11015/v3/namespaces/default/apps/XMLInvalidNodePathTest/versions/-SNAPSHOT/workflows/DataPipelineWorkflow/runs?status=COMPLETED&start=0&end=9223372036854775807&limit=2147483647
10-Nov-2018 02:55:15 2018-11-10 02:55:15,302 - INFO  [main:c.c.c.t.AudiTestBase$1@134] - Received response: [200] Response Body: []
10-Nov-2018 02:55:15 2018-11-10 02:55:15,353 - INFO  [main:c.c.c.t.AudiTestBase$1@125] - Making request: GET http://10.210.0.16:11015/v3/namespaces/default/apps/XMLInvalidNodePathTest/versions/-SNAPSHOT/workflows/DataPipelineWorkflow/runs?status=COMPLETED&start=0&end=9223372036854775807&limit=2147483647
10-Nov-2018 02:55:15 2018-11-10 02:55:15,440 - INFO  [main:c.c.c.t.AudiTestBase$1@134] - Received response: [200] Response Body: []
10-Nov-2018 02:55:15 2018-11-10 02:55:15,491 - INFO  [main:c.c.c.t.AudiTestBase$1@125] - Making request: GET http://10.210.0.16:11015/v3/namespaces/default/apps/XMLInvalidNodePathTest/versions/-SNAPSHOT/workflows/DataPipelineWorkflow/runs?status=COMPLETED&start=0&end=9223372036854775807&limit=2147483647
10-Nov-2018 02:55:15 2018-11-10 02:55:15,578 - INFO  [main:c.c.c.t.AudiTestBase$1@134] - Received response: [200] Response Body: []
10-Nov-2018 02:55:15 2018-11-10 02:55:15,629 - INFO  [main:c.c.c.t.AudiTestBase$1@125] - Making request: GET http://10.210.0.16:11015/v3/namespaces/default/apps/XMLInvalidNodePathTest/versions/-SNAPSHOT/workflows/DataPipelineWorkflow/runs?status=COMPLETED&start=0&end=9223372036854775807&limit=2147483647
10-Nov-2018 02:55:15 2018-11-10 02:55:15,715 - INFO  [main:c.c.c.t.AudiTestBase$1@134] - Received response: [200] Response Body: [{"runid":"c7be687d-e493-11e8-8be7-42010ad20010","starting":1541818399,"start":1541818420,"end":1541818514,"status":"COMPLETED","properties":{"runtimeArgs":"{\"logical.start.time\":\"1541818399723\"}","phase-1":"df57f891-e493-11e8-81b1-42010ad20012"}}]
10-Nov-2018 02:55:15 2018-11-10 02:55:15,718 - DEBUG [main:o.a.t.i.ApplicationBundler@203] - Start creating bundle at /tmp/IT-ITN5-DSTC514/junit8305427537416784334/junit6568736151411652798/co.cask.cdap.remote.dataset.table.TableDatasetApp.e17f57fc-87dc-43c3-9121-c444b738910d.jar
10-Nov-2018 02:55:15 2018-11-10 02:55:15,724 - DEBUG [main:o.a.t.i.ApplicationBundler@206] - First create bundle locally at /tmp/IT-ITN5-DSTC514/co.cask.cdap.remote.dataset.table.TableDatasetApp.e17f57fc-87dc-43c3-9121-c444b738910d.jar2286959070416592102.tmp
10-Nov-2018 02:55:15 2018-11-10 02:55:15,745 - DEBUG [main:o.a.t.i.ApplicationBundler@218] - Copying temporary bundle to destination /tmp/IT-ITN5-DSTC514/junit8305427537416784334/junit6568736151411652798/co.cask.cdap.remote.dataset.table.TableDatasetApp.e17f57fc-87dc-43c3-9121-c444b738910d.jar (44604 bytes)
10-Nov-2018 02:55:15 2018-11-10 02:55:15,746 - DEBUG [main:o.a.t.i.ApplicationBundler@225] - Finished creating bundle at /tmp/IT-ITN5-DSTC514/junit8305427537416784334/junit6568736151411652798/co.cask.cdap.remote.dataset.table.TableDatasetApp.e17f57fc-87dc-43c3-9121-c444b738910d.jar
10-Nov-2018 02:55:15 2018-11-10 02:55:15,746 - DEBUG [main:o.a.t.i.ApplicationBundler@230] - Cleaned up local temporary file /tmp/IT-ITN5-DSTC514/co.cask.cdap.remote.dataset.table.TableDatasetApp.e17f57fc-87dc-43c3-9121-c444b738910d.jar2286959070416592102.tmp
10-Nov-2018 02:55:16 2018-11-10 02:55:16,636 - INFO  [main:c.c.c.t.AudiTestBase$1@125] - Making request: GET http://10.210.0.16:11015/v3/namespaces/default/apps/output-batchsink-invalid-nodepath-test/versions/-SNAPSHOT/services/DatasetService/status
10-Nov-2018 02:55:16 2018-11-10 02:55:16,727 - INFO  [main:c.c.c.t.AudiTestBase$1@134] - Received response: [200] Response Body: {"status":"STOPPED"}
10-Nov-2018 02:55:16 2018-11-10 02:55:16,728 - INFO  [main:c.c.c.t.AudiTestBase$1@125] - Making request: POST http://10.210.0.16:11015/v3/namespaces/default/apps/output-batchsink-invalid-nodepath-test/versions/-SNAPSHOT/services/DatasetService/start
10-Nov-2018 02:55:20 2018-11-10 02:55:20,080 - INFO  [main:c.c.c.t.AudiTestBase$1@134] - Received response: [200] Response Body:
10-Nov-2018 02:55:20 2018-11-10 02:55:20,080 - INFO  [main:c.c.c.t.AudiTestBase$1@125] - Making request: GET http://10.210.0.16:11015/v3/namespaces/default/apps/output-batchsink-invalid-nodepath-test/versions/-SNAPSHOT/services/DatasetService/runs?status=RUNNING&start=0&end=9223372036854775807&limit=2147483647
10-Nov-2018 02:55:20 2018-11-10 02:55:20,128 - INFO  [main:c.c.c.t.AudiTestBase$1@134] - Received response: [200] Response Body: []
10-Nov-2018 02:55:20 2018-11-10 02:55:20,179 - INFO  [main:c.c.c.t.AudiTestBase$1@125] - Making request: GET http://10.210.0.16:11015/v3/namespaces/default/apps/output-batchsink-invalid-nodepath-test/versions/-SNAPSHOT/services/DatasetService/runs?status=RUNNING&start=0&end=9223372036854775807&limit=2147483647
10-Nov-2018 02:55:20 2018-11-10 02:55:20,267 - INFO  [main:c.c.c.t.AudiTestBase$1@134] - Received response: [200] Response Body: []
10-Nov-2018 02:55:20 2018-11-10 02:55:20,318 - INFO  [main:c.c.c.t.AudiTestBase$1@125] - Making request: GET http://10.210.0.16:11015/v3/namespaces/default/apps/output-batchsink-invalid-nodepath-test/versions/-SNAPSHOT/services/DatasetService/runs?status=RUNNING&start=0&end=9223372036854775807&limit=2147483647
10-Nov-2018 02:55:20 2018-11-10 02:55:20,411 - INFO  [main:c.c.c.t.AudiTestBase$1@134] - Received response: [200] Response Body: []
10-Nov-2018 02:55:20 2018-11-10 02:55:20,462 - INFO  [main:c.c.c.t.AudiTestBase$1@125] - Making request: GET http://10.210.0.16:11015/v3/namespaces/default/apps/output-batchsink-invalid-nodepath-test/versions/-SNAPSHOT/services/DatasetService/runs?status=RUNNING&start=0&end=9223372036854775807&limit=2147483647
10-Nov-2018 02:55:20 2018-11-10 02:55:20,548 - INFO  [main:c.c.c.t.AudiTestBase$1@134] - Received response: [200] Response Body: []
10-Nov-2018 02:55:20 2018-11-10 02:55:20,599 - INFO  [main:c.c.c.t.AudiTestBase$1@125] - Making request: GET http://10.210.0.16:11015/v3/namespaces/default/apps/output-batchsink-invalid-nodepath-test/versions/-SNAPSHOT/services/DatasetService/runs?status=RUNNING&start=0&end=9223372036854775807&limit=2147483647
10-Nov-2018 02:55:20 2018-11-10 02:55:20,685 - INFO  [main:c.c.c.t.AudiTestBase$1@134] - Received response: [200] Response Body: []
10-Nov-2018 02:55:20 2018-11-10 02:55:20,735 - INFO  [main:c.c.c.t.AudiTestBase$1@125] - Making request: GET http://10.210.0.16:11015/v3/namespaces/default/apps/output-batchsink-invalid-nodepath-test/versions/-SNAPSHOT/services/DatasetService/runs?status=RUNNING&start=0&end=9223372036854775807&limit=2147483647
10-Nov-2018 02:55:20 2018-11-10 02:55:20,822 - INFO  [main:c.c.c.t.AudiTestBase$1@134] - Received response: [200] Response Body: []
10-Nov-2018 02:55:20 2018-11-10 02:55:20,872 - INFO  [main:c.c.c.t.AudiTestBase$1@125] - Making request: GET http://10.210.0.16:11015/v3/namespaces/default/apps/output-batchsink-invalid-nodepath-test/versions/-SNAPSHOT/services/DatasetService/runs?status=RUNNING&start=0&end=9223372036854775807&limit=2147483647
10-Nov-2018 02:55:20 2018-11-10 02:55:20,957 - INFO  [main:c.c.c.t.AudiTestBase$1@134] - Received response: [200] Response Body: []
10-Nov-2018 02:55:21 2018-11-10 02:55:21,008 - INFO  [main:c.c.c.t.AudiTestBase$1@125] - Making request: GET http://10.210.0.16:11015/v3/namespaces/default/apps/output-batchsink-invalid-nodepath-test/versions/-SNAPSHOT/services/DatasetService/runs?status=RUNNING&start=0&end=9223372036854775807&limit=2147483647
10-Nov-2018 02:55:21 2018-11-10 02:55:21,094 - INFO  [main:c.c.c.t.AudiTestBase$1@134] - Received response: [200] Response Body: []
10-Nov-2018 02:55:21 2018-11-10 02:55:21,145 - INFO  [main:c.c.c.t.AudiTestBase$1@125] - Making request: GET http://10.210.0.16:11015/v3/namespaces/default/apps/output-batchsink-invalid-nodepath-test/versions/-SNAPSHOT/services/DatasetService/runs?status=RUNNING&start=0&end=9223372036854775807&limit=2147483647
10-Nov-2018 02:55:21 2018-11-10 02:55:21,231 - INFO  [main:c.c.c.t.AudiTestBase$1@134] - Received response: [200] Response Body: []
10-Nov-2018 02:55:21 2018-11-10 02:55:21,281 - INFO  [main:c.c.c.t.AudiTestBase$1@125] - Making request: GET http://10.210.0.16:11015/v3/namespaces/default/apps/output-batchsink-invalid-nodepath-test/versions/-SNAPSHOT/services/DatasetService/runs?status=RUNNING&start=0&end=9223372036854775807&limit=2147483647
10-Nov-2018 02:55:21 2018-11-10 02:55:21,383 - INFO  [main:c.c.c.t.AudiTestBase$1@134] - Received response: [200] Response Body: []
10-Nov-2018 02:55:21 2018-11-10 02:55:21,434 - INFO  [main:c.c.c.t.AudiTestBase$1@125] - Making request: GET http://10.210.0.16:11015/v3/namespaces/default/apps/output-batchsink-invalid-nodepath-test/versions/-SNAPSHOT/services/DatasetService/runs?status=RUNNING&start=0&end=9223372036854775807&limit=2147483647
10-Nov-2018 02:55:21 2018-11-10 02:55:21,521 - INFO  [main:c.c.c.t.AudiTestBase$1@134] - Received response: [200] Response Body: []
10-Nov-2018 02:55:21 2018-11-10 02:55:21,571 - INFO  [main:c.c.c.t.AudiTestBase$1@125] - Making request: GET http://10.210.0.16:11015/v3/namespaces/default/apps/output-batchsink-invalid-nodepath-test/versions/-SNAPSHOT/services/DatasetService/runs?status=RUNNING&start=0&end=9223372036854775807&limit=2147483647
10-Nov-2018 02:55:21 2018-11-10 02:55:21,657 - INFO  [main:c.c.c.t.AudiTestBase$1@134] - Received response: [200] Response Body: []
10-Nov-2018 02:55:21 2018-11-10 02:55:21,708 - INFO  [main:c.c.c.t.AudiTestBase$1@125] - Making request: GET http://10.210.0.16:11015/v3/namespaces/default/apps/output-batchsink-invalid-nodepath-test/versions/-SNAPSHOT/services/DatasetService/runs?status=RUNNING&start=0&end=9223372036854775807&limit=2147483647
10-Nov-2018 02:55:21 2018-11-10 02:55:21,794 - INFO  [main:c.c.c.t.AudiTestBase$1@134] - Received response: [200] Response Body: []
10-Nov-2018 02:55:21 2018-11-10 02:55:21,845 - INFO  [main:c.c.c.t.AudiTestBase$1@125] - Making request: GET http://10.210.0.16:11015/v3/namespaces/default/apps/output-batchsink-invalid-nodepath-test/versions/-SNAPSHOT/services/DatasetService/runs?status=RUNNING&start=0&end=9223372036854775807&limit=2147483647
10-Nov-2018 02:55:21 2018-11-10 02:55:21,930 - INFO  [main:c.c.c.t.AudiTestBase$1@134] - Received response: [200] Response Body: []
10-Nov-2018 02:55:21 2018-11-10 02:55:21,981 - INFO  [main:c.c.c.t.AudiTestBase$1@125] - Making request: GET http://10.210.0.16:11015/v3/namespaces/default/apps/output-batchsink-invalid-nodepath-test/versions/-SNAPSHOT/services/DatasetService/runs?status=RUNNING&start=0&end=9223372036854775807&limit=2147483647
10-Nov-2018 02:55:22 2018-11-10 02:55:22,067 - INFO  [main:c.c.c.t.AudiTestBase$1@134] - Received response: [200] Response Body: []
10-Nov-2018 02:55:22 2018-11-10 02:55:22,118 - INFO  [main:c.c.c.t.AudiTestBase$1@125] - Making request: GET http://10.210.0.16:11015/v3/namespaces/default/apps/output-batchsink-invalid-nodepath-test/versions/-SNAPSHOT/services/DatasetService/runs?status=RUNNING&start=0&end=9223372036854775807&limit=2147483647
10-Nov-2018 02:55:22 2018-11-10 02:55:22,213 - INFO  [main:c.c.c.t.AudiTestBase$1@134] - Received response: [200] Response Body: []
10-Nov-2018 02:55:22 2018-11-10 02:55:22,264 - INFO  [main:c.c.c.t.AudiTestBase$1@125] - Making request: GET http://10.210.0.16:11015/v3/namespaces/default/apps/output-batchsink-invalid-nodepath-test/versions/-SNAPSHOT/services/DatasetService/runs?status=RUNNING&start=0&end=9223372036854775807&limit=2147483647
10-Nov-2018 02:55:22 2018-11-10 02:55:22,351 - INFO  [main:c.c.c.t.AudiTestBase$1@134] - Received response: [200] Response Body: []
10-Nov-2018 02:55:22 2018-11-10 02:55:22,402 - INFO  [main:c.c.c.t.AudiTestBase$1@125] - Making request: GET http://10.210.0.16:11015/v3/namespaces/default/apps/output-batchsink-invalid-nodepath-test/versions/-SNAPSHOT/services/DatasetService/runs?status=RUNNING&start=0&end=9223372036854775807&limit=2147483647
10-Nov-2018 02:55:22 2018-11-10 02:55:22,488 - INFO  [main:c.c.c.t.AudiTestBase$1@134] - Received response: [200] Response Body: []
10-Nov-2018 02:55:22 2018-11-10 02:55:22,539 - INFO  [main:c.c.c.t.AudiTestBase$1@125] - Making request: GET http://10.210.0.16:11015/v3/namespaces/default/apps/output-batchsink-invalid-nodepath-test/versions/-SNAPSHOT/services/DatasetService/runs?status=RUNNING&start=0&end=9223372036854775807&limit=2147483647
10-Nov-2018 02:55:22 2018-11-10 02:55:22,625 - INFO  [main:c.c.c.t.AudiTestBase$1@134] - Received response: [200] Response Body: []
10-Nov-2018 02:55:22 2018-11-10 02:55:22,676 - INFO  [main:c.c.c.t.AudiTestBase$1@125] - Making request: GET http://10.210.0.16:11015/v3/namespaces/default/apps/output-batchsink-invalid-nodepath-test/versions/-SNAPSHOT/services/DatasetService/runs?status=RUNNING&start=0&end=9223372036854775807&limit=2147483647
10-Nov-2018 02:55:22 2018-11-10 02:55:22,765 - INFO  [main:c.c.c.t.AudiTestBase$1@134] - Received response: [200] Response Body: []
10-Nov-2018 02:55:22 2018-11-10 02:55:22,816 - INFO  [main:c.c.c.t.AudiTestBase$1@125] - Making request: GET http://10.210.0.16:11015/v3/namespaces/default/apps/output-batchsink-invalid-nodepath-test/versions/-SNAPSHOT/services/DatasetService/runs?status=RUNNING&start=0&end=9223372036854775807&limit=2147483647
10-Nov-2018 02:55:22 2018-11-10 02:55:22,902 - INFO  [main:c.c.c.t.AudiTestBase$1@134] - Received response: [200] Response Body: []
10-Nov-2018 02:55:22 2018-11-10 02:55:22,952 - INFO  [main:c.c.c.t.AudiTestBase$1@125] - Making request: GET http://10.210.0.16:11015/v3/namespaces/default/apps/output-batchsink-invalid-nodepath-test/versions/-SNAPSHOT/services/DatasetService/runs?status=RUNNING&start=0&end=9223372036854775807&limit=2147483647
10-Nov-2018 02:55:23 2018-11-10 02:55:23,040 - INFO  [main:c.c.c.t.AudiTestBase$1@134] - Received response: [200] Response Body: []
10-Nov-2018 02:55:23 2018-11-10 02:55:23,091 - INFO  [main:c.c.c.t.AudiTestBase$1@125] - Making request: GET http://10.210.0.16:11015/v3/namespaces/default/apps/output-batchsink-invalid-nodepath-test/versions/-SNAPSHOT/services/DatasetService/runs?status=RUNNING&start=0&end=9223372036854775807&limit=2147483647
10-Nov-2018 02:55:23 2018-11-10 02:55:23,178 - INFO  [main:c.c.c.t.AudiTestBase$1@134] - Received response: [200] Response Body: []
10-Nov-2018 02:55:23 2018-11-10 02:55:23,229 - INFO  [main:c.c.c.t.AudiTestBase$1@125] - Making request: GET http://10.210.0.16:11015/v3/namespaces/default/apps/output-batchsink-invalid-nodepath-test/versions/-SNAPSHOT/services/DatasetService/runs?status=RUNNING&start=0&end=9223372036854775807&limit=2147483647
10-Nov-2018 02:55:23 2018-11-10 02:55:23,315 - INFO  [main:c.c.c.t.AudiTestBase$1@134] - Received response: [200] Response Body: []
10-Nov-2018 02:55:23 2018-11-10 02:55:23,365 - INFO  [main:c.c.c.t.AudiTestBase$1@125] - Making request: GET http://10.210.0.16:11015/v3/namespaces/default/apps/output-batchsink-invalid-nodepath-test/versions/-SNAPSHOT/services/DatasetService/runs?status=RUNNING&start=0&end=9223372036854775807&limit=2147483647
10-Nov-2018 02:55:23 2018-11-10 02:55:23,452 - INFO  [main:c.c.c.t.AudiTestBase$1@134] - Received response: [200] Response Body: []
10-Nov-2018 02:55:23 2018-11-10 02:55:23,503 - INFO  [main:c.c.c.t.AudiTestBase$1@125] - Making request: GET http://10.210.0.16:11015/v3/namespaces/default/apps/output-batchsink-invalid-nodepath-test/versions/-SNAPSHOT/services/DatasetService/runs?status=RUNNING&start=0&end=9223372036854775807&limit=2147483647
10-Nov-2018 02:55:23 2018-11-10 02:55:23,589 - INFO  [main:c.c.c.t.AudiTestBase$1@134] - Received response: [200] Response Body: []
10-Nov-2018 02:55:23 2018-11-10 02:55:23,640 - INFO  [main:c.c.c.t.AudiTestBase$1@125] - Making request: GET http://10.210.0.16:11015/v3/namespaces/default/apps/output-batchsink-invalid-nodepath-test/versions/-SNAPSHOT/services/DatasetService/runs?status=RUNNING&start=0&end=9223372036854775807&limit=2147483647
10-Nov-2018 02:55:23 2018-11-10 02:55:23,727 - INFO  [main:c.c.c.t.AudiTestBase$1@134] - Received response: [200] Response Body: []
10-Nov-2018 02:55:23 2018-11-10 02:55:23,777 - INFO  [main:c.c.c.t.AudiTestBase$1@125] - Making request: GET http://10.210.0.16:11015/v3/namespaces/default/apps/output-batchsink-invalid-nodepath-test/versions/-SNAPSHOT/services/DatasetService/runs?status=RUNNING&start=0&end=9223372036854775807&limit=2147483647
10-Nov-2018 02:55:23 2018-11-10 02:55:23,864 - INFO  [main:c.c.c.t.AudiTestBase$1@134] - Received response: [200] Response Body: []
10-Nov-2018 02:55:23 2018-11-10 02:55:23,915 - INFO  [main:c.c.c.t.AudiTestBase$1@125] - Making request: GET http://10.210.0.16:11015/v3/namespaces/default/apps/output-batchsink-invalid-nodepath-test/versions/-SNAPSHOT/services/DatasetService/runs?status=RUNNING&start=0&end=9223372036854775807&limit=2147483647
10-Nov-2018 02:55:24 2018-11-10 02:55:24,002 - INFO  [main:c.c.c.t.AudiTestBase$1@134] - Received response: [200] Response Body: []
10-Nov-2018 02:55:24 2018-11-10 02:55:24,053 - INFO  [main:c.c.c.t.AudiTestBase$1@125] - Making request: GET http://10.210.0.16:11015/v3/namespaces/default/apps/output-batchsink-invalid-nodepath-test/versions/-SNAPSHOT/services/DatasetService/runs?status=RUNNING&start=0&end=9223372036854775807&limit=2147483647
10-Nov-2018 02:55:24 2018-11-10 02:55:24,139 - INFO  [main:c.c.c.t.AudiTestBase$1@134] - Received response: [200] Response Body: []
10-Nov-2018 02:55:24 2018-11-10 02:55:24,190 - INFO  [main:c.c.c.t.AudiTestBase$1@125] - Making request: GET http://10.210.0.16:11015/v3/namespaces/default/apps/output-batchsink-invalid-nodepath-test/versions/-SNAPSHOT/services/DatasetService/runs?status=RUNNING&start=0&end=9223372036854775807&limit=2147483647
10-Nov-2018 02:55:24 2018-11-10 02:55:24,277 - INFO  [main:c.c.c.t.AudiTestBase$1@134] - Received response: [200] Response Body: []
10-Nov-2018 02:55:24 2018-11-10 02:55:24,328 - INFO  [main:c.c.c.t.AudiTestBase$1@125] - Making request: GET http://10.210.0.16:11015/v3/namespaces/default/apps/output-batchsink-invalid-nodepath-test/versions/-SNAPSHOT/services/DatasetService/runs?status=RUNNING&start=0&end=9223372036854775807&limit=2147483647
10-Nov-2018 02:55:24 2018-11-10 02:55:24,420 - INFO  [main:c.c.c.t.AudiTestBase$1@134] - Received response: [200] Response Body: []
10-Nov-2018 02:55:24 2018-11-10 02:55:24,471 - INFO  [main:c.c.c.t.AudiTestBase$1@125] - Making request: GET http://10.210.0.16:11015/v3/namespaces/default/apps/output-batchsink-invalid-nodepath-test/versions/-SNAPSHOT/services/DatasetService/runs?status=RUNNING&start=0&end=9223372036854775807&limit=2147483647
10-Nov-2018 02:55:24 2018-11-10 02:55:24,558 - INFO  [main:c.c.c.t.AudiTestBase$1@134] - Received response: [200] Response Body: []
10-Nov-2018 02:55:24 2018-11-10 02:55:24,609 - INFO  [main:c.c.c.t.AudiTestBase$1@125] - Making request: GET http://10.210.0.16:11015/v3/namespaces/default/apps/output-batchsink-invalid-nodepath-test/versions/-SNAPSHOT/services/DatasetService/runs?status=RUNNING&start=0&end=9223372036854775807&limit=2147483647
10-Nov-2018 02:55:24 2018-11-10 02:55:24,697 - INFO  [main:c.c.c.t.AudiTestBase$1@134] - Received response: [200] Response Body: []
10-Nov-2018 02:55:24 2018-11-10 02:55:24,748 - INFO  [main:c.c.c.t.AudiTestBase$1@125] - Making request: GET http://10.210.0.16:11015/v3/namespaces/default/apps/output-batchsink-invalid-nodepath-test/versions/-SNAPSHOT/services/DatasetService/runs?status=RUNNING&start=0&end=9223372036854775807&limit=2147483647
10-Nov-2018 02:55:24 2018-11-10 02:55:24,835 - INFO  [main:c.c.c.t.AudiTestBase$1@134] - Received response: [200] Response Body: []
10-Nov-2018 02:55:24 2018-11-10 02:55:24,885 - INFO  [main:c.c.c.t.AudiTestBase$1@125] - Making request: GET http://10.210.0.16:11015/v3/namespaces/default/apps/output-batchsink-invalid-nodepath-test/versions/-SNAPSHOT/services/DatasetService/runs?status=RUNNING&start=0&end=9223372036854775807&limit=2147483647
10-Nov-2018 02:55:24 2018-11-10 02:55:24,974 - INFO  [main:c.c.c.t.AudiTestBase$1@134] - Received response: [200] Response Body: []
10-Nov-2018 02:55:25 2018-11-10 02:55:25,024 - INFO  [main:c.c.c.t.AudiTestBase$1@125] - Making request: GET http://10.210.0.16:11015/v3/namespaces/default/apps/output-batchsink-invalid-nodepath-test/versions/-SNAPSHOT/services/DatasetService/runs?status=RUNNING&start=0&end=9223372036854775807&limit=2147483647
10-Nov-2018 02:55:25 2018-11-10 02:55:25,113 - INFO  [main:c.c.c.t.AudiTestBase$1@134] - Received response: [200] Response Body: []
10-Nov-2018 02:55:25 2018-11-10 02:55:25,164 - INFO  [main:c.c.c.t.AudiTestBase$1@125] - Making request: GET http://10.210.0.16:11015/v3/namespaces/default/apps/output-batchsink-invalid-nodepath-test/versions/-SNAPSHOT/services/DatasetService/runs?status=RUNNING&start=0&end=9223372036854775807&limit=2147483647
10-Nov-2018 02:55:25 2018-11-10 02:55:25,251 - INFO  [main:c.c.c.t.AudiTestBase$1@134] - Received response: [200] Response Body: []
10-Nov-2018 02:55:25 2018-11-10 02:55:25,302 - INFO  [main:c.c.c.t.AudiTestBase$1@125] - Making request: GET http://10.210.0.16:11015/v3/namespaces/default/apps/output-batchsink-invalid-nodepath-test/versions/-SNAPSHOT/services/DatasetService/runs?status=RUNNING&start=0&end=9223372036854775807&limit=2147483647
10-Nov-2018 02:55:25 2018-11-10 02:55:25,392 - INFO  [main:c.c.c.t.AudiTestBase$1@134] - Received response: [200] Response Body: []
10-Nov-2018 02:55:25 2018-11-10 02:55:25,443 - INFO  [main:c.c.c.t.AudiTestBase$1@125] - Making request: GET http://10.210.0.16:11015/v3/namespaces/default/apps/output-batchsink-invalid-nodepath-test/versions/-SNAPSHOT/services/DatasetService/runs?status=RUNNING&start=0&end=9223372036854775807&limit=2147483647
10-Nov-2018 02:55:25 2018-11-10 02:55:25,530 - INFO  [main:c.c.c.t.AudiTestBase$1@134] - Received response: [200] Response Body: []
10-Nov-2018 02:55:25 2018-11-10 02:55:25,581 - INFO  [main:c.c.c.t.AudiTestBase$1@125] - Making request: GET http://10.210.0.16:11015/v3/namespaces/default/apps/output-batchsink-invalid-nodepath-test/versions/-SNAPSHOT/services/DatasetService/runs?status=RUNNING&start=0&end=9223372036854775807&limit=2147483647
10-Nov-2018 02:55:25 2018-11-10 02:55:25,671 - INFO  [main:c.c.c.t.AudiTestBase$1@134] - Received response: [200] Response Body: []
10-Nov-2018 02:55:25 2018-11-10 02:55:25,722 - INFO  [main:c.c.c.t.AudiTestBase$1@125] - Making request: GET http://10.210.0.16:11015/v3/namespaces/default/apps/output-batchsink-invalid-nodepath-test/versions/-SNAPSHOT/services/DatasetService/runs?status=RUNNING&start=0&end=9223372036854775807&limit=2147483647
10-Nov-2018 02:55:25 2018-11-10 02:55:25,810 - INFO  [main:c.c.c.t.AudiTestBase$1@134] - Received response: [200] Response Body: []
10-Nov-2018 02:55:25 2018-11-10 02:55:25,860 - INFO  [main:c.c.c.t.AudiTestBase$1@125] - Making request: GET http://10.210.0.16:11015/v3/namespaces/default/apps/output-batchsink-invalid-nodepath-test/versions/-SNAPSHOT/services/DatasetService/runs?status=RUNNING&start=0&end=9223372036854775807&limit=2147483647
10-Nov-2018 02:55:25 2018-11-10 02:55:25,947 - INFO  [main:c.c.c.t.AudiTestBase$1@134] - Received response: [200] Response Body: []
10-Nov-2018 02:55:25 2018-11-10 02:55:25,998 - INFO  [main:c.c.c.t.AudiTestBase$1@125] - Making request: GET http://10.210.0.16:11015/v3/namespaces/default/apps/output-batchsink-invalid-nodepath-test/versions/-SNAPSHOT/services/DatasetService/runs?status=RUNNING&start=0&end=9223372036854775807&limit=2147483647
10-Nov-2018 02:55:26 2018-11-10 02:55:26,085 - INFO  [main:c.c.c.t.AudiTestBase$1@134] - Received response: [200] Response Body: []
10-Nov-2018 02:55:26 2018-11-10 02:55:26,136 - INFO  [main:c.c.c.t.AudiTestBase$1@125] - Making request: GET http://10.210.0.16:11015/v3/namespaces/default/apps/output-batchsink-invalid-nodepath-test/versions/-SNAPSHOT/services/DatasetService/runs?status=RUNNING&start=0&end=9223372036854775807&limit=2147483647
10-Nov-2018 02:55:26 2018-11-10 02:55:26,223 - INFO  [main:c.c.c.t.AudiTestBase$1@134] - Received response: [200] Response Body: []
10-Nov-2018 02:55:26 2018-11-10 02:55:26,273 - INFO  [main:c.c.c.t.AudiTestBase$1@125] - Making request: GET http://10.210.0.16:11015/v3/namespaces/default/apps/output-batchsink-invalid-nodepath-test/versions/-SNAPSHOT/services/DatasetService/runs?status=RUNNING&start=0&end=9223372036854775807&limit=2147483647
10-Nov-2018 02:55:26 2018-11-10 02:55:26,360 - INFO  [main:c.c.c.t.AudiTestBase$1@134] - Received response: [200] Response Body: []
10-Nov-2018 02:55:26 2018-11-10 02:55:26,411 - INFO  [main:c.c.c.t.AudiTestBase$1@125] - Making request: GET http://10.210.0.16:11015/v3/namespaces/default/apps/output-batchsink-invalid-nodepath-test/versions/-SNAPSHOT/services/DatasetService/runs?status=RUNNING&start=0&end=9223372036854775807&limit=2147483647
10-Nov-2018 02:55:26 2018-11-10 02:55:26,498 - INFO  [main:c.c.c.t.AudiTestBase$1@134] - Received response: [200] Response Body: []
10-Nov-2018 02:55:26 2018-11-10 02:55:26,549 - INFO  [main:c.c.c.t.AudiTestBase$1@125] - Making request: GET http://10.210.0.16:11015/v3/namespaces/default/apps/output-batchsink-invalid-nodepath-test/versions/-SNAPSHOT/services/DatasetService/runs?status=RUNNING&start=0&end=9223372036854775807&limit=2147483647
10-Nov-2018 02:55:26 2018-11-10 02:55:26,636 - INFO  [main:c.c.c.t.AudiTestBase$1@134] - Received response: [200] Response Body: []
10-Nov-2018 02:55:26 2018-11-10 02:55:26,687 - INFO  [main:c.c.c.t.AudiTestBase$1@125] - Making request: GET http://10.210.0.16:11015/v3/namespaces/default/apps/output-batchsink-invalid-nodepath-test/versions/-SNAPSHOT/services/DatasetService/runs?status=RUNNING&start=0&end=9223372036854775807&limit=2147483647
10-Nov-2018 02:55:26 2018-11-10 02:55:26,774 - INFO  [main:c.c.c.t.AudiTestBase$1@134] - Received response: [200] Response Body: []
10-Nov-2018 02:55:26 2018-11-10 02:55:26,824 - INFO  [main:c.c.c.t.AudiTestBase$1@125] - Making request: GET http://10.210.0.16:11015/v3/namespaces/default/apps/output-batchsink-invalid-nodepath-test/versions/-SNAPSHOT/services/DatasetService/runs?status=RUNNING&start=0&end=9223372036854775807&limit=2147483647
10-Nov-2018 02:55:26 2018-11-10 02:55:26,912 - INFO  [main:c.c.c.t.AudiTestBase$1@134] - Received response: [200] Response Body: []
10-Nov-2018 02:55:26 2018-11-10 02:55:26,962 - INFO  [main:c.c.c.t.AudiTestBase$1@125] - Making request: GET http://10.210.0.16:11015/v3/namespaces/default/apps/output-batchsink-invalid-nodepath-test/versions/-SNAPSHOT/services/DatasetService/runs?status=RUNNING&start=0&end=9223372036854775807&limit=2147483647
10-Nov-2018 02:55:27 2018-11-10 02:55:27,049 - INFO  [main:c.c.c.t.AudiTestBase$1@134] - Received response: [200] Response Body: []
10-Nov-2018 02:55:27 2018-11-10 02:55:27,100 - INFO  [main:c.c.c.t.AudiTestBase$1@125] - Making request: GET http://10.210.0.16:11015/v3/namespaces/default/apps/output-batchsink-invalid-nodepath-test/versions/-SNAPSHOT/services/DatasetService/runs?status=RUNNING&start=0&end=9223372036854775807&limit=2147483647
10-Nov-2018 02:55:27 2018-11-10 02:55:27,188 - INFO  [main:c.c.c.t.AudiTestBase$1@134] - Received response: [200] Response Body: []
10-Nov-2018 02:55:27 2018-11-10 02:55:27,238 - INFO  [main:c.c.c.t.AudiTestBase$1@125] - Making request: GET http://10.210.0.16:11015/v3/namespaces/default/apps/output-batchsink-invalid-nodepath-test/versions/-SNAPSHOT/services/DatasetService/runs?status=RUNNING&start=0&end=9223372036854775807&limit=2147483647
10-Nov-2018 02:55:27 2018-11-10 02:55:27,325 - INFO  [main:c.c.c.t.AudiTestBase$1@134] - Received response: [200] Response Body: []
10-Nov-2018 02:55:27 2018-11-10 02:55:27,376 - INFO  [main:c.c.c.t.AudiTestBase$1@125] - Making request: GET http://10.210.0.16:11015/v3/namespaces/default/apps/output-batchsink-invalid-nodepath-test/versions/-SNAPSHOT/services/DatasetService/runs?status=RUNNING&start=0&end=9223372036854775807&limit=2147483647
10-Nov-2018 02:55:27 2018-11-10 02:55:27,462 - INFO  [main:c.c.c.t.AudiTestBase$1@134] - Received response: [200] Response Body: []
10-Nov-2018 02:55:27 2018-11-10 02:55:27,513 - INFO  [main:c.c.c.t.AudiTestBase$1@125] - Making request: GET http://10.210.0.16:11015/v3/namespaces/default/apps/output-batchsink-invalid-nodepath-test/versions/-SNAPSHOT/services/DatasetService/runs?status=RUNNING&start=0&end=9223372036854775807&limit=2147483647
10-Nov-2018 02:55:27 2018-11-10 02:55:27,603 - INFO  [main:c.c.c.t.AudiTestBase$1@134] - Received response: [200] Response Body: []
10-Nov-2018 02:55:27 2018-11-10 02:55:27,654 - INFO  [main:c.c.c.t.AudiTestBase$1@125] - Making request: GET http://10.210.0.16:11015/v3/namespaces/default/apps/output-batchsink-invalid-nodepath-test/versions/-SNAPSHOT/services/DatasetService/runs?status=RUNNING&start=0&end=9223372036854775807&limit=2147483647
10-Nov-2018 02:55:27 2018-11-10 02:55:27,741 - INFO  [main:c.c.c.t.AudiTestBase$1@134] - Received response: [200] Response Body: []
10-Nov-2018 02:55:27 2018-11-10 02:55:27,791 - INFO  [main:c.c.c.t.AudiTestBase$1@125] - Making request: GET http://10.210.0.16:11015/v3/namespaces/default/apps/output-batchsink-invalid-nodepath-test/versions/-SNAPSHOT/services/DatasetService/runs?status=RUNNING&start=0&end=9223372036854775807&limit=2147483647
10-Nov-2018 02:55:27 2018-11-10 02:55:27,879 - INFO  [main:c.c.c.t.AudiTestBase$1@134] - Received response: [200] Response Body: []
10-Nov-2018 02:55:27 2018-11-10 02:55:27,930 - INFO  [main:c.c.c.t.AudiTestBase$1@125] - Making request: GET http://10.210.0.16:11015/v3/namespaces/default/apps/output-batchsink-invalid-nodepath-test/versions/-SNAPSHOT/services/DatasetService/runs?status=RUNNING&start=0&end=9223372036854775807&limit=2147483647
10-Nov-2018 02:55:28 2018-11-10 02:55:28,017 - INFO  [main:c.c.c.t.AudiTestBase$1@134] - Received response: [200] Response Body: []
10-Nov-2018 02:55:28 2018-11-10 02:55:28,068 - INFO  [main:c.c.c.t.AudiTestBase$1@125] - Making request: GET http://10.210.0.16:11015/v3/namespaces/default/apps/output-batchsink-invalid-nodepath-test/versions/-SNAPSHOT/services/DatasetService/runs?status=RUNNING&start=0&end=9223372036854775807&limit=2147483647
10-Nov-2018 02:55:28 2018-11-10 02:55:28,155 - INFO  [main:c.c.c.t.AudiTestBase$1@134] - Received response: [200] Response Body: []
10-Nov-2018 02:55:28 2018-11-10 02:55:28,205 - INFO  [main:c.c.c.t.AudiTestBase$1@125] - Making request: GET http://10.210.0.16:11015/v3/namespaces/default/apps/output-batchsink-invalid-nodepath-test/versions/-SNAPSHOT/services/DatasetService/runs?status=RUNNING&start=0&end=9223372036854775807&limit=2147483647
10-Nov-2018 02:55:28 2018-11-10 02:55:28,291 - INFO  [main:c.c.c.t.AudiTestBase$1@134] - Received response: [200] Response Body: []
10-Nov-2018 02:55:28 2018-11-10 02:55:28,342 - INFO  [main:c.c.c.t.AudiTestBase$1@125] - Making request: GET http://10.210.0.16:11015/v3/namespaces/default/apps/output-batchsink-invalid-nodepath-test/versions/-SNAPSHOT/services/DatasetService/runs?status=RUNNING&start=0&end=9223372036854775807&limit=2147483647
10-Nov-2018 02:55:28 2018-11-10 02:55:28,430 - INFO  [main:c.c.c.t.AudiTestBase$1@134] - Received response: [200] Response Body: []
10-Nov-2018 02:55:28 2018-11-10 02:55:28,481 - INFO  [main:c.c.c.t.AudiTestBase$1@125] - Making request: GET http://10.210.0.16:11015/v3/namespaces/default/apps/output-batchsink-invalid-nodepath-test/versions/-SNAPSHOT/services/DatasetService/runs?status=RUNNING&start=0&end=9223372036854775807&limit=2147483647
10-Nov-2018 02:55:28 2018-11-10 02:55:28,567 - INFO  [main:c.c.c.t.AudiTestBase$1@134] - Received response: [200] Response Body: []
10-Nov-2018 02:55:28 2018-11-10 02:55:28,618 - INFO  [main:c.c.c.t.AudiTestBase$1@125] - Making request: GET http://10.210.0.16:11015/v3/namespaces/default/apps/output-batchsink-invalid-nodepath-test/versions/-SNAPSHOT/services/DatasetService/runs?status=RUNNING&start=0&end=9223372036854775807&limit=2147483647
10-Nov-2018 02:55:28 2018-11-10 02:55:28,707 - INFO  [main:c.c.c.t.AudiTestBase$1@134] - Received response: [200] Response Body: []
10-Nov-2018 02:55:28 2018-11-10 02:55:28,758 - INFO  [main:c.c.c.t.AudiTestBase$1@125] - Making request: GET http://10.210.0.16:11015/v3/namespaces/default/apps/output-batchsink-invalid-nodepath-test/versions/-SNAPSHOT/services/DatasetService/runs?status=RUNNING&start=0&end=9223372036854775807&limit=2147483647
10-Nov-2018 02:55:28 2018-11-10 02:55:28,844 - INFO  [main:c.c.c.t.AudiTestBase$1@134] - Received response: [200] Response Body: []
10-Nov-2018 02:55:28 2018-11-10 02:55:28,895 - INFO  [main:c.c.c.t.AudiTestBase$1@125] - Making request: GET http://10.210.0.16:11015/v3/namespaces/default/apps/output-batchsink-invalid-nodepath-test/versions/-SNAPSHOT/services/DatasetService/runs?status=RUNNING&start=0&end=9223372036854775807&limit=2147483647
10-Nov-2018 02:55:28 2018-11-10 02:55:28,981 - INFO  [main:c.c.c.t.AudiTestBase$1@134] - Received response: [200] Response Body: []
10-Nov-2018 02:55:29 2018-11-10 02:55:29,032 - INFO  [main:c.c.c.t.AudiTestBase$1@125] - Making request: GET http://10.210.0.16:11015/v3/namespaces/default/apps/output-batchsink-invalid-nodepath-test/versions/-SNAPSHOT/services/DatasetService/runs?status=RUNNING&start=0&end=9223372036854775807&limit=2147483647
10-Nov-2018 02:55:29 2018-11-10 02:55:29,119 - INFO  [main:c.c.c.t.AudiTestBase$1@134] - Received response: [200] Response Body: []
10-Nov-2018 02:55:29 2018-11-10 02:55:29,170 - INFO  [main:c.c.c.t.AudiTestBase$1@125] - Making request: GET http://10.210.0.16:11015/v3/namespaces/default/apps/output-batchsink-invalid-nodepath-test/versions/-SNAPSHOT/services/DatasetService/runs?status=RUNNING&start=0&end=9223372036854775807&limit=2147483647
10-Nov-2018 02:55:29 2018-11-10 02:55:29,256 - INFO  [main:c.c.c.t.AudiTestBase$1@134] - Received response: [200] Response Body: []
10-Nov-2018 02:55:29 2018-11-10 02:55:29,307 - INFO  [main:c.c.c.t.AudiTestBase$1@125] - Making request: GET http://10.210.0.16:11015/v3/namespaces/default/apps/output-batchsink-invalid-nodepath-test/versions/-SNAPSHOT/services/DatasetService/runs?status=RUNNING&start=0&end=9223372036854775807&limit=2147483647
10-Nov-2018 02:55:29 2018-11-10 02:55:29,391 - INFO  [main:c.c.c.t.AudiTestBase$1@134] - Received response: [200] Response Body: []
10-Nov-2018 02:55:29 2018-11-10 02:55:29,442 - INFO  [main:c.c.c.t.AudiTestBase$1@125] - Making request: GET http://10.210.0.16:11015/v3/namespaces/default/apps/output-batchsink-invalid-nodepath-test/versions/-SNAPSHOT/services/DatasetService/runs?status=RUNNING&start=0&end=9223372036854775807&limit=2147483647
10-Nov-2018 02:55:29 2018-11-10 02:55:29,532 - INFO  [main:c.c.c.t.AudiTestBase$1@134] - Received response: [200] Response Body: []
10-Nov-2018 02:55:29 2018-11-10 02:55:29,583 - INFO  [main:c.c.c.t.AudiTestBase$1@125] - Making request: GET http://10.210.0.16:11015/v3/namespaces/default/apps/output-batchsink-invalid-nodepath-test/versions/-SNAPSHOT/services/DatasetService/runs?status=RUNNING&start=0&end=9223372036854775807&limit=2147483647
10-Nov-2018 02:55:29 2018-11-10 02:55:29,670 - INFO  [main:c.c.c.t.AudiTestBase$1@134] - Received response: [200] Response Body: []
10-Nov-2018 02:55:29 2018-11-10 02:55:29,721 - INFO  [main:c.c.c.t.AudiTestBase$1@125] - Making request: GET http://10.210.0.16:11015/v3/namespaces/default/apps/output-batchsink-invalid-nodepath-test/versions/-SNAPSHOT/services/DatasetService/runs?status=RUNNING&start=0&end=9223372036854775807&limit=2147483647
10-Nov-2018 02:55:29 2018-11-10 02:55:29,806 - INFO  [main:c.c.c.t.AudiTestBase$1@134] - Received response: [200] Response Body: []
10-Nov-2018 02:55:29 2018-11-10 02:55:29,857 - INFO  [main:c.c.c.t.AudiTestBase$1@125] - Making request: GET http://10.210.0.16:11015/v3/namespaces/default/apps/output-batchsink-invalid-nodepath-test/versions/-SNAPSHOT/services/DatasetService/runs?status=RUNNING&start=0&end=9223372036854775807&limit=2147483647
10-Nov-2018 02:55:29 2018-11-10 02:55:29,942 - INFO  [main:c.c.c.t.AudiTestBase$1@134] - Received response: [200] Response Body: []
10-Nov-2018 02:55:29 2018-11-10 02:55:29,993 - INFO  [main:c.c.c.t.AudiTestBase$1@125] - Making request: GET http://10.210.0.16:11015/v3/namespaces/default/apps/output-batchsink-invalid-nodepath-test/versions/-SNAPSHOT/services/DatasetService/runs?status=RUNNING&start=0&end=9223372036854775807&limit=2147483647
10-Nov-2018 02:55:30 2018-11-10 02:55:30,079 - INFO  [main:c.c.c.t.AudiTestBase$1@134] - Received response: [200] Response Body: []
10-Nov-2018 02:55:30 2018-11-10 02:55:30,130 - INFO  [main:c.c.c.t.AudiTestBase$1@125] - Making request: GET http://10.210.0.16:11015/v3/namespaces/default/apps/output-batchsink-invalid-nodepath-test/versions/-SNAPSHOT/services/DatasetService/runs?status=RUNNING&start=0&end=9223372036854775807&limit=2147483647
10-Nov-2018 02:55:30 2018-11-10 02:55:30,215 - INFO  [main:c.c.c.t.AudiTestBase$1@134] - Received response: [200] Response Body: []
10-Nov-2018 02:55:30 2018-11-10 02:55:30,266 - INFO  [main:c.c.c.t.AudiTestBase$1@125] - Making request: GET http://10.210.0.16:11015/v3/namespaces/default/apps/output-batchsink-invalid-nodepath-test/versions/-SNAPSHOT/services/DatasetService/runs?status=RUNNING&start=0&end=9223372036854775807&limit=2147483647
10-Nov-2018 02:55:30 2018-11-10 02:55:30,351 - INFO  [main:c.c.c.t.AudiTestBase$1@134] - Received response: [200] Response Body: []
10-Nov-2018 02:55:30 2018-11-10 02:55:30,402 - INFO  [main:c.c.c.t.AudiTestBase$1@125] - Making request: GET http://10.210.0.16:11015/v3/namespaces/default/apps/output-batchsink-invalid-nodepath-test/versions/-SNAPSHOT/services/DatasetService/runs?status=RUNNING&start=0&end=9223372036854775807&limit=2147483647
10-Nov-2018 02:55:30 2018-11-10 02:55:30,489 - INFO  [main:c.c.c.t.AudiTestBase$1@134] - Received response: [200] Response Body: []
10-Nov-2018 02:55:30 2018-11-10 02:55:30,540 - INFO  [main:c.c.c.t.AudiTestBase$1@125] - Making request: GET http://10.210.0.16:11015/v3/namespaces/default/apps/output-batchsink-invalid-nodepath-test/versions/-SNAPSHOT/services/DatasetService/runs?status=RUNNING&start=0&end=9223372036854775807&limit=2147483647
10-Nov-2018 02:55:30 2018-11-10 02:55:30,625 - INFO  [main:c.c.c.t.AudiTestBase$1@134] - Received response: [200] Response Body: []
10-Nov-2018 02:55:30 2018-11-10 02:55:30,676 - INFO  [main:c.c.c.t.AudiTestBase$1@125] - Making request: GET http://10.210.0.16:11015/v3/namespaces/default/apps/output-batchsink-invalid-nodepath-test/versions/-SNAPSHOT/services/DatasetService/runs?status=RUNNING&start=0&end=9223372036854775807&limit=2147483647
10-Nov-2018 02:55:30 2018-11-10 02:55:30,763 - INFO  [main:c.c.c.t.AudiTestBase$1@134] - Received response: [200] Response Body: []
10-Nov-2018 02:55:30 2018-11-10 02:55:30,813 - INFO  [main:c.c.c.t.AudiTestBase$1@125] - Making request: GET http://10.210.0.16:11015/v3/namespaces/default/apps/output-batchsink-invalid-nodepath-test/versions/-SNAPSHOT/services/DatasetService/runs?status=RUNNING&start=0&end=9223372036854775807&limit=2147483647
10-Nov-2018 02:55:30 2018-11-10 02:55:30,899 - INFO  [main:c.c.c.t.AudiTestBase$1@134] - Received response: [200] Response Body: []
10-Nov-2018 02:55:30 2018-11-10 02:55:30,950 - INFO  [main:c.c.c.t.AudiTestBase$1@125] - Making request: GET http://10.210.0.16:11015/v3/namespaces/default/apps/output-batchsink-invalid-nodepath-test/versions/-SNAPSHOT/services/DatasetService/runs?status=RUNNING&start=0&end=9223372036854775807&limit=2147483647
10-Nov-2018 02:55:31 2018-11-10 02:55:31,036 - INFO  [main:c.c.c.t.AudiTestBase$1@134] - Received response: [200] Response Body: []
10-Nov-2018 02:55:31 2018-11-10 02:55:31,087 - INFO  [main:c.c.c.t.AudiTestBase$1@125] - Making request: GET http://10.210.0.16:11015/v3/namespaces/default/apps/output-batchsink-invalid-nodepath-test/versions/-SNAPSHOT/services/DatasetService/runs?status=RUNNING&start=0&end=9223372036854775807&limit=2147483647
10-Nov-2018 02:55:31 2018-11-10 02:55:31,173 - INFO  [main:c.c.c.t.AudiTestBase$1@134] - Received response: [200] Response Body: []
10-Nov-2018 02:55:31 2018-11-10 02:55:31,224 - INFO  [main:c.c.c.t.AudiTestBase$1@125] - Making request: GET http://10.210.0.16:11015/v3/namespaces/default/apps/output-batchsink-invalid-nodepath-test/versions/-SNAPSHOT/services/DatasetService/runs?status=RUNNING&start=0&end=9223372036854775807&limit=2147483647
10-Nov-2018 02:55:31 2018-11-10 02:55:31,311 - INFO  [main:c.c.c.t.AudiTestBase$1@134] - Received response: [200] Response Body: []
10-Nov-2018 02:55:31 2018-11-10 02:55:31,361 - INFO  [main:c.c.c.t.AudiTestBase$1@125] - Making request: GET http://10.210.0.16:11015/v3/namespaces/default/apps/output-batchsink-invalid-nodepath-test/versions/-SNAPSHOT/services/DatasetService/runs?status=RUNNING&start=0&end=9223372036854775807&limit=2147483647
10-Nov-2018 02:55:31 2018-11-10 02:55:31,448 - INFO  [main:c.c.c.t.AudiTestBase$1@134] - Received response: [200] Response Body: []
10-Nov-2018 02:55:31 2018-11-10 02:55:31,499 - INFO  [main:c.c.c.t.AudiTestBase$1@125] - Making request: GET http://10.210.0.16:11015/v3/namespaces/default/apps/output-batchsink-invalid-nodepath-test/versions/-SNAPSHOT/services/DatasetService/runs?status=RUNNING&start=0&end=9223372036854775807&limit=2147483647
10-Nov-2018 02:55:31 2018-11-10 02:55:31,587 - INFO  [main:c.c.c.t.AudiTestBase$1@134] - Received response: [200] Response Body: []
10-Nov-2018 02:55:31 2018-11-10 02:55:31,638 - INFO  [main:c.c.c.t.AudiTestBase$1@125] - Making request: GET http://10.210.0.16:11015/v3/namespaces/default/apps/output-batchsink-invalid-nodepath-test/versions/-SNAPSHOT/services/DatasetService/runs?status=RUNNING&start=0&end=9223372036854775807&limit=2147483647
10-Nov-2018 02:55:31 2018-11-10 02:55:31,724 - INFO  [main:c.c.c.t.AudiTestBase$1@134] - Received response: [200] Response Body: []
10-Nov-2018 02:55:31 2018-11-10 02:55:31,774 - INFO  [main:c.c.c.t.AudiTestBase$1@125] - Making request: GET http://10.210.0.16:11015/v3/namespaces/default/apps/output-batchsink-invalid-nodepath-test/versions/-SNAPSHOT/services/DatasetService/runs?status=RUNNING&start=0&end=9223372036854775807&limit=2147483647
10-Nov-2018 02:55:31 2018-11-10 02:55:31,860 - INFO  [main:c.c.c.t.AudiTestBase$1@134] - Received response: [200] Response Body: []
10-Nov-2018 02:55:31 2018-11-10 02:55:31,910 - INFO  [main:c.c.c.t.AudiTestBase$1@125] - Making request: GET http://10.210.0.16:11015/v3/namespaces/default/apps/output-batchsink-invalid-nodepath-test/versions/-SNAPSHOT/services/DatasetService/runs?status=RUNNING&start=0&end=9223372036854775807&limit=2147483647
10-Nov-2018 02:55:32 2018-11-10 02:55:31,999 - INFO  [main:c.c.c.t.AudiTestBase$1@134] - Received response: [200] Response Body: []
10-Nov-2018 02:55:32 2018-11-10 02:55:32,050 - INFO  [main:c.c.c.t.AudiTestBase$1@125] - Making request: GET http://10.210.0.16:11015/v3/namespaces/default/apps/output-batchsink-invalid-nodepath-test/versions/-SNAPSHOT/services/DatasetService/runs?status=RUNNING&start=0&end=9223372036854775807&limit=2147483647
10-Nov-2018 02:55:32 2018-11-10 02:55:32,135 - INFO  [main:c.c.c.t.AudiTestBase$1@134] - Received response: [200] Response Body: []
10-Nov-2018 02:55:32 2018-11-10 02:55:32,186 - INFO  [main:c.c.c.t.AudiTestBase$1@125] - Making request: GET http://10.210.0.16:11015/v3/namespaces/default/apps/output-batchsink-invalid-nodepath-test/versions/-SNAPSHOT/services/DatasetService/runs?status=RUNNING&start=0&end=9223372036854775807&limit=2147483647
10-Nov-2018 02:55:32 2018-11-10 02:55:32,271 - INFO  [main:c.c.c.t.AudiTestBase$1@134] - Received response: [200] Response Body: []
10-Nov-2018 02:55:32 2018-11-10 02:55:32,322 - INFO  [main:c.c.c.t.AudiTestBase$1@125] - Making request: GET http://10.210.0.16:11015/v3/namespaces/default/apps/output-batchsink-invalid-nodepath-test/versions/-SNAPSHOT/services/DatasetService/runs?status=RUNNING&start=0&end=9223372036854775807&limit=2147483647
10-Nov-2018 02:55:32 2018-11-10 02:55:32,408 - INFO  [main:c.c.c.t.AudiTestBase$1@134] - Received response: [200] Response Body: []
10-Nov-2018 02:55:32 2018-11-10 02:55:32,459 - INFO  [main:c.c.c.t.AudiTestBase$1@125] - Making request: GET http://10.210.0.16:11015/v3/namespaces/default/apps/output-batchsink-invalid-nodepath-test/versions/-SNAPSHOT/services/DatasetService/runs?status=RUNNING&start=0&end=9223372036854775807&limit=2147483647
10-Nov-2018 02:55:32 2018-11-10 02:55:32,545 - INFO  [main:c.c.c.t.AudiTestBase$1@134] - Received response: [200] Response Body: []
10-Nov-2018 02:55:32 2018-11-10 02:55:32,595 - INFO  [main:c.c.c.t.AudiTestBase$1@125] - Making request: GET http://10.210.0.16:11015/v3/namespaces/default/apps/output-batchsink-invalid-nodepath-test/versions/-SNAPSHOT/services/DatasetService/runs?status=RUNNING&start=0&end=9223372036854775807&limit=2147483647
10-Nov-2018 02:55:32 2018-11-10 02:55:32,683 - INFO  [main:c.c.c.t.AudiTestBase$1@134] - Received response: [200] Response Body: []
10-Nov-2018 02:55:32 2018-11-10 02:55:32,733 - INFO  [main:c.c.c.t.AudiTestBase$1@125] - Making request: GET http://10.210.0.16:11015/v3/namespaces/default/apps/output-batchsink-invalid-nodepath-test/versions/-SNAPSHOT/services/DatasetService/runs?status=RUNNING&start=0&end=9223372036854775807&limit=2147483647
10-Nov-2018 02:55:32 2018-11-10 02:55:32,820 - INFO  [main:c.c.c.t.AudiTestBase$1@134] - Received response: [200] Response Body: []
10-Nov-2018 02:55:32 2018-11-10 02:55:32,871 - INFO  [main:c.c.c.t.AudiTestBase$1@125] - Making request: GET http://10.210.0.16:11015/v3/namespaces/default/apps/output-batchsink-invalid-nodepath-test/versions/-SNAPSHOT/services/DatasetService/runs?status=RUNNING&start=0&end=9223372036854775807&limit=2147483647
10-Nov-2018 02:55:32 2018-11-10 02:55:32,958 - INFO  [main:c.c.c.t.AudiTestBase$1@134] - Received response: [200] Response Body: []
10-Nov-2018 02:55:33 2018-11-10 02:55:33,009 - INFO  [main:c.c.c.t.AudiTestBase$1@125] - Making request: GET http://10.210.0.16:11015/v3/namespaces/default/apps/output-batchsink-invalid-nodepath-test/versions/-SNAPSHOT/services/DatasetService/runs?status=RUNNING&start=0&end=9223372036854775807&limit=2147483647
10-Nov-2018 02:55:33 2018-11-10 02:55:33,095 - INFO  [main:c.c.c.t.AudiTestBase$1@134] - Received response: [200] Response Body: []
10-Nov-2018 02:55:33 2018-11-10 02:55:33,146 - INFO  [main:c.c.c.t.AudiTestBase$1@125] - Making request: GET http://10.210.0.16:11015/v3/namespaces/default/apps/output-batchsink-invalid-nodepath-test/versions/-SNAPSHOT/services/DatasetService/runs?status=RUNNING&start=0&end=9223372036854775807&limit=2147483647
10-Nov-2018 02:55:33 2018-11-10 02:55:33,234 - INFO  [main:c.c.c.t.AudiTestBase$1@134] - Received response: [200] Response Body: []
10-Nov-2018 02:55:33 2018-11-10 02:55:33,285 - INFO  [main:c.c.c.t.AudiTestBase$1@125] - Making request: GET http://10.210.0.16:11015/v3/namespaces/default/apps/output-batchsink-invalid-nodepath-test/versions/-SNAPSHOT/services/DatasetService/runs?status=RUNNING&start=0&end=9223372036854775807&limit=2147483647
10-Nov-2018 02:55:33 2018-11-10 02:55:33,370 - INFO  [main:c.c.c.t.AudiTestBase$1@134] - Received response: [200] Response Body: []
10-Nov-2018 02:55:33 2018-11-10 02:55:33,421 - INFO  [main:c.c.c.t.AudiTestBase$1@125] - Making request: GET http://10.210.0.16:11015/v3/namespaces/default/apps/output-batchsink-invalid-nodepath-test/versions/-SNAPSHOT/services/DatasetService/runs?status=RUNNING&start=0&end=9223372036854775807&limit=2147483647
10-Nov-2018 02:55:33 2018-11-10 02:55:33,507 - INFO  [main:c.c.c.t.AudiTestBase$1@134] - Received response: [200] Response Body: []
10-Nov-2018 02:55:33 2018-11-10 02:55:33,558 - INFO  [main:c.c.c.t.AudiTestBase$1@125] - Making request: GET http://10.210.0.16:11015/v3/namespaces/default/apps/output-batchsink-invalid-nodepath-test/versions/-SNAPSHOT/services/DatasetService/runs?status=RUNNING&start=0&end=9223372036854775807&limit=2147483647
10-Nov-2018 02:55:33 2018-11-10 02:55:33,646 - INFO  [main:c.c.c.t.AudiTestBase$1@134] - Received response: [200] Response Body: []
10-Nov-2018 02:55:33 2018-11-10 02:55:33,697 - INFO  [main:c.c.c.t.AudiTestBase$1@125] - Making request: GET http://10.210.0.16:11015/v3/namespaces/default/apps/output-batchsink-invalid-nodepath-test/versions/-SNAPSHOT/services/DatasetService/runs?status=RUNNING&start=0&end=9223372036854775807&limit=2147483647
10-Nov-2018 02:55:33 2018-11-10 02:55:33,784 - INFO  [main:c.c.c.t.AudiTestBase$1@134] - Received response: [200] Response Body: [{"runid":"0da5ea7e-e494-11e8-a03c-42010ad20010","starting":1541818517,"start":1541818532,"status":"RUNNING","properties":{"runtimeArgs":"{\"logical.start.time\":\"1541818517001\"}"}}]
10-Nov-2018 02:55:33 2018-11-10 02:55:33,785 - INFO  [main:c.c.c.t.AudiTestBase$1@125] - Making request: GET http://10.210.0.16:11015/v3/namespaces/default/apps/output-batchsink-invalid-nodepath-test/versions/-SNAPSHOT/services/DatasetService/available
10-Nov-2018 02:55:34 2018-11-10 02:55:34,168 - INFO  [main:c.c.c.t.AudiTestBase$1@134] - Received response: [503] Response Body: Service is running but not accepting requests at this time.
10-Nov-2018 02:55:34 2018-11-10 02:55:34,219 - INFO  [main:c.c.c.t.AudiTestBase$1@125] - Making request: GET http://10.210.0.16:11015/v3/namespaces/default/apps/output-batchsink-invalid-nodepath-test/versions/-SNAPSHOT/services/DatasetService/available
10-Nov-2018 02:55:34 2018-11-10 02:55:34,603 - INFO  [main:c.c.c.t.AudiTestBase$1@134] - Received response: [503] Response Body: Service is running but not accepting requests at this time.
10-Nov-2018 02:55:34 2018-11-10 02:55:34,653 - INFO  [main:c.c.c.t.AudiTestBase$1@125] - Making request: GET http://10.210.0.16:11015/v3/namespaces/default/apps/output-batchsink-invalid-nodepath-test/versions/-SNAPSHOT/services/DatasetService/available
10-Nov-2018 02:55:35 2018-11-10 02:55:35,039 - INFO  [main:c.c.c.t.AudiTestBase$1@134] - Received response: [503] Response Body: Service is running but not accepting requests at this time.
10-Nov-2018 02:55:35 2018-11-10 02:55:35,090 - INFO  [main:c.c.c.t.AudiTestBase$1@125] - Making request: GET http://10.210.0.16:11015/v3/namespaces/default/apps/output-batchsink-invalid-nodepath-test/versions/-SNAPSHOT/services/DatasetService/available
10-Nov-2018 02:55:35 2018-11-10 02:55:35,477 - INFO  [main:c.c.c.t.AudiTestBase$1@134] - Received response: [503] Response Body: Service is running but not accepting requests at this time.
10-Nov-2018 02:55:35 2018-11-10 02:55:35,528 - INFO  [main:c.c.c.t.AudiTestBase$1@125] - Making request: GET http://10.210.0.16:11015/v3/namespaces/default/apps/output-batchsink-invalid-nodepath-test/versions/-SNAPSHOT/services/DatasetService/available
10-Nov-2018 02:55:35 2018-11-10 02:55:35,912 - INFO  [main:c.c.c.t.AudiTestBase$1@134] - Received response: [503] Response Body: Service is running but not accepting requests at this time.
10-Nov-2018 02:55:35 2018-11-10 02:55:35,963 - INFO  [main:c.c.c.t.AudiTestBase$1@125] - Making request: GET http://10.210.0.16:11015/v3/namespaces/default/apps/output-batchsink-invalid-nodepath-test/versions/-SNAPSHOT/services/DatasetService/available
10-Nov-2018 02:55:36 2018-11-10 02:55:36,348 - INFO  [main:c.c.c.t.AudiTestBase$1@134] - Received response: [503] Response Body: Service is running but not accepting requests at this time.
10-Nov-2018 02:55:36 2018-11-10 02:55:36,398 - INFO  [main:c.c.c.t.AudiTestBase$1@125] - Making request: GET http://10.210.0.16:11015/v3/namespaces/default/apps/output-batchsink-invalid-nodepath-test/versions/-SNAPSHOT/services/DatasetService/available
10-Nov-2018 02:55:36 2018-11-10 02:55:36,782 - INFO  [main:c.c.c.t.AudiTestBase$1@134] - Received response: [503] Response Body: Service is running but not accepting requests at this time.
10-Nov-2018 02:55:36 2018-11-10 02:55:36,833 - INFO  [main:c.c.c.t.AudiTestBase$1@125] - Making request: GET http://10.210.0.16:11015/v3/namespaces/default/apps/output-batchsink-invalid-nodepath-test/versions/-SNAPSHOT/services/DatasetService/available
10-Nov-2018 02:55:37 2018-11-10 02:55:37,217 - INFO  [main:c.c.c.t.AudiTestBase$1@134] - Received response: [503] Response Body: Service is running but not accepting requests at this time.
10-Nov-2018 02:55:37 2018-11-10 02:55:37,267 - INFO  [main:c.c.c.t.AudiTestBase$1@125] - Making request: GET http://10.210.0.16:11015/v3/namespaces/default/apps/output-batchsink-invalid-nodepath-test/versions/-SNAPSHOT/services/DatasetService/available
10-Nov-2018 02:55:37 2018-11-10 02:55:37,654 - INFO  [main:c.c.c.t.AudiTestBase$1@134] - Received response: [503] Response Body: Service is running but not accepting requests at this time.
10-Nov-2018 02:55:37 2018-11-10 02:55:37,704 - INFO  [main:c.c.c.t.AudiTestBase$1@125] - Making request: GET http://10.210.0.16:11015/v3/namespaces/default/apps/output-batchsink-invalid-nodepath-test/versions/-SNAPSHOT/services/DatasetService/available
10-Nov-2018 02:55:38 2018-11-10 02:55:38,089 - INFO  [main:c.c.c.t.AudiTestBase$1@134] - Received response: [503] Response Body: Service is running but not accepting requests at this time.
10-Nov-2018 02:55:38 2018-11-10 02:55:38,139 - INFO  [main:c.c.c.t.AudiTestBase$1@125] - Making request: GET http://10.210.0.16:11015/v3/namespaces/default/apps/output-batchsink-invalid-nodepath-test/versions/-SNAPSHOT/services/DatasetService/available
10-Nov-2018 02:55:38 2018-11-10 02:55:38,523 - INFO  [main:c.c.c.t.AudiTestBase$1@134] - Received response: [503] Response Body: Service is running but not accepting requests at this time.
10-Nov-2018 02:55:38 2018-11-10 02:55:38,574 - INFO  [main:c.c.c.t.AudiTestBase$1@125] - Making request: GET http://10.210.0.16:11015/v3/namespaces/default/apps/output-batchsink-invalid-nodepath-test/versions/-SNAPSHOT/services/DatasetService/available
10-Nov-2018 02:55:38 2018-11-10 02:55:38,959 - INFO  [main:c.c.c.t.AudiTestBase$1@134] - Received response: [503] Response Body: Service is running but not accepting requests at this time.
10-Nov-2018 02:55:39 2018-11-10 02:55:39,009 - INFO  [main:c.c.c.t.AudiTestBase$1@125] - Making request: GET http://10.210.0.16:11015/v3/namespaces/default/apps/output-batchsink-invalid-nodepath-test/versions/-SNAPSHOT/services/DatasetService/available
10-Nov-2018 02:55:39 2018-11-10 02:55:39,394 - INFO  [main:c.c.c.t.AudiTestBase$1@134] - Received response: [503] Response Body: Service is running but not accepting requests at this time.
10-Nov-2018 02:55:39 2018-11-10 02:55:39,444 - INFO  [main:c.c.c.t.AudiTestBase$1@125] - Making request: GET http://10.210.0.16:11015/v3/namespaces/default/apps/output-batchsink-invalid-nodepath-test/versions/-SNAPSHOT/services/DatasetService/available
10-Nov-2018 02:55:39 2018-11-10 02:55:39,828 - INFO  [main:c.c.c.t.AudiTestBase$1@134] - Received response: [503] Response Body: Service is running but not accepting requests at this time.
10-Nov-2018 02:55:39 2018-11-10 02:55:39,879 - INFO  [main:c.c.c.t.AudiTestBase$1@125] - Making request: GET http://10.210.0.16:11015/v3/namespaces/default/apps/output-batchsink-invalid-nodepath-test/versions/-SNAPSHOT/services/DatasetService/available
10-Nov-2018 02:55:40 2018-11-10 02:55:40,263 - INFO  [main:c.c.c.t.AudiTestBase$1@134] - Received response: [503] Response Body: Service is running but not accepting requests at this time.
10-Nov-2018 02:55:40 2018-11-10 02:55:40,313 - INFO  [main:c.c.c.t.AudiTestBase$1@125] - Making request: GET http://10.210.0.16:11015/v3/namespaces/default/apps/output-batchsink-invalid-nodepath-test/versions/-SNAPSHOT/services/DatasetService/available
10-Nov-2018 02:55:40 2018-11-10 02:55:40,698 - INFO  [main:c.c.c.t.AudiTestBase$1@134] - Received response: [503] Response Body: Service is running but not accepting requests at this time.
10-Nov-2018 02:55:40 2018-11-10 02:55:40,748 - INFO  [main:c.c.c.t.AudiTestBase$1@125] - Making request: GET http://10.210.0.16:11015/v3/namespaces/default/apps/output-batchsink-invalid-nodepath-test/versions/-SNAPSHOT/services/DatasetService/available
10-Nov-2018 02:55:41 2018-11-10 02:55:41,134 - INFO  [main:c.c.c.t.AudiTestBase$1@134] - Received response: [503] Response Body: Service is running but not accepting requests at this time.
10-Nov-2018 02:55:41 2018-11-10 02:55:41,185 - INFO  [main:c.c.c.t.AudiTestBase$1@125] - Making request: GET http://10.210.0.16:11015/v3/namespaces/default/apps/output-batchsink-invalid-nodepath-test/versions/-SNAPSHOT/services/DatasetService/available
10-Nov-2018 02:55:41 2018-11-10 02:55:41,570 - INFO  [main:c.c.c.t.AudiTestBase$1@134] - Received response: [503] Response Body: Service is running but not accepting requests at this time.
10-Nov-2018 02:55:41 2018-11-10 02:55:41,620 - INFO  [main:c.c.c.t.AudiTestBase$1@125] - Making request: GET http://10.210.0.16:11015/v3/namespaces/default/apps/output-batchsink-invalid-nodepath-test/versions/-SNAPSHOT/services/DatasetService/available
10-Nov-2018 02:55:42 2018-11-10 02:55:42,007 - INFO  [main:c.c.c.t.AudiTestBase$1@134] - Received response: [503] Response Body: Service is running but not accepting requests at this time.
10-Nov-2018 02:55:42 2018-11-10 02:55:42,058 - INFO  [main:c.c.c.t.AudiTestBase$1@125] - Making request: GET http://10.210.0.16:11015/v3/namespaces/default/apps/output-batchsink-invalid-nodepath-test/versions/-SNAPSHOT/services/DatasetService/available
10-Nov-2018 02:55:42 2018-11-10 02:55:42,443 - INFO  [main:c.c.c.t.AudiTestBase$1@134] - Received response: [503] Response Body: Service is running but not accepting requests at this time.
10-Nov-2018 02:55:42 2018-11-10 02:55:42,494 - INFO  [main:c.c.c.t.AudiTestBase$1@125] - Making request: GET http://10.210.0.16:11015/v3/namespaces/default/apps/output-batchsink-invalid-nodepath-test/versions/-SNAPSHOT/services/DatasetService/available
10-Nov-2018 02:55:42 2018-11-10 02:55:42,879 - INFO  [main:c.c.c.t.AudiTestBase$1@134] - Received response: [503] Response Body: Service is running but not accepting requests at this time.
10-Nov-2018 02:55:42 2018-11-10 02:55:42,929 - INFO  [main:c.c.c.t.AudiTestBase$1@125] - Making request: GET http://10.210.0.16:11015/v3/namespaces/default/apps/output-batchsink-invalid-nodepath-test/versions/-SNAPSHOT/services/DatasetService/available
10-Nov-2018 02:55:43 2018-11-10 02:55:43,316 - INFO  [main:c.c.c.t.AudiTestBase$1@134] - Received response: [503] Response Body: Service is running but not accepting requests at this time.
10-Nov-2018 02:55:43 2018-11-10 02:55:43,366 - INFO  [main:c.c.c.t.AudiTestBase$1@125] - Making request: GET http://10.210.0.16:11015/v3/namespaces/default/apps/output-batchsink-invalid-nodepath-test/versions/-SNAPSHOT/services/DatasetService/available
10-Nov-2018 02:55:43 2018-11-10 02:55:43,750 - INFO  [main:c.c.c.t.AudiTestBase$1@134] - Received response: [503] Response Body: Service is running but not accepting requests at this time.
10-Nov-2018 02:55:43 2018-11-10 02:55:43,801 - INFO  [main:c.c.c.t.AudiTestBase$1@125] - Making request: GET http://10.210.0.16:11015/v3/namespaces/default/apps/output-batchsink-invalid-nodepath-test/versions/-SNAPSHOT/services/DatasetService/available
10-Nov-2018 02:55:44 2018-11-10 02:55:44,184 - INFO  [main:c.c.c.t.AudiTestBase$1@134] - Received response: [503] Response Body: Service is running but not accepting requests at this time.
10-Nov-2018 02:55:44 2018-11-10 02:55:44,235 - INFO  [main:c.c.c.t.AudiTestBase$1@125] - Making request: GET http://10.210.0.16:11015/v3/namespaces/default/apps/output-batchsink-invalid-nodepath-test/versions/-SNAPSHOT/services/DatasetService/available
10-Nov-2018 02:55:44 2018-11-10 02:55:44,620 - INFO  [main:c.c.c.t.AudiTestBase$1@134] - Received response: [503] Response Body: Service is running but not accepting requests at this time.
10-Nov-2018 02:55:44 2018-11-10 02:55:44,670 - INFO  [main:c.c.c.t.AudiTestBase$1@125] - Making request: GET http://10.210.0.16:11015/v3/namespaces/default/apps/output-batchsink-invalid-nodepath-test/versions/-SNAPSHOT/services/DatasetService/available
10-Nov-2018 02:55:45 2018-11-10 02:55:45,056 - INFO  [main:c.c.c.t.AudiTestBase$1@134] - Received response: [503] Response Body: Service is running but not accepting requests at this time.
10-Nov-2018 02:55:45 2018-11-10 02:55:45,106 - INFO  [main:c.c.c.t.AudiTestBase$1@125] - Making request: GET http://10.210.0.16:11015/v3/namespaces/default/apps/output-batchsink-invalid-nodepath-test/versions/-SNAPSHOT/services/DatasetService/available
10-Nov-2018 02:55:45 2018-11-10 02:55:45,491 - INFO  [main:c.c.c.t.AudiTestBase$1@134] - Received response: [503] Response Body: Service is running but not accepting requests at this time.
10-Nov-2018 02:55:45 2018-11-10 02:55:45,542 - INFO  [main:c.c.c.t.AudiTestBase$1@125] - Making request: GET http://10.210.0.16:11015/v3/namespaces/default/apps/output-batchsink-invalid-nodepath-test/versions/-SNAPSHOT/services/DatasetService/available
10-Nov-2018 02:55:45 2018-11-10 02:55:45,844 - INFO  [main:c.c.c.t.AudiTestBase$1@134] - Received response: [200] Response Body: Service is available to accept requests.
10-Nov-2018 02:55:45 2018-11-10 02:55:45,845 - INFO  [main:c.c.c.t.AudiTestBase$1@125] - Making request: GET http://10.210.0.16:11015/v3/namespaces/default/apps/output-batchsink-invalid-nodepath-test/versions/-SNAPSHOT/services/DatasetService
10-Nov-2018 02:55:45 2018-11-10 02:55:45,961 - INFO  [main:c.c.c.t.AudiTestBase$1@134] - Received response: [200] Response Body: {"className":"co.cask.cdap.remote.dataset.AbstractDatasetApp$DatasetService","name":"DatasetService","description":"","handlers":{"TableHttpHandler":{"className":"co.cask.cdap.remote.dataset.table.TableDatasetApp$TableHttpHandler","name":"TableHttpHandler","description":"","properties":{"co.cask.cdap.remote.dataset.table.TableDatasetApp$TableHttpHandler.datasetName":"output-batchsink-invalid-nodepath-test"},"datasets":[],"endpoints":[{"method":"POST","path":"/namespaces/{namespace}/datasets/{dataset}/get"},{"method":"POST","path":"/namespaces/{namespace}/datasets/{dataset}/put"},{"method":"POST","path":"/namespaces/{namespace}/datasets/{dataset}/incrementAndGet"},{"method":"POST","path":"/getWithRange"},{"method":"POST","path":"/compareAndSwap"},{"method":"POST","path":"/get"},{"method":"POST","path":"/put"},{"method":"POST","path":"/delete"},{"method":"POST","path":"/incrementAndGet"}]}},"resources":{"virtualCores":1,"memoryMB":512},"instances":1}
10-Nov-2018 02:55:45 2018-11-10 02:55:45,962 - INFO  [main:c.c.c.t.AudiTestBase$1@125] - Making request: POST http://10.210.0.16:11015/v3/namespaces/default/apps/output-batchsink-invalid-nodepath-test/versions/-SNAPSHOT/services/DatasetService/methods/get
10-Nov-2018 02:55:48 2018-11-10 02:55:48,397 - INFO  [main:c.c.c.t.AudiTestBase$1@134] - Received response: [200] Response Body: {"row":[50,50],"columns":{}}
10-Nov-2018 02:55:48 2018-11-10 02:55:48,397 - INFO  [main:c.c.c.t.AudiTestBase$1@125] - Making request: POST http://10.210.0.16:11015/v3/namespaces/default/apps/output-batchsink-invalid-nodepath-test/versions/-SNAPSHOT/services/DatasetService/methods/get
10-Nov-2018 02:55:48 2018-11-10 02:55:48,497 - INFO  [main:c.c.c.t.AudiTestBase$1@134] - Received response: [200] Response Body: {"row":[49,50,56],"columns":{}}
10-Nov-2018 02:55:48 2018-11-10 02:55:48,498 - INFO  [main:c.c.c.t.AudiTestBase$1@125] - Making request: GET http://10.210.0.16:11015/v3/namespaces/default/apps/UploadFile/versions/-SNAPSHOT/services/FileSetService/methods/fileExist/xmlreadersource?path=catalog.xml
10-Nov-2018 02:55:48 2018-11-10 02:55:48,616 - INFO  [main:c.c.c.t.AudiTestBase$1@134] - Received response: [200] Response Body: false
10-Nov-2018 02:55:48 2018-11-10 02:55:48,617 - INFO  [main:c.c.c.t.AudiTestBase$1@125] - Making request: GET http://10.210.0.16:11015/v3/namespaces/default/apps/UploadFile/versions/-SNAPSHOT/services/FileSetService/methods/fileExist/xmlreadertarget?path=catalog.xml
10-Nov-2018 02:55:48 2018-11-10 02:55:48,730 - INFO  [main:c.c.c.t.AudiTestBase$1@134] - Received response: [200] Response Body: true
10-Nov-2018 02:55:48 2018-11-10 02:55:48,731 - INFO  [main:c.c.c.t.AudiTestBase$1@125] - Making request: GET http://10.210.0.16:11015/v3/namespaces/default/apps/UploadFile/versions/-SNAPSHOT/services/FileSetService/methods/fileExist/xmlreadersource?path=catalogProcessedFile.xml
10-Nov-2018 02:55:48 2018-11-10 02:55:48,827 - INFO  [main:c.c.c.t.AudiTestBase$1@134] - Received response: [200] Response Body: true
10-Nov-2018 02:55:48 2018-11-10 02:55:48,827 - INFO  [main:c.c.c.t.AudiTestBase$1@125] - Making request: POST http://10.210.0.16:11015/v3/namespaces/default/apps/XMLInvalidNodePathTrackingTable/versions/-SNAPSHOT/services/DatasetService/methods/read
10-Nov-2018 02:55:49 2018-11-10 02:55:49,021 - INFO  [main:c.c.c.t.AudiTestBase$1@134] - Received response: [200] Response Body: {"result":[0,0,1,102,-108,-118,127,-24]}
10-Nov-2018 02:55:49 2018-11-10 02:55:49,022 - INFO  [main:c.c.c.t.IntegrationTestBase@119] - Beginning tearDown.
10-Nov-2018 02:55:49 2018-11-10 02:55:49,022 - INFO  [main:c.c.c.t.AudiTestBase$1@125] - Making request: GET http://10.210.0.16:11015/v3/namespaces/default
10-Nov-2018 02:55:49 2018-11-10 02:55:49,098 - INFO  [main:c.c.c.t.AudiTestBase$1@134] - Received response: [200] Response Body: {"name":"default","description":"Default Namespace","config":{"scheduler.queue.name":"","explore.as.principal":true}}
10-Nov-2018 02:55:49 2018-11-10 02:55:49,098 - INFO  [main:c.c.c.t.AudiTestBase$1@125] - Making request: GET http://10.210.0.16:11015/v3/namespaces/default/apps
10-Nov-2018 02:55:49 2018-11-10 02:55:49,189 - INFO  [main:c.c.c.t.AudiTestBase$1@134] - Received response: [200] Response Body: [{"type":"App","id":"UploadFile","name":"UploadFile","version":"-SNAPSHOT","description":"Application to upload file on HDFS using FileSet dataset","artifact":{"name":"UploadFile","version":"1.0.0-SNAPSHOT","scope":"USER"}},{"type":"App","id":"output-batchsink-invalid-nodepath-test","name":"output-batchsink-invalid-nodepath-test","version":"-SNAPSHOT","description":"","artifact":{"name":"TableDatasetApp","version":"1.0.0-SNAPSHOT","scope":"USER"}},{"type":"App","id":"XMLInvalidNodePathTrackingTable","name":"XMLInvalidNodePathTrackingTable","version":"-SNAPSHOT","description":"","artifact":{"name":"KVTableDatasetApp","version":"1.0.0-SNAPSHOT","scope":"USER"}},{"type":"App","id":"XMLInvalidNodePathTest","name":"XMLInvalidNodePathTest","version":"-SNAPSHOT","description":"Data Pipeline Application","artifact":{"name":"cdap-data-pipeline","version":"4.3.5-SNAPSHOT","scope":"SYSTEM"}}]
10-Nov-2018 02:55:49 2018-11-10 02:55:49,190 - INFO  [main:c.c.c.t.AudiTestBase$1@125] - Making request: GET http://10.210.0.16:11015/v3/namespaces/default/apps/UploadFile/versions/-SNAPSHOT
10-Nov-2018 02:55:49 2018-11-10 02:55:49,273 - INFO  [main:c.c.c.t.AudiTestBase$1@134] - Received response: [200] Response Body: {"name":"UploadFile","appVersion":"-SNAPSHOT","artifactVersion":"1.0.0-SNAPSHOT","description":"Application to upload file on HDFS using FileSet dataset","configuration":"","streams":[],"datasets":[],"programs":[{"type":"Service","app":"UploadFile","id":"FileSetService","name":"FileSetService","description":"A service to upload files to file sets, and return it\u0027s location"}],"plugins":[],"artifact":{"name":"UploadFile","version":"1.0.0-SNAPSHOT","scope":"USER"}}
10-Nov-2018 02:55:49 2018-11-10 02:55:49,274 - INFO  [main:c.c.c.t.AudiTestBase$1@125] - Making request: GET http://10.210.0.16:11015/v3/namespaces/default/apps/UploadFile/versions/-SNAPSHOT/services/FileSetService/status
10-Nov-2018 02:55:49 2018-11-10 02:55:49,357 - INFO  [main:c.c.c.t.AudiTestBase$1@134] - Received response: [200] Response Body: {"status":"RUNNING"}
10-Nov-2018 02:55:49 2018-11-10 02:55:49,357 - INFO  [main:c.c.c.t.AudiTestBase$1@125] - Making request: POST http://10.210.0.16:11015/v3/namespaces/default/apps/UploadFile/versions/-SNAPSHOT/services/FileSetService/stop
10-Nov-2018 02:55:54 2018-11-10 02:55:54,938 - INFO  [main:c.c.c.t.AudiTestBase$1@134] - Received response: [200] Response Body:
10-Nov-2018 02:55:54 2018-11-10 02:55:54,939 - INFO  [main:c.c.c.t.AudiTestBase$1@125] - Making request: GET http://10.210.0.16:11015/v3/namespaces/default/apps/UploadFile/versions/-SNAPSHOT/services/FileSetService/status
10-Nov-2018 02:55:54 2018-11-10 02:55:54,991 - INFO  [main:c.c.c.t.AudiTestBase$1@134] - Received response: [200] Response Body: {"status":"STOPPED"}
10-Nov-2018 02:55:54 2018-11-10 02:55:54,991 - INFO  [main:c.c.c.t.AudiTestBase$1@125] - Making request: GET http://10.210.0.16:11015/v3/namespaces/default/apps/output-batchsink-invalid-nodepath-test/versions/-SNAPSHOT
10-Nov-2018 02:55:55 2018-11-10 02:55:55,085 - INFO  [main:c.c.c.t.AudiTestBase$1@134] - Received response: [200] Response Body: {"name":"output-batchsink-invalid-nodepath-test","appVersion":"-SNAPSHOT","artifactVersion":"1.0.0-SNAPSHOT","description":"","configuration":"{\"datasetName\":\"output-batchsink-invalid-nodepath-test\"}","streams":[],"datasets":[{"name":"output-batchsink-invalid-nodepath-test","classname":"co.cask.cdap.api.dataset.table.Table"}],"programs":[{"type":"Service","app":"output-batchsink-invalid-nodepath-test","id":"DatasetService","name":"DatasetService","description":""}],"plugins":[],"artifact":{"name":"TableDatasetApp","version":"1.0.0-SNAPSHOT","scope":"USER"}}
10-Nov-2018 02:55:55 2018-11-10 02:55:55,086 - INFO  [main:c.c.c.t.AudiTestBase$1@125] - Making request: GET http://10.210.0.16:11015/v3/namespaces/default/apps/output-batchsink-invalid-nodepath-test/versions/-SNAPSHOT/services/DatasetService/status
10-Nov-2018 02:55:55 2018-11-10 02:55:55,177 - INFO  [main:c.c.c.t.AudiTestBase$1@134] - Received response: [200] Response Body: {"status":"RUNNING"}
10-Nov-2018 02:55:55 2018-11-10 02:55:55,178 - INFO  [main:c.c.c.t.AudiTestBase$1@125] - Making request: POST http://10.210.0.16:11015/v3/namespaces/default/apps/output-batchsink-invalid-nodepath-test/versions/-SNAPSHOT/services/DatasetService/stop
10-Nov-2018 02:56:00 2018-11-10 02:56:00,406 - INFO  [main:c.c.c.t.AudiTestBase$1@134] - Received response: [200] Response Body:
10-Nov-2018 02:56:00 2018-11-10 02:56:00,407 - INFO  [main:c.c.c.t.AudiTestBase$1@125] - Making request: GET http://10.210.0.16:11015/v3/namespaces/default/apps/output-batchsink-invalid-nodepath-test/versions/-SNAPSHOT/services/DatasetService/status
10-Nov-2018 02:56:00 2018-11-10 02:56:00,459 - INFO  [main:c.c.c.t.AudiTestBase$1@134] - Received response: [200] Response Body: {"status":"STOPPED"}
10-Nov-2018 02:56:00 2018-11-10 02:56:00,459 - INFO  [main:c.c.c.t.AudiTestBase$1@125] - Making request: GET http://10.210.0.16:11015/v3/namespaces/default/apps/XMLInvalidNodePathTrackingTable/versions/-SNAPSHOT
10-Nov-2018 02:56:00 2018-11-10 02:56:00,543 - INFO  [main:c.c.c.t.AudiTestBase$1@134] - Received response: [200] Response Body: {"name":"XMLInvalidNodePathTrackingTable","appVersion":"-SNAPSHOT","artifactVersion":"1.0.0-SNAPSHOT","description":"","configuration":"{\"datasetName\":\"XMLInvalidNodePathTrackingTable\"}","streams":[],"datasets":[{"name":"XMLInvalidNodePathTrackingTable","classname":"co.cask.cdap.api.dataset.lib.KeyValueTable"}],"programs":[{"type":"Service","app":"XMLInvalidNodePathTrackingTable","id":"DatasetService","name":"DatasetService","description":""}],"plugins":[],"artifact":{"name":"KVTableDatasetApp","version":"1.0.0-SNAPSHOT","scope":"USER"}}
10-Nov-2018 02:56:00 2018-11-10 02:56:00,544 - INFO  [main:c.c.c.t.AudiTestBase$1@125] - Making request: GET http://10.210.0.16:11015/v3/namespaces/default/apps/XMLInvalidNodePathTrackingTable/versions/-SNAPSHOT/services/DatasetService/status
10-Nov-2018 02:56:00 2018-11-10 02:56:00,629 - INFO  [main:c.c.c.t.AudiTestBase$1@134] - Received response: [200] Response Body: {"status":"RUNNING"}
10-Nov-2018 02:56:00 2018-11-10 02:56:00,629 - INFO  [main:c.c.c.t.AudiTestBase$1@125] - Making request: POST http://10.210.0.16:11015/v3/namespaces/default/apps/XMLInvalidNodePathTrackingTable/versions/-SNAPSHOT/services/DatasetService/stop
10-Nov-2018 02:56:06 2018-11-10 02:56:06,697 - INFO  [main:c.c.c.t.AudiTestBase$1@134] - Received response: [200] Response Body:
10-Nov-2018 02:56:06 2018-11-10 02:56:06,698 - INFO  [main:c.c.c.t.AudiTestBase$1@125] - Making request: GET http://10.210.0.16:11015/v3/namespaces/default/apps/XMLInvalidNodePathTrackingTable/versions/-SNAPSHOT/services/DatasetService/status
10-Nov-2018 02:56:06 2018-11-10 02:56:06,751 - INFO  [main:c.c.c.t.AudiTestBase$1@134] - Received response: [200] Response Body: {"status":"STOPPED"}
10-Nov-2018 02:56:06 2018-11-10 02:56:06,752 - INFO  [main:c.c.c.t.AudiTestBase$1@125] - Making request: GET http://10.210.0.16:11015/v3/namespaces/default/apps/XMLInvalidNodePathTest/versions/-SNAPSHOT
10-Nov-2018 02:56:06 2018-11-10 02:56:06,874 - INFO  [main:c.c.c.t.AudiTestBase$1@134] - Received response: [200] Response Body: {"name":"XMLInvalidNodePathTest","appVersion":"-SNAPSHOT","artifactVersion":"4.3.5-SNAPSHOT","description":"Data Pipeline Application","configuration":"{\"engine\":\"MAPREDUCE\",\"schedule\":\"* * * * *\",\"postActions\":[],\"stages\":[{\"name\":\"XMLTableSink\",\"plugin\":{\"name\":\"Table\",\"type\":\"batchsink\",\"properties\":{\"name\":\"output-batchsink-invalid-nodepath-test\",\"schema.row.field\":\"offset\",\"schema\":\"{\\\"type\\\":\\\"record\\\",\\\"name\\\":\\\"xmlSink\\\",\\\"fields\\\":[{\\\"name\\\":\\\"offset\\\",\\\"type\\\":\\\"string\\\"},{\\\"name\\\":\\\"filename\\\",\\\"type\\\":\\\"string\\\"},{\\\"name\\\":\\\"record\\\",\\\"type\\\":\\\"string\\\"}]}\"}}},{\"name\":\"XMLProjectionTransform\",\"plugin\":{\"name\":\"Projection\",\"type\":\"transform\",\"properties\":{\"convert\":\"offset:string\",\"schema\":\"{\\\"type\\\":\\\"record\\\",\\\"name\\\":\\\"xmlTransform\\\",\\\"fields\\\":[{\\\"name\\\":\\\"offset\\\",\\\"type\\\":\\\"long\\\"},{\\\"name\\\":\\\"filename\\\",\\\"type\\\":\\\"string\\\"},{\\\"name\\\":\\\"record\\\",\\\"type\\\":\\\"string\\\"}]}\"}}},{\"name\":\"XMLReader\",\"plugin\":{\"name\":\"XMLReader\",\"type\":\"batchsource\",\"properties\":{\"referenceName\":\"XMLReaderInvalidNodePathTest\",\"path\":\"hdfs://10.210.0.16:8020/cdap/namespaces/default/data/xmlreadersource/\",\"targetFolder\":\"hdfs://10.210.0.16:8020/cdap/namespaces/default/data/xmlreadertarget/\",\"nodePath\":\"/catalog/book/prices\",\"reprocessingRequired\":\"No\",\"tableName\":\"XMLInvalidNodePathTrackingTable\",\"actionAfterProcess\":\"move\",\"tableExpiryPeriod\":\"30\",\"temporaryFolder\":\"/tmp\"}}}],\"connections\":[{\"from\":\"XMLReader\",\"to\":\"XMLProjectionTransform\"},{\"from\":\"XMLProjectionTransform\",\"to\":\"XMLTableSink\"}],\"resources\":{\"virtualCores\":1.0,\"memoryMB\":1024.0},\"driverResources\":{\"virtualCores\":1.0,\"memoryMB\":1024.0},\"clientResources\":{\"virtualCores\":1.0,\"memoryMB\":1024.0},\"stageLoggingEnabled\":true,\"processTimingEnabled\":true,\"numOfRecordsPreview\":0.0,\"properties\":{},\"sinks\":[],\"transforms\":[]}","streams":[],"datasets":[{"name":"XMLInvalidNodePathTrackingTable","classname":"co.cask.cdap.api.dataset.lib.KeyValueTable"},{"name":"output-batchsink-invalid-nodepath-test","classname":"co.cask.cdap.api.dataset.table.Table"}],"programs":[{"type":"Mapreduce","app":"XMLInvalidNodePathTest","id":"phase-1","name":"phase-1","description":"MapReduce phase executor. Sources \u0027XMLReader\u0027 to sinks \u0027XMLTableSink\u0027."},{"type":"Workflow","app":"XMLInvalidNodePathTest","id":"DataPipelineWorkflow","name":"DataPipelineWorkflow","description":"Data Pipeline Workflow"}],"plugins":[{"id":"XMLProjectionTransform","name":"Projection","type":"transform"},{"id":"XMLTableSink","name":"Table","type":"batchsink"},{"id":"XMLReader","name":"XMLReader","type":"batchsource"}],"artifact":{"name":"cdap-data-pipeline","version":"4.3.5-SNAPSHOT","scope":"SYSTEM"}}
10-Nov-2018 02:56:06 2018-11-10 02:56:06,875 - INFO  [main:c.c.c.t.AudiTestBase$1@125] - Making request: GET http://10.210.0.16:11015/v3/namespaces/default/apps/XMLInvalidNodePathTest/versions/-SNAPSHOT/mapreduce/phase-1/status
10-Nov-2018 02:56:06 2018-11-10 02:56:06,974 - INFO  [main:c.c.c.t.AudiTestBase$1@134] - Received response: [200] Response Body: {"status":"STOPPED"}
10-Nov-2018 02:56:06 2018-11-10 02:56:06,974 - INFO  [main:c.c.c.t.AudiTestBase$1@125] - Making request: GET http://10.210.0.16:11015/v3/namespaces/default/apps/XMLInvalidNodePathTest/versions/-SNAPSHOT/workflows/DataPipelineWorkflow/status
10-Nov-2018 02:56:07 2018-11-10 02:56:07,066 - INFO  [main:c.c.c.t.AudiTestBase$1@134] - Received response: [200] Response Body: {"status":"STOPPED"}
10-Nov-2018 02:56:07 2018-11-10 02:56:07,067 - INFO  [main:c.c.c.t.AudiTestBase$1@125] - Making request: GET http://10.210.0.16:11015/v3/namespaces/default/apps
10-Nov-2018 02:56:07 2018-11-10 02:56:07,159 - INFO  [main:c.c.c.t.AudiTestBase$1@134] - Received response: [200] Response Body: [{"type":"App","id":"UploadFile","name":"UploadFile","version":"-SNAPSHOT","description":"Application to upload file on HDFS using FileSet dataset","artifact":{"name":"UploadFile","version":"1.0.0-SNAPSHOT","scope":"USER"}},{"type":"App","id":"output-batchsink-invalid-nodepath-test","name":"output-batchsink-invalid-nodepath-test","version":"-SNAPSHOT","description":"","artifact":{"name":"TableDatasetApp","version":"1.0.0-SNAPSHOT","scope":"USER"}},{"type":"App","id":"XMLInvalidNodePathTrackingTable","name":"XMLInvalidNodePathTrackingTable","version":"-SNAPSHOT","description":"","artifact":{"name":"KVTableDatasetApp","version":"1.0.0-SNAPSHOT","scope":"USER"}},{"type":"App","id":"XMLInvalidNodePathTest","name":"XMLInvalidNodePathTest","version":"-SNAPSHOT","description":"Data Pipeline Application","artifact":{"name":"cdap-data-pipeline","version":"4.3.5-SNAPSHOT","scope":"SYSTEM"}}]
10-Nov-2018 02:56:07 2018-11-10 02:56:07,160 - INFO  [main:c.c.c.t.AudiTestBase$1@125] - Making request: DELETE http://10.210.0.16:11015/v3/namespaces/default/apps/UploadFile/versions/-SNAPSHOT
10-Nov-2018 02:56:07 2018-11-10 02:56:07,600 - INFO  [main:c.c.c.t.AudiTestBase$1@134] - Received response: [200] Response Body:
10-Nov-2018 02:56:07 2018-11-10 02:56:07,601 - INFO  [main:c.c.c.t.AudiTestBase$1@125] - Making request: DELETE http://10.210.0.16:11015/v3/namespaces/default/apps/output-batchsink-invalid-nodepath-test/versions/-SNAPSHOT
10-Nov-2018 02:56:07 2018-11-10 02:56:07,972 - INFO  [main:c.c.c.t.AudiTestBase$1@134] - Received response: [200] Response Body:
10-Nov-2018 02:56:07 2018-11-10 02:56:07,972 - INFO  [main:c.c.c.t.AudiTestBase$1@125] - Making request: DELETE http://10.210.0.16:11015/v3/namespaces/default/apps/XMLInvalidNodePathTrackingTable/versions/-SNAPSHOT
10-Nov-2018 02:56:08 2018-11-10 02:56:08,341 - INFO  [main:c.c.c.t.AudiTestBase$1@134] - Received response: [200] Response Body:
10-Nov-2018 02:56:08 2018-11-10 02:56:08,342 - INFO  [main:c.c.c.t.AudiTestBase$1@125] - Making request: DELETE http://10.210.0.16:11015/v3/namespaces/default/apps/XMLInvalidNodePathTest/versions/-SNAPSHOT
10-Nov-2018 02:56:08 2018-11-10 02:56:08,927 - INFO  [main:c.c.c.t.AudiTestBase$1@134] - Received response: [200] Response Body:
10-Nov-2018 02:56:08 2018-11-10 02:56:08,927 - INFO  [main:c.c.c.t.AudiTestBase$1@125] - Making request: GET http://10.210.0.16:11015/v3/namespaces/default/streams
10-Nov-2018 02:56:08 2018-11-10 02:56:08,977 - INFO  [main:c.c.c.t.AudiTestBase$1@134] - Received response: [200] Response Body: []
10-Nov-2018 02:56:08 2018-11-10 02:56:08,977 - INFO  [main:c.c.c.t.AudiTestBase$1@125] - Making request: GET http://10.210.0.16:11015/v3/namespaces/default/data/datasets
10-Nov-2018 02:56:09 2018-11-10 02:56:09,095 - INFO  [main:c.c.c.t.AudiTestBase$1@134] - Received response: [200] Response Body: [{"name":"xmlreadersource","type":"fileSet","properties":{}},{"name":"xmlreadertarget","type":"fileSet","properties":{}},{"name":"XMLReaderInvalidNodePathTest","type":"externalDataset","properties":{"input.format.class":"co.cask.hydrator.plugin.batch.source.XMLInputFormat","mapreduce.input.fileinputformat.inputdir":"hdfs://10.210.0.16:8020/cdap/namespaces/default/data/xmlreadersource","mapreduce.input.pathFilter.class":"co.cask.hydrator.plugin.common.BatchXMLFileFilter","rpc.engine.org.apache.hadoop.hdfs.protocolPB.ClientNamenodeProtocolPB":"org.apache.hadoop.ipc.ProtobufRpcEngine","xml.inputformat.file.action":"move","xml.inputformat.node.path":"/catalog/book/prices","xml.inputformat.path.name":"hdfs://10.210.0.16:8020/cdap/namespaces/default/data/xmlreadersource/","xml.inputformat.processed.data.temp.folder":"/tmp/XMLInvalidNodePathTrackingTable1541818399723","xml.inputformat.processed.files":"[\"hdfs://10.210.0.16:8020/cdap/namespaces/default/data/xmlreadersource/catalogProcessedFile.xml\"]","xml.inputformat.target.folder":"hdfs://10.210.0.16:8020/cdap/namespaces/default/data/xmlreadertarget/"}},{"name":"XMLInvalidNodePathTrackingTable","type":"co.cask.cdap.api.dataset.lib.KeyValueTable","properties":{}},{"name":"output-batchsink-invalid-nodepath-test","type":"co.cask.cdap.api.dataset.table.Table","properties":{"schema":"{\"type\":\"record\",\"name\":\"xmlSink\",\"fields\":[{\"name\":\"offset\",\"type\":\"string\"},{\"name\":\"filename\",\"type\":\"string\"},{\"name\":\"record\",\"type\":\"string\"}]}","schema.row.field":"offset"}}]
10-Nov-2018 02:56:09 2018-11-10 02:56:09,096 - INFO  [main:c.c.c.t.AudiTestBase$1@125] - Making request: DELETE http://10.210.0.16:11015/v3/namespaces/default/data/datasets/xmlreadersource
10-Nov-2018 02:56:15 2018-11-10 02:56:15,752 - INFO  [main:c.c.c.t.AudiTestBase$1@134] - Received response: [200] Response Body:
10-Nov-2018 02:56:15 2018-11-10 02:56:15,753 - INFO  [main:c.c.c.t.AudiTestBase$1@125] - Making request: DELETE http://10.210.0.16:11015/v3/namespaces/default/data/datasets/xmlreadertarget
10-Nov-2018 02:56:15 2018-11-10 02:56:15,947 - INFO  [main:c.c.c.t.AudiTestBase$1@134] - Received response: [200] Response Body:
10-Nov-2018 02:56:15 2018-11-10 02:56:15,947 - INFO  [main:c.c.c.t.AudiTestBase$1@125] - Making request: DELETE http://10.210.0.16:11015/v3/namespaces/default/data/datasets/XMLReaderInvalidNodePathTest
10-Nov-2018 02:56:16 2018-11-10 02:56:16,135 - INFO  [main:c.c.c.t.AudiTestBase$1@134] - Received response: [200] Response Body:
10-Nov-2018 02:56:16 2018-11-10 02:56:16,136 - INFO  [main:c.c.c.t.AudiTestBase$1@125] - Making request: DELETE http://10.210.0.16:11015/v3/namespaces/default/data/datasets/XMLInvalidNodePathTrackingTable
10-Nov-2018 02:56:20 2018-11-10 02:56:20,058 - INFO  [main:c.c.c.t.AudiTestBase$1@134] - Received response: [200] Response Body:
10-Nov-2018 02:56:20 2018-11-10 02:56:20,058 - INFO  [main:c.c.c.t.AudiTestBase$1@125] - Making request: DELETE http://10.210.0.16:11015/v3/namespaces/default/data/datasets/output-batchsink-invalid-nodepath-test
10-Nov-2018 02:56:23 2018-11-10 02:56:23,958 - INFO  [main:c.c.c.t.AudiTestBase$1@134] - Received response: [200] Response Body:
10-Nov-2018 02:56:23 2018-11-10 02:56:23,959 - INFO  [main:c.c.c.t.AudiTestBase$1@125] - Making request: GET http://10.210.0.16:11015/v3/namespaces/default/artifacts?scope=USER
10-Nov-2018 02:56:24 2018-11-10 02:56:24,004 - INFO  [main:c.c.c.t.AudiTestBase$1@134] - Received response: [200] Response Body: [{"name":"KVTableDatasetApp","version":"1.0.0-SNAPSHOT","scope":"USER"},{"name":"TableDatasetApp","version":"1.0.0-SNAPSHOT","scope":"USER"},{"name":"UploadFile","version":"1.0.0-SNAPSHOT","scope":"USER"}]
10-Nov-2018 02:56:24 2018-11-10 02:56:24,005 - INFO  [main:c.c.c.t.AudiTestBase$1@125] - Making request: DELETE http://10.210.0.16:11015/v3/namespaces/default/artifacts/KVTableDatasetApp/versions/1.0.0-SNAPSHOT
10-Nov-2018 02:56:24 2018-11-10 02:56:24,142 - INFO  [main:c.c.c.t.AudiTestBase$1@134] - Received response: [200] Response Body:
10-Nov-2018 02:56:24 2018-11-10 02:56:24,143 - INFO  [main:c.c.c.t.AudiTestBase$1@125] - Making request: DELETE http://10.210.0.16:11015/v3/namespaces/default/artifacts/TableDatasetApp/versions/1.0.0-SNAPSHOT
10-Nov-2018 02:56:24 2018-11-10 02:56:24,240 - INFO  [main:c.c.c.t.AudiTestBase$1@134] - Received response: [200] Response Body:
10-Nov-2018 02:56:24 2018-11-10 02:56:24,240 - INFO  [main:c.c.c.t.AudiTestBase$1@125] - Making request: DELETE http://10.210.0.16:11015/v3/namespaces/default/artifacts/UploadFile/versions/1.0.0-SNAPSHOT
10-Nov-2018 02:56:24 2018-11-10 02:56:24,335 - INFO  [main:c.c.c.t.AudiTestBase$1@134] - Received response: [200] Response Body:
10-Nov-2018 02:56:24 2018-11-10 02:56:24,336 - INFO  [main:c.c.c.t.AudiTestBase$1@125] - Making request: GET http://10.210.0.16:11015/v3/namespaces/default/apps
10-Nov-2018 02:56:24 2018-11-10 02:56:24,391 - INFO  [main:c.c.c.t.AudiTestBase$1@134] - Received response: [200] Response Body: []
10-Nov-2018 02:56:24 2018-11-10 02:56:24,391 - INFO  [main:c.c.c.t.AudiTestBase$1@125] - Making request: GET http://10.210.0.16:11015/v3/namespaces/default/data/datasets
10-Nov-2018 02:56:24 2018-11-10 02:56:24,475 - INFO  [main:c.c.c.t.AudiTestBase$1@134] - Received response: [200] Response Body: []
10-Nov-2018 02:56:24 2018-11-10 02:56:24,475 - INFO  [main:c.c.c.t.AudiTestBase$1@125] - Making request: GET http://10.210.0.16:11015/v3/namespaces/default/streams
10-Nov-2018 02:56:24 2018-11-10 02:56:24,560 - INFO  [main:c.c.c.t.AudiTestBase$1@134] - Received response: [200] Response Body: []
10-Nov-2018 02:56:24 2018-11-10 02:56:24,560 - INFO  [main:c.c.c.t.IntegrationTestBase@131] - Completed tearDown.
10-Nov-2018 02:56:25 Tests run: 64, Failures: 0, Errors: 7, Skipped: 0, Time elapsed: 11,412.383 sec <<< FAILURE! - in co.cask.cdap.test.suite.AllTests
10-Nov-2018 02:56:25 testJoinerSpark(co.cask.cdap.app.etl.batch.BatchJoinerTest)  Time elapsed: 159.117 sec  <<< ERROR!
10-Nov-2018 02:56:25 java.lang.RuntimeException: java.io.IOException: 500: Spark not found. Please set environment variable SPARK_HOME
10-Nov-2018 02:56:25         at co.cask.cdap.client.util.RESTClient.execute(RESTClient.java:132)
10-Nov-2018 02:56:25         at co.cask.cdap.client.util.RESTClient.execute(RESTClient.java:69)
10-Nov-2018 02:56:25         at co.cask.cdap.client.ProgramClient.start(ProgramClient.java:155)
10-Nov-2018 02:56:25         at co.cask.cdap.test.remote.RemoteApplicationManager.startProgram(RemoteApplicationManager.java:151)
10-Nov-2018 02:56:25         at co.cask.cdap.test.AbstractProgramManager.start(AbstractProgramManager.java:57)
10-Nov-2018 02:56:25         at co.cask.cdap.test.AbstractProgramManager.start(AbstractProgramManager.java:52)
10-Nov-2018 02:56:25         at co.cask.cdap.app.etl.batch.BatchJoinerTest.testJoiner(BatchJoinerTest.java:224)
10-Nov-2018 02:56:25         at co.cask.cdap.app.etl.batch.BatchJoinerTest.testJoinerSpark(BatchJoinerTest.java:102)
10-Nov-2018 02:56:25
10-Nov-2018 02:56:25 testDataStreams(co.cask.cdap.app.etl.********.DataStreamsTest)  Time elapsed: 47.209 sec  <<< ERROR!
10-Nov-2018 02:56:25 java.io.IOException: java.lang.IllegalArgumentException: No plugin of type streamingsource and name File could be found for stage File.
10-Nov-2018 02:56:25         at co.cask.cdap.client.util.RESTClient.upload(RESTClient.java:160)
10-Nov-2018 02:56:25         at co.cask.cdap.client.ApplicationClient.deploy(ApplicationClient.java:614)
10-Nov-2018 02:56:25         at co.cask.cdap.test.IntegrationTestManager.deployApplication(IntegrationTestManager.java:203)
10-Nov-2018 02:56:25         at co.cask.cdap.test.IntegrationTestBase.deployApplication(IntegrationTestBase.java:400)
10-Nov-2018 02:56:25         at co.cask.cdap.app.etl.********.DataStreamsTest.testDataStreams(DataStreamsTest.java:145)
10-Nov-2018 02:56:25
10-Nov-2018 02:56:25 test(co.cask.cdap.apps.spark.sparkpagerank.SparkPageRankAppTest)  Time elapsed: 3.578 sec  <<< ERROR!
10-Nov-2018 02:56:25 java.lang.RuntimeException: java.io.IOException: java.lang.IllegalStateException: Missing Spark related class co.cask.cdap.api.spark.JavaSparkMain. It may be caused by unavailability of Spark. Please verify environment variable SPARK_HOME is set correctly
10-Nov-2018 02:56:25         at co.cask.cdap.client.util.RESTClient.upload(RESTClient.java:160)
10-Nov-2018 02:56:25         at co.cask.cdap.client.ApplicationClient.deployApp(ApplicationClient.java:671)
10-Nov-2018 02:56:25         at co.cask.cdap.client.ApplicationClient.deploy(ApplicationClient.java:551)
10-Nov-2018 02:56:25         at co.cask.cdap.client.ApplicationClient.deploy(ApplicationClient.java:527)
10-Nov-2018 02:56:25         at co.cask.cdap.test.IntegrationTestManager.deployApplication(IntegrationTestManager.java:183)
10-Nov-2018 02:56:25         at co.cask.cdap.test.AbstractTestManager.deployApplication(AbstractTestManager.java:159)
10-Nov-2018 02:56:25         at co.cask.cdap.test.IntegrationTestBase.deployApplication(IntegrationTestBase.java:391)
10-Nov-2018 02:56:25         at co.cask.cdap.test.IntegrationTestBase.deployApplication(IntegrationTestBase.java:395)
10-Nov-2018 02:56:25         at co.cask.cdap.apps.spark.sparkpagerank.SparkPageRankAppTest.test(SparkPageRankAppTest.java:109)
10-Nov-2018 02:56:25
10-Nov-2018 02:56:25 testSpark(co.cask.cdap.app.etl.batch.TPFSSinkSourceTest)  Time elapsed: 64.622 sec  <<< ERROR!
10-Nov-2018 02:56:25 java.lang.RuntimeException: java.io.IOException: 500: Spark not found. Please set environment variable SPARK_HOME
10-Nov-2018 02:56:25         at co.cask.cdap.client.util.RESTClient.execute(RESTClient.java:132)
10-Nov-2018 02:56:25         at co.cask.cdap.client.util.RESTClient.execute(RESTClient.java:69)
10-Nov-2018 02:56:25         at co.cask.cdap.client.ProgramClient.start(ProgramClient.java:155)
10-Nov-2018 02:56:25         at co.cask.cdap.test.remote.RemoteApplicationManager.startProgram(RemoteApplicationManager.java:151)
10-Nov-2018 02:56:25         at co.cask.cdap.test.AbstractProgramManager.start(AbstractProgramManager.java:57)
10-Nov-2018 02:56:25         at co.cask.cdap.app.etl.batch.TPFSSinkSourceTest.testStreamTPFSWithProjection(TPFSSinkSourceTest.java:107)
10-Nov-2018 02:56:25         at co.cask.cdap.app.etl.batch.TPFSSinkSourceTest.testSpark(TPFSSinkSourceTest.java:85)
10-Nov-2018 02:56:25
10-Nov-2018 02:56:25 testLDA(co.cask.cdap.apps.workflow.WorkflowTest)  Time elapsed: 8.001 sec  <<< ERROR!
10-Nov-2018 02:56:25 java.io.IOException: java.lang.IllegalStateException: Missing Spark related class co.cask.cdap.api.spark.SparkMain. It may be caused by unavailability of Spark. Please verify environment variable SPARK_HOME is set correctly
10-Nov-2018 02:56:25         at co.cask.cdap.client.util.RESTClient.upload(RESTClient.java:160)
10-Nov-2018 02:56:25         at co.cask.cdap.client.ApplicationClient.deploy(ApplicationClient.java:614)
10-Nov-2018 02:56:25         at co.cask.cdap.test.IntegrationTestManager.deployApplication(IntegrationTestManager.java:203)
10-Nov-2018 02:56:25         at co.cask.cdap.test.IntegrationTestBase.deployApplication(IntegrationTestBase.java:400)
10-Nov-2018 02:56:25         at co.cask.cdap.apps.workflow.WorkflowTest.testLDA(WorkflowTest.java:86)
10-Nov-2018 02:56:25
10-Nov-2018 02:56:25 testKMeans(co.cask.cdap.apps.workflow.WorkflowTest)  Time elapsed: 7.997 sec  <<< ERROR!
10-Nov-2018 02:56:25 java.io.IOException: java.lang.IllegalStateException: Missing Spark related class co.cask.cdap.api.spark.SparkMain. It may be caused by unavailability of Spark. Please verify environment variable SPARK_HOME is set correctly
10-Nov-2018 02:56:25         at co.cask.cdap.client.util.RESTClient.upload(RESTClient.java:160)
10-Nov-2018 02:56:25         at co.cask.cdap.client.ApplicationClient.deploy(ApplicationClient.java:614)
10-Nov-2018 02:56:25         at co.cask.cdap.test.IntegrationTestManager.deployApplication(IntegrationTestManager.java:203)
10-Nov-2018 02:56:25         at co.cask.cdap.test.IntegrationTestBase.deployApplication(IntegrationTestBase.java:400)
10-Nov-2018 02:56:25         at co.cask.cdap.apps.workflow.WorkflowTest.testKMeans(WorkflowTest.java:103)
10-Nov-2018 02:56:25
10-Nov-2018 02:56:25 testWranglerSpark(co.cask.cdap.app.etl.wrangler.WranglerTest)  Time elapsed: 76.224 sec  <<< ERROR!
10-Nov-2018 02:56:25 java.lang.RuntimeException: java.io.IOException: 500: Spark not found. Please set environment variable SPARK_HOME
10-Nov-2018 02:56:25         at co.cask.cdap.client.util.RESTClient.execute(RESTClient.java:132)
10-Nov-2018 02:56:25         at co.cask.cdap.client.util.RESTClient.execute(RESTClient.java:69)
10-Nov-2018 02:56:25         at co.cask.cdap.client.ProgramClient.start(ProgramClient.java:155)
10-Nov-2018 02:56:25         at co.cask.cdap.test.remote.RemoteApplicationManager.startProgram(RemoteApplicationManager.java:151)
10-Nov-2018 02:56:25         at co.cask.cdap.test.AbstractProgramManager.start(AbstractProgramManager.java:57)
10-Nov-2018 02:56:25         at co.cask.cdap.test.AbstractProgramManager.start(AbstractProgramManager.java:52)
10-Nov-2018 02:56:25         at co.cask.cdap.app.etl.wrangler.WranglerTest.testWrangler(WranglerTest.java:190)
10-Nov-2018 02:56:25         at co.cask.cdap.app.etl.wrangler.WranglerTest.testWranglerSpark(WranglerTest.java:99)
10-Nov-2018 02:56:25
10-Nov-2018 02:56:25
10-Nov-2018 02:56:25 Results :
10-Nov-2018 02:56:25
10-Nov-2018 02:56:25 Tests in error:
10-Nov-2018 02:56:25   BatchJoinerTest.testJoinerSpark:102->testJoiner:224 » Runtime java.io.IOExcept...
10-Nov-2018 02:56:25   TPFSSinkSourceTest.testSpark:85->testStreamTPFSWithProjection:107 » Runtime ja...
10-Nov-2018 02:56:25   DataStreamsTest.testDataStreams:145->IntegrationTestBase.deployApplication:400 » IO
10-Nov-2018 02:56:25   WranglerTest.testWranglerSpark:99->testWrangler:190 » Runtime java.io.IOExcept...
10-Nov-2018 02:56:25   SparkPageRankAppTest.test:109->IntegrationTestBase.deployApplication:395->IntegrationTestBase.deployApplication:391 » Runtime
10-Nov-2018 02:56:25   WorkflowTest.testKMeans:103->IntegrationTestBase.deployApplication:400 » IO ja...
10-Nov-2018 02:56:25   WorkflowTest.testLDA:86->IntegrationTestBase.deployApplication:400 » IO java.l...
10-Nov-2018 02:56:25
10-Nov-2018 02:56:25 Tests run: 64, Failures: 0, Errors: 7, Skipped: 0
10-Nov-2018 02:56:25
10-Nov-2018 02:56:25 [INFO] ------------------------------------------------------------------------
10-Nov-2018 02:56:25 [INFO] Reactor Summary:
10-Nov-2018 02:56:25 [INFO]
10-Nov-2018 02:56:25 [INFO] integration-test .................................. SUCCESS [11.656s]
10-Nov-2018 02:56:25 [INFO] integration-test-core ............................. SUCCESS [4.850s]
10-Nov-2018 02:56:25 [INFO] integration-test-remote ........................... FAILURE [3:10:19.797s]
10-Nov-2018 02:56:25 [INFO] integration-test-standalone ....................... SKIPPED
10-Nov-2018 02:56:25 [INFO] upgrade-test ...................................... SKIPPED
10-Nov-2018 02:56:25 [INFO] long-running-test ................................. SKIPPED
10-Nov-2018 02:56:25 [INFO] ------------------------------------------------------------------------
10-Nov-2018 02:56:25 [INFO] BUILD FAILURE
10-Nov-2018 02:56:25 [INFO] ------------------------------------------------------------------------
10-Nov-2018 02:56:25 [INFO] Total time: 3:10:36.825s
10-Nov-2018 02:56:25 [INFO] Finished at: Sat Nov 10 02:56:25 UTC 2018
10-Nov-2018 02:56:26 [INFO] Final Memory: 85M/724M
10-Nov-2018 02:56:26 [INFO] ------------------------------------------------------------------------
10-Nov-2018 02:56:26 [ERROR] Failed to execute goal org.apache.maven.plugins:maven-surefire-plugin:2.18.1:test (default-test) on project integration-test-remote: There are test failures.
10-Nov-2018 02:56:26 [ERROR]
10-Nov-2018 02:56:26 [ERROR] Please refer to /var/bamboo/xml-data/build-dir/IT-ITN5-DSTC514/cdap-integration-tests/integration-test-remote/target/surefire-reports for the individual test results.
10-Nov-2018 02:56:26 [ERROR] -> [Help 1]
10-Nov-2018 02:56:26 [ERROR]
10-Nov-2018 02:56:26 [ERROR] To see the full stack trace of the errors, re-run Maven with the -e switch.
10-Nov-2018 02:56:26 [ERROR] Re-run Maven using the -X switch to enable full debug logging.
10-Nov-2018 02:56:26 [ERROR]
10-Nov-2018 02:56:26 [ERROR] For more information about the errors and possible solutions, please read the following articles:
10-Nov-2018 02:56:26 [ERROR] [Help 1] http://cwiki.apache.org/confluence/display/MAVEN/MojoFailureException
10-Nov-2018 02:56:26 [ERROR]
10-Nov-2018 02:56:26 [ERROR] After correcting the problems, you can resume the build with the command
10-Nov-2018 02:56:26 [ERROR]   mvn <goals> -rf :integration-test-remote
10-Nov-2018 02:56:26 Failing task since return code of [/opt/maven/bin/mvn --batch-mode -Djava.io.tmpdir=/tmp/IT-ITN5-DSTC514 clean test -U -Dtest=AllTests -Dcdap.username=******** -Dcdap.password=******** -DinstanceUri=http://10.210.0.16] was 1 while expected 0
10-Nov-2018 02:56:26 Parsing test results under /var/bamboo/xml-data/build-dir/IT-ITN5-DSTC514...
10-Nov-2018 02:56:26 Finished task 'Integration test - cluster' with result: Failed
10-Nov-2018 02:56:26 Running post build plugin 'Docker Container Cleanup'
10-Nov-2018 02:56:26 Running post build plugin 'NCover Results Collector'
10-Nov-2018 02:56:26 Running post build plugin 'Clover Results Collector'
10-Nov-2018 02:56:26 Running post build plugin 'npm Cache Cleanup'
10-Nov-2018 02:56:26 Running post build plugin 'Artifact Copier'
10-Nov-2018 02:56:26 Finalising the build...
10-Nov-2018 02:56:26 Stopping timer.
10-Nov-2018 02:56:26 Build IT-ITN5-DSTC514-27 completed.
10-Nov-2018 02:56:26 Running on server: post build plugin 'NCover Results Collector'
10-Nov-2018 02:56:26 Running on server: post build plugin 'Build Hanging Detection Configuration'
10-Nov-2018 02:56:26 Running on server: post build plugin 'Clover Delta Calculator'
10-Nov-2018 02:56:26 Running on server: post build plugin 'Maven Dependencies Postprocessor'
10-Nov-2018 02:56:26 All post build plugins have finished
10-Nov-2018 02:56:27 Generating build results summary...
10-Nov-2018 02:56:27 Saving build results to disk...
10-Nov-2018 02:56:27 Logging substituted variables...
10-Nov-2018 02:56:27 Indexing build results...
10-Nov-2018 02:56:27 Finished building IT-ITN5-DSTC514-27.