Build #27

Build: #27 failed

Job: Distro Tests - CDH 5.13 failed

Job result summary

Completed
Duration
293 minutes
Agent
bamboo-agent03
Revision
df613f36352f3acf50b029372a3492e16e4d0175 df613f36352f3acf50b029372a3492e16e4d0175
Total tests
64

Tests

  • 64 tests in total
  • 7 tests failed
  • 7 failures are new
  • 188 minutes taken in total.
New test failures 7
Status Test Duration
Collapse Failed BatchJoinerTest testJoinerSpark History
2 mins
java.lang.RuntimeException: java.io.IOException: 500: Spark not found. Please set environment variable SPARK_HOME
	at co.cask.cdap.client.util.RESTClient.execute(RESTClient.java:132)
	at co.cask.cdap.client.util.RESTClient.execute(RESTClient.java:69)
	at co.cask.cdap.client.ProgramClient.start(ProgramClient.java:155)
	at co.cask.cdap.test.remote.RemoteApplicationManager.startProgram(RemoteApplicationManager.java:151)
	at co.cask.cdap.test.AbstractProgramManager.start(AbstractProgramManager.java:57)
	at co.cask.cdap.test.AbstractProgramManager.start(AbstractProgramManager.java:52)
	at co.cask.cdap.app.etl.batch.BatchJoinerTest.testJoiner(BatchJoinerTest.java:224)
(1 more lines...)
Collapse Failed TPFSSinkSourceTest testSpark History
1 min
java.lang.RuntimeException: java.io.IOException: 500: Spark not found. Please set environment variable SPARK_HOME
	at co.cask.cdap.client.util.RESTClient.execute(RESTClient.java:132)
	at co.cask.cdap.client.util.RESTClient.execute(RESTClient.java:69)
	at co.cask.cdap.client.ProgramClient.start(ProgramClient.java:155)
	at co.cask.cdap.test.remote.RemoteApplicationManager.startProgram(RemoteApplicationManager.java:151)
	at co.cask.cdap.test.AbstractProgramManager.start(AbstractProgramManager.java:57)
	at co.cask.cdap.app.etl.batch.TPFSSinkSourceTest.testStreamTPFSWithProjection(TPFSSinkSourceTest.java:107)
	at co.cask.cdap.app.etl.batch.TPFSSinkSourceTest.testSpark(TPFSSinkSourceTest.java:85)
Collapse Failed DataStreamsTest testDataStreams History
50 secs
java.io.IOException: java.lang.IllegalArgumentException: No plugin of type streamingsource and name File could be found for stage File.
	at co.cask.cdap.client.util.RESTClient.upload(RESTClient.java:160)
	at co.cask.cdap.client.ApplicationClient.deploy(ApplicationClient.java:614)
	at co.cask.cdap.test.IntegrationTestManager.deployApplication(IntegrationTestManager.java:203)
	at co.cask.cdap.test.IntegrationTestBase.deployApplication(IntegrationTestBase.java:400)
	at co.cask.cdap.app.etl.realtime.DataStreamsTest.testDataStreams(DataStreamsTest.java:145)
Collapse Failed WranglerTest testWranglerSpark History
1 min
java.lang.RuntimeException: java.io.IOException: 500: Spark not found. Please set environment variable SPARK_HOME
	at co.cask.cdap.client.util.RESTClient.execute(RESTClient.java:132)
	at co.cask.cdap.client.util.RESTClient.execute(RESTClient.java:69)
	at co.cask.cdap.client.ProgramClient.start(ProgramClient.java:155)
	at co.cask.cdap.test.remote.RemoteApplicationManager.startProgram(RemoteApplicationManager.java:151)
	at co.cask.cdap.test.AbstractProgramManager.start(AbstractProgramManager.java:57)
	at co.cask.cdap.test.AbstractProgramManager.start(AbstractProgramManager.java:52)
	at co.cask.cdap.app.etl.wrangler.WranglerTest.testWrangler(WranglerTest.java:190)
(1 more lines...)
Collapse Failed SparkPageRankAppTest test History
3 secs
java.lang.RuntimeException: java.io.IOException: java.lang.IllegalStateException: Missing Spark related class co.cask.cdap.api.spark.JavaSparkMain. It may be caused by unavailability of Spark. Please verify environment variable SPARK_HOME is set correctly
	at co.cask.cdap.client.util.RESTClient.upload(RESTClient.java:160)
	at co.cask.cdap.client.ApplicationClient.deployApp(ApplicationClient.java:671)
	at co.cask.cdap.client.ApplicationClient.deploy(ApplicationClient.java:551)
	at co.cask.cdap.client.ApplicationClient.deploy(ApplicationClient.java:527)
	at co.cask.cdap.test.IntegrationTestManager.deployApplication(IntegrationTestManager.java:183)
	at co.cask.cdap.test.AbstractTestManager.deployApplication(AbstractTestManager.java:159)
	at co.cask.cdap.test.IntegrationTestBase.deployApplication(IntegrationTestBase.java:391)
(2 more lines...)
Collapse Failed WorkflowTest testKMeans History
7 secs
java.io.IOException: java.lang.IllegalStateException: Missing Spark related class co.cask.cdap.api.spark.SparkMain. It may be caused by unavailability of Spark. Please verify environment variable SPARK_HOME is set correctly
	at co.cask.cdap.client.util.RESTClient.upload(RESTClient.java:160)
	at co.cask.cdap.client.ApplicationClient.deploy(ApplicationClient.java:614)
	at co.cask.cdap.test.IntegrationTestManager.deployApplication(IntegrationTestManager.java:203)
	at co.cask.cdap.test.IntegrationTestBase.deployApplication(IntegrationTestBase.java:400)
	at co.cask.cdap.apps.workflow.WorkflowTest.testKMeans(WorkflowTest.java:103)
Collapse Failed WorkflowTest testLDA History
8 secs
java.io.IOException: java.lang.IllegalStateException: Missing Spark related class co.cask.cdap.api.spark.SparkMain. It may be caused by unavailability of Spark. Please verify environment variable SPARK_HOME is set correctly
	at co.cask.cdap.client.util.RESTClient.upload(RESTClient.java:160)
	at co.cask.cdap.client.ApplicationClient.deploy(ApplicationClient.java:614)
	at co.cask.cdap.test.IntegrationTestManager.deployApplication(IntegrationTestManager.java:203)
	at co.cask.cdap.test.IntegrationTestBase.deployApplication(IntegrationTestBase.java:400)
	at co.cask.cdap.apps.workflow.WorkflowTest.testLDA(WorkflowTest.java:86)

Error summary

The build generated some errors. See the full build log for more details.

Java HotSpot(TM) 64-Bit Server VM warning: ignoring option MaxPermSize=128m; support was removed in 8.0
Warning:  org.apache.xerces.jaxp.SAXParserImpl$JAXPSAXParser: Property 'http://www.oracle.com/xml/jaxp/properties/entityExpansionLimit' is not recognized.
Compiler warnings:
  WARNING:  'org.apache.xerces.jaxp.SAXParserImpl: Property 'http://javax.xml.XMLConstants/property/accessExternalDTD' is not recognized.'
Warning:  org.apache.xerces.parsers.SAXParser: Feature 'http://javax.xml.XMLConstants/feature/secure-processing' is not recognized.
Warning:  org.apache.xerces.parsers.SAXParser: Property 'http://javax.xml.XMLConstants/property/accessExternalDTD' is not recognized.
Warning:  org.apache.xerces.parsers.SAXParser: Property 'http://www.oracle.com/xml/jaxp/properties/entityExpansionLimit' is not recognized.
Warning:  org.apache.xerces.jaxp.SAXParserImpl$JAXPSAXParser: Property 'http://www.oracle.com/xml/jaxp/properties/entityExpansionLimit' is not recognized.
Compiler warnings:
  WARNING:  'org.apache.xerces.jaxp.SAXParserImpl: Property 'http://javax.xml.XMLConstants/property/accessExternalDTD' is not recognized.'
Warning:  org.apache.xerces.parsers.SAXParser: Feature 'http://javax.xml.XMLConstants/feature/secure-processing' is not recognized.
Warning:  org.apache.xerces.parsers.SAXParser: Property 'http://javax.xml.XMLConstants/property/accessExternalDTD' is not recognized.
Warning:  org.apache.xerces.parsers.SAXParser: Property 'http://www.oracle.com/xml/jaxp/properties/entityExpansionLimit' is not recognized.
Warning:  org.apache.xerces.jaxp.SAXParserImpl$JAXPSAXParser: Property 'http://www.oracle.com/xml/jaxp/properties/entityExpansionLimit' is not recognized.
Compiler warnings:
  WARNING:  'org.apache.xerces.jaxp.SAXParserImpl: Property 'http://javax.xml.XMLConstants/property/accessExternalDTD' is not recognized.'
Warning:  org.apache.xerces.parsers.SAXParser: Feature 'http://javax.xml.XMLConstants/feature/secure-processing' is not recognized.
Warning:  org.apache.xerces.parsers.SAXParser: Property 'http://javax.xml.XMLConstants/property/accessExternalDTD' is not recognized.
Warning:  org.apache.xerces.parsers.SAXParser: Property 'http://www.oracle.com/xml/jaxp/properties/entityExpansionLimit' is not recognized.
SLF4J: Class path contains multiple SLF4J bindings.
SLF4J: Found binding in [jar:file:/home/bamboo/.m2/repository/co/cask/cdap/cdap-cli/4.3.2/cdap-cli-4.3.2.jar!/org/slf4j/impl/StaticLoggerBinder.class]
SLF4J: Found binding in [jar:file:/home/bamboo/.m2/repository/co/cask/cdap/cdap-explore-jdbc/4.3.2/cdap-explore-jdbc-4.3.2.jar!/org/slf4j/impl/StaticLoggerBinder.class]
SLF4J: Found binding in [jar:file:/home/bamboo/.m2/repository/ch/qos/logback/logback-classic/1.0.9/logback-classic-1.0.9.jar!/org/slf4j/impl/StaticLoggerBinder.class]
SLF4J: See http://www.slf4j.org/codes.html#multiple_bindings for an explanation.
SLF4J: Actual binding is of type [ch.qos.logback.classic.util.ContextSelectorStaticBinder]