Build #33

Build: #33 failed Scheduled

Logs

The following logs have been generated by the jobs in this branch.
  • Expand all
  • Collapse all
Job Logs
Collapse Distro Tests - CDH 5.11 Spinup and Test Download or View
15-Nov-2018 07:58:44 [INFO] integration-test-core ............................. SUCCESS [4.636s]
15-Nov-2018 07:58:44 [INFO] integration-test-remote ........................... FAILURE [4:24:15.052s]
15-Nov-2018 07:58:44 [INFO] integration-test-standalone ....................... SKIPPED
15-Nov-2018 07:58:44 [INFO] upgrade-test ...................................... SKIPPED
15-Nov-2018 07:58:44 [INFO] long-running-test ................................. SKIPPED
15-Nov-2018 07:58:44 [INFO] ------------------------------------------------------------------------
15-Nov-2018 07:58:44 [INFO] BUILD FAILURE
15-Nov-2018 07:58:44 [INFO] ------------------------------------------------------------------------
15-Nov-2018 07:58:44 [INFO] Total time: 4:24:28.662s
15-Nov-2018 07:58:44 [INFO] Finished at: Thu Nov 15 07:58:44 UTC 2018
15-Nov-2018 07:58:45 [INFO] Final Memory: 86M/858M
15-Nov-2018 07:58:45 [INFO] ------------------------------------------------------------------------
15-Nov-2018 07:58:45 [ERROR] Failed to execute goal org.apache.maven.plugins:maven-surefire-plugin:2.18.1:test (default-test) on project integration-test-remote: There are test failures.
15-Nov-2018 07:58:45 [ERROR]
15-Nov-2018 07:58:45 [ERROR] Please refer to /var/bamboo/xml-data/build-dir/IT-ITN5-DSTC511/cdap-integration-tests/integration-test-remote/target/surefire-reports for the individual test results.
15-Nov-2018 07:58:45 [ERROR] -> [Help 1]
15-Nov-2018 07:58:45 [ERROR]
15-Nov-2018 07:58:45 [ERROR] To see the full stack trace of the errors, re-run Maven with the -e switch.
15-Nov-2018 07:58:45 [ERROR] Re-run Maven using the -X switch to enable full debug logging.
15-Nov-2018 07:58:45 [ERROR]
15-Nov-2018 07:58:45 [ERROR] For more information about the errors and possible solutions, please read the following articles:
15-Nov-2018 07:58:45 [ERROR] [Help 1] http://cwiki.apache.org/confluence/display/MAVEN/MojoFailureException
15-Nov-2018 07:58:45 [ERROR]
15-Nov-2018 07:58:45 [ERROR] After correcting the problems, you can resume the build with the command
15-Nov-2018 07:58:45 [ERROR]   mvn <goals> -rf :integration-test-remote
Collapse Distro Tests - CDH 5.13 Spinup and Test Download or View
15-Nov-2018 07:14:01 [INFO] integration-test-core ............................. SUCCESS [4.928s]
15-Nov-2018 07:14:01 [INFO] integration-test-remote ........................... FAILURE [3:46:28.973s]
15-Nov-2018 07:14:01 [INFO] integration-test-standalone ....................... SKIPPED
15-Nov-2018 07:14:01 [INFO] upgrade-test ...................................... SKIPPED
15-Nov-2018 07:14:01 [INFO] long-running-test ................................. SKIPPED
15-Nov-2018 07:14:01 [INFO] ------------------------------------------------------------------------
15-Nov-2018 07:14:01 [INFO] BUILD FAILURE
15-Nov-2018 07:14:01 [INFO] ------------------------------------------------------------------------
15-Nov-2018 07:14:01 [INFO] Total time: 3:46:42.136s
15-Nov-2018 07:14:01 [INFO] Finished at: Thu Nov 15 07:14:01 UTC 2018
15-Nov-2018 07:14:01 [INFO] Final Memory: 88M/935M
15-Nov-2018 07:14:01 [INFO] ------------------------------------------------------------------------
15-Nov-2018 07:14:01 [ERROR] Failed to execute goal org.apache.maven.plugins:maven-surefire-plugin:2.18.1:test (default-test) on project integration-test-remote: There are test failures.
15-Nov-2018 07:14:01 [ERROR]
15-Nov-2018 07:14:01 [ERROR] Please refer to /var/bamboo/xml-data/build-dir/IT-ITN5-DSTC513/cdap-integration-tests/integration-test-remote/target/surefire-reports for the individual test results.
15-Nov-2018 07:14:01 [ERROR] -> [Help 1]
15-Nov-2018 07:14:01 [ERROR]
15-Nov-2018 07:14:01 [ERROR] To see the full stack trace of the errors, re-run Maven with the -e switch.
15-Nov-2018 07:14:01 [ERROR] Re-run Maven using the -X switch to enable full debug logging.
15-Nov-2018 07:14:01 [ERROR]
15-Nov-2018 07:14:01 [ERROR] For more information about the errors and possible solutions, please read the following articles:
15-Nov-2018 07:14:01 [ERROR] [Help 1] http://cwiki.apache.org/confluence/display/MAVEN/MojoFailureException
15-Nov-2018 07:14:01 [ERROR]
15-Nov-2018 07:14:01 [ERROR] After correcting the problems, you can resume the build with the command
15-Nov-2018 07:14:01 [ERROR]   mvn <goals> -rf :integration-test-remote
Collapse Distro Tests - CDH 5.14 Spinup and Test Download or View
15-Nov-2018 06:39:16 [INFO] integration-test-core ............................. SUCCESS [5.398s]
15-Nov-2018 06:39:16 [INFO] integration-test-remote ........................... FAILURE [3:12:08.399s]
15-Nov-2018 06:39:16 [INFO] integration-test-standalone ....................... SKIPPED
15-Nov-2018 06:39:16 [INFO] upgrade-test ...................................... SKIPPED
15-Nov-2018 06:39:16 [INFO] long-running-test ................................. SKIPPED
15-Nov-2018 06:39:16 [INFO] ------------------------------------------------------------------------
15-Nov-2018 06:39:16 [INFO] BUILD FAILURE
15-Nov-2018 06:39:16 [INFO] ------------------------------------------------------------------------
15-Nov-2018 06:39:16 [INFO] Total time: 3:12:25.817s
15-Nov-2018 06:39:16 [INFO] Finished at: Thu Nov 15 06:39:16 UTC 2018
15-Nov-2018 06:39:17 [INFO] Final Memory: 88M/972M
15-Nov-2018 06:39:17 [INFO] ------------------------------------------------------------------------
15-Nov-2018 06:39:17 [ERROR] Failed to execute goal org.apache.maven.plugins:maven-surefire-plugin:2.18.1:test (default-test) on project integration-test-remote: There are test failures.
15-Nov-2018 06:39:17 [ERROR]
15-Nov-2018 06:39:17 [ERROR] Please refer to /var/bamboo/xml-data/build-dir/IT-ITN5-DSTC514/cdap-integration-tests/integration-test-remote/target/surefire-reports for the individual test results.
15-Nov-2018 06:39:17 [ERROR] -> [Help 1]
15-Nov-2018 06:39:17 [ERROR]
15-Nov-2018 06:39:17 [ERROR] To see the full stack trace of the errors, re-run Maven with the -e switch.
15-Nov-2018 06:39:17 [ERROR] Re-run Maven using the -X switch to enable full debug logging.
15-Nov-2018 06:39:17 [ERROR]
15-Nov-2018 06:39:17 [ERROR] For more information about the errors and possible solutions, please read the following articles:
15-Nov-2018 06:39:17 [ERROR] [Help 1] http://cwiki.apache.org/confluence/display/MAVEN/MojoFailureException
15-Nov-2018 06:39:17 [ERROR]
15-Nov-2018 06:39:17 [ERROR] After correcting the problems, you can resume the build with the command
15-Nov-2018 06:39:17 [ERROR]   mvn <goals> -rf :integration-test-remote
Collapse Distro Tests - CDH 5.6 Spinup and Test Download or View
15-Nov-2018 07:37:03 [INFO] integration-test-core ............................. SUCCESS [5.069s]
15-Nov-2018 07:37:03 [INFO] integration-test-remote ........................... FAILURE [3:43:44.093s]
15-Nov-2018 07:37:03 [INFO] integration-test-standalone ....................... SKIPPED
15-Nov-2018 07:37:03 [INFO] upgrade-test ...................................... SKIPPED
15-Nov-2018 07:37:03 [INFO] long-running-test ................................. SKIPPED
15-Nov-2018 07:37:03 [INFO] ------------------------------------------------------------------------
15-Nov-2018 07:37:03 [INFO] BUILD FAILURE
15-Nov-2018 07:37:03 [INFO] ------------------------------------------------------------------------
15-Nov-2018 07:37:03 [INFO] Total time: 3:43:57.487s
15-Nov-2018 07:37:03 [INFO] Finished at: Thu Nov 15 07:37:03 UTC 2018
15-Nov-2018 07:37:03 [INFO] Final Memory: 87M/906M
15-Nov-2018 07:37:03 [INFO] ------------------------------------------------------------------------
15-Nov-2018 07:37:03 [ERROR] Failed to execute goal org.apache.maven.plugins:maven-surefire-plugin:2.18.1:test (default-test) on project integration-test-remote: There are test failures.
15-Nov-2018 07:37:03 [ERROR]
15-Nov-2018 07:37:03 [ERROR] Please refer to /var/bamboo/xml-data/build-dir/IT-ITN5-DSTC56/cdap-integration-tests/integration-test-remote/target/surefire-reports for the individual test results.
15-Nov-2018 07:37:03 [ERROR] -> [Help 1]
15-Nov-2018 07:37:03 [ERROR]
15-Nov-2018 07:37:03 [ERROR] To see the full stack trace of the errors, re-run Maven with the -e switch.
15-Nov-2018 07:37:03 [ERROR] Re-run Maven using the -X switch to enable full debug logging.
15-Nov-2018 07:37:03 [ERROR]
15-Nov-2018 07:37:03 [ERROR] For more information about the errors and possible solutions, please read the following articles:
15-Nov-2018 07:37:03 [ERROR] [Help 1] http://cwiki.apache.org/confluence/display/MAVEN/MojoFailureException
15-Nov-2018 07:37:03 [ERROR]
15-Nov-2018 07:37:03 [ERROR] After correcting the problems, you can resume the build with the command
15-Nov-2018 07:37:03 [ERROR]   mvn <goals> -rf :integration-test-remote
Collapse Distro Tests - CDH 5.9 Spinup and Test Download or View
15-Nov-2018 07:15:48 [INFO] integration-test-core ............................. SUCCESS [8.825s]
15-Nov-2018 07:15:48 [INFO] integration-test-remote ........................... FAILURE [3:52:28.948s]
15-Nov-2018 07:15:48 [INFO] integration-test-standalone ....................... SKIPPED
15-Nov-2018 07:15:48 [INFO] upgrade-test ...................................... SKIPPED
15-Nov-2018 07:15:48 [INFO] long-running-test ................................. SKIPPED
15-Nov-2018 07:15:48 [INFO] ------------------------------------------------------------------------
15-Nov-2018 07:15:48 [INFO] BUILD FAILURE
15-Nov-2018 07:15:48 [INFO] ------------------------------------------------------------------------
15-Nov-2018 07:15:48 [INFO] Total time: 3:52:56.052s
15-Nov-2018 07:15:48 [INFO] Finished at: Thu Nov 15 07:15:48 UTC 2018
15-Nov-2018 07:15:49 [INFO] Final Memory: 81M/588M
15-Nov-2018 07:15:49 [INFO] ------------------------------------------------------------------------
15-Nov-2018 07:15:49 [ERROR] Failed to execute goal org.apache.maven.plugins:maven-surefire-plugin:2.18.1:test (default-test) on project integration-test-remote: There are test failures.
15-Nov-2018 07:15:49 [ERROR]
15-Nov-2018 07:15:49 [ERROR] Please refer to /var/bamboo/xml-data/build-dir/IT-ITN5-DSTC59/cdap-integration-tests/integration-test-remote/target/surefire-reports for the individual test results.
15-Nov-2018 07:15:49 [ERROR] -> [Help 1]
15-Nov-2018 07:15:49 [ERROR]
15-Nov-2018 07:15:49 [ERROR] To see the full stack trace of the errors, re-run Maven with the -e switch.
15-Nov-2018 07:15:49 [ERROR] Re-run Maven using the -X switch to enable full debug logging.
15-Nov-2018 07:15:49 [ERROR]
15-Nov-2018 07:15:49 [ERROR] For more information about the errors and possible solutions, please read the following articles:
15-Nov-2018 07:15:49 [ERROR] [Help 1] http://cwiki.apache.org/confluence/display/MAVEN/MojoFailureException
15-Nov-2018 07:15:49 [ERROR]
15-Nov-2018 07:15:49 [ERROR] After correcting the problems, you can resume the build with the command
15-Nov-2018 07:15:49 [ERROR]   mvn <goals> -rf :integration-test-remote