Build #29

Build: #29 failed Scheduled

Logs

The following logs have been generated by the jobs in this branch.
  • Expand all
  • Collapse all
Job Logs
Collapse Distro Tests - CDH 5.13 Spinup and Test Download or View
11-Nov-2018 12:56:02 [INFO] integration-test-core ............................. SUCCESS [5.155s]
11-Nov-2018 12:56:02 [INFO] integration-test-remote ........................... FAILURE [3:56:21.684s]
11-Nov-2018 12:56:02 [INFO] integration-test-standalone ....................... SKIPPED
11-Nov-2018 12:56:02 [INFO] upgrade-test ...................................... SKIPPED
11-Nov-2018 12:56:02 [INFO] long-running-test ................................. SKIPPED
11-Nov-2018 12:56:02 [INFO] ------------------------------------------------------------------------
11-Nov-2018 12:56:02 [INFO] BUILD FAILURE
11-Nov-2018 12:56:02 [INFO] ------------------------------------------------------------------------
11-Nov-2018 12:56:02 [INFO] Total time: 3:56:36.408s
11-Nov-2018 12:56:02 [INFO] Finished at: Sun Nov 11 12:56:02 UTC 2018
11-Nov-2018 12:56:02 [INFO] Final Memory: 84M/713M
11-Nov-2018 12:56:02 [INFO] ------------------------------------------------------------------------
11-Nov-2018 12:56:02 [ERROR] Failed to execute goal org.apache.maven.plugins:maven-surefire-plugin:2.18.1:test (default-test) on project integration-test-remote: There are test failures.
11-Nov-2018 12:56:02 [ERROR]
11-Nov-2018 12:56:02 [ERROR] Please refer to /var/bamboo/xml-data/build-dir/IT-ITN5-DSTC513/cdap-integration-tests/integration-test-remote/target/surefire-reports for the individual test results.
11-Nov-2018 12:56:02 [ERROR] -> [Help 1]
11-Nov-2018 12:56:02 [ERROR]
11-Nov-2018 12:56:02 [ERROR] To see the full stack trace of the errors, re-run Maven with the -e switch.
11-Nov-2018 12:56:02 [ERROR] Re-run Maven using the -X switch to enable full debug logging.
11-Nov-2018 12:56:02 [ERROR]
11-Nov-2018 12:56:02 [ERROR] For more information about the errors and possible solutions, please read the following articles:
11-Nov-2018 12:56:02 [ERROR] [Help 1] http://cwiki.apache.org/confluence/display/MAVEN/MojoFailureException
11-Nov-2018 12:56:02 [ERROR]
11-Nov-2018 12:56:02 [ERROR] After correcting the problems, you can resume the build with the command
11-Nov-2018 12:56:02 [ERROR]   mvn <goals> -rf :integration-test-remote
Collapse Distro Tests - CDH 5.14 Spinup and Test Download or View
11-Nov-2018 11:36:10 [INFO] integration-test-core ............................. SUCCESS [4.294s]
11-Nov-2018 11:36:10 [INFO] integration-test-remote ........................... FAILURE [3:30:59.926s]
11-Nov-2018 11:36:10 [INFO] integration-test-standalone ....................... SKIPPED
11-Nov-2018 11:36:10 [INFO] upgrade-test ...................................... SKIPPED
11-Nov-2018 11:36:10 [INFO] long-running-test ................................. SKIPPED
11-Nov-2018 11:36:10 [INFO] ------------------------------------------------------------------------
11-Nov-2018 11:36:10 [INFO] BUILD FAILURE
11-Nov-2018 11:36:10 [INFO] ------------------------------------------------------------------------
11-Nov-2018 11:36:10 [INFO] Total time: 3:31:19.714s
11-Nov-2018 11:36:10 [INFO] Finished at: Sun Nov 11 11:36:10 UTC 2018
11-Nov-2018 11:36:11 [INFO] Final Memory: 88M/997M
11-Nov-2018 11:36:11 [INFO] ------------------------------------------------------------------------
11-Nov-2018 11:36:11 [ERROR] Failed to execute goal org.apache.maven.plugins:maven-surefire-plugin:2.18.1:test (default-test) on project integration-test-remote: There are test failures.
11-Nov-2018 11:36:11 [ERROR]
11-Nov-2018 11:36:11 [ERROR] Please refer to /var/bamboo/xml-data/build-dir/IT-ITN5-DSTC514/cdap-integration-tests/integration-test-remote/target/surefire-reports for the individual test results.
11-Nov-2018 11:36:11 [ERROR] -> [Help 1]
11-Nov-2018 11:36:11 [ERROR]
11-Nov-2018 11:36:11 [ERROR] To see the full stack trace of the errors, re-run Maven with the -e switch.
11-Nov-2018 11:36:11 [ERROR] Re-run Maven using the -X switch to enable full debug logging.
11-Nov-2018 11:36:11 [ERROR]
11-Nov-2018 11:36:11 [ERROR] For more information about the errors and possible solutions, please read the following articles:
11-Nov-2018 11:36:11 [ERROR] [Help 1] http://cwiki.apache.org/confluence/display/MAVEN/MojoFailureException
11-Nov-2018 11:36:11 [ERROR]
11-Nov-2018 11:36:11 [ERROR] After correcting the problems, you can resume the build with the command
11-Nov-2018 11:36:11 [ERROR]   mvn <goals> -rf :integration-test-remote
Collapse Distro Tests - CDH 5.9 Spinup and Test Download or View
11-Nov-2018 13:22:06 [INFO] integration-test-core ............................. SUCCESS [4.609s]
11-Nov-2018 13:22:06 [INFO] integration-test-remote ........................... FAILURE [3:58:57.595s]
11-Nov-2018 13:22:06 [INFO] integration-test-standalone ....................... SKIPPED
11-Nov-2018 13:22:06 [INFO] upgrade-test ...................................... SKIPPED
11-Nov-2018 13:22:06 [INFO] long-running-test ................................. SKIPPED
11-Nov-2018 13:22:06 [INFO] ------------------------------------------------------------------------
11-Nov-2018 13:22:06 [INFO] BUILD FAILURE
11-Nov-2018 13:22:06 [INFO] ------------------------------------------------------------------------
11-Nov-2018 13:22:06 [INFO] Total time: 3:59:09.926s
11-Nov-2018 13:22:06 [INFO] Finished at: Sun Nov 11 13:22:06 UTC 2018
11-Nov-2018 13:22:07 [INFO] Final Memory: 87M/915M
11-Nov-2018 13:22:07 [INFO] ------------------------------------------------------------------------
11-Nov-2018 13:22:07 [ERROR] Failed to execute goal org.apache.maven.plugins:maven-surefire-plugin:2.18.1:test (default-test) on project integration-test-remote: There are test failures.
11-Nov-2018 13:22:07 [ERROR]
11-Nov-2018 13:22:07 [ERROR] Please refer to /var/bamboo/xml-data/build-dir/IT-ITN5-DSTC59/cdap-integration-tests/integration-test-remote/target/surefire-reports for the individual test results.
11-Nov-2018 13:22:07 [ERROR] -> [Help 1]
11-Nov-2018 13:22:07 [ERROR]
11-Nov-2018 13:22:07 [ERROR] To see the full stack trace of the errors, re-run Maven with the -e switch.
11-Nov-2018 13:22:07 [ERROR] Re-run Maven using the -X switch to enable full debug logging.
11-Nov-2018 13:22:07 [ERROR]
11-Nov-2018 13:22:07 [ERROR] For more information about the errors and possible solutions, please read the following articles:
11-Nov-2018 13:22:07 [ERROR] [Help 1] http://cwiki.apache.org/confluence/display/MAVEN/MojoFailureException
11-Nov-2018 13:22:07 [ERROR]
11-Nov-2018 13:22:07 [ERROR] After correcting the problems, you can resume the build with the command
11-Nov-2018 13:22:07 [ERROR]   mvn <goals> -rf :integration-test-remote