Build #27

Build: #27 failed Manual run by Yaojie Feng

Logs

The following logs have been generated by the jobs in this branch.
  • Expand all
  • Collapse all
Job Logs
Collapse Distro Tests - CDH 5.10 Spinup and Test Download or View
10-Nov-2018 02:03:06         from /var/bamboo/xml-data/build-dir/IT-ITN5-DSTC510/cdap-integration-tests/bin/coopr-runner.rb:480:in `poll_until_active'
10-Nov-2018 02:03:06     /opt/coopr/provisioner/lib/provisioner/../../bin/worker:27:in `<main>'
10-Nov-2018 02:03:06         from /var/bamboo/xml-data/build-dir/IT-ITN5-DSTC510/cdap-integration-tests/bin/coopr-runner.rb:606:in `<main>'
10-Nov-2018 02:03:06 2018-11-10T02:03:06Z
10-Nov-2018 02:03:06 2018-11-10T02:03:06Z 2018-11-10T02:02:40Z it-itn5-dstc510-27-37108-1000.coopr.sh cdap INSTALL
10-Nov-2018 02:03:06 2018-11-10T02:03:06Z STDOUT: #<Coopr::Plugin::Utils::CommandExecutionError: Running Chef-solo>
10-Nov-2018 02:03:06 2018-11-10T02:03:06Z STDERR: #<Coopr::Plugin::Utils::CommandExecutionError: Running Chef-solo>
10-Nov-2018 02:03:06     /opt/coopr/provisioner/lib/provisioner/plugin/utils.rb:120:in `ssh_exec!'
10-Nov-2018 02:03:06     /opt/coopr/provisioner/lib/provisioner/worker/plugins/automators/chef_solo_automator/chef_solo_automator.rb:261:in `block in runchef'
10-Nov-2018 02:03:06     /opt/coopr/provisioner/embedded/lib/ruby/gems/1.9.1/gems/net-ssh-2.9.2/lib/net/ssh.rb:215:in `start'
10-Nov-2018 02:03:06     /opt/coopr/provisioner/lib/provisioner/worker/plugins/automators/chef_solo_automator/chef_solo_automator.rb:259:in `runchef'
10-Nov-2018 02:03:06     /opt/coopr/provisioner/lib/provisioner/worker/plugins/automators/chef_solo_automator/chef_solo_automator.rb:334:in `install'
10-Nov-2018 02:03:06     /opt/coopr/provisioner/lib/provisioner/plugin/automator.rb:49:in `runTask'
10-Nov-2018 02:03:06     /opt/coopr/provisioner/lib/provisioner/worker.rb:156:in `block in _run_plugin'
10-Nov-2018 02:03:06     /opt/coopr/provisioner/lib/provisioner/worker.rb:155:in `chdir'
10-Nov-2018 02:03:06     /opt/coopr/provisioner/lib/provisioner/worker.rb:155:in `_run_plugin'
10-Nov-2018 02:03:06     /opt/coopr/provisioner/lib/provisioner/worker.rb:187:in `delegate_task'
10-Nov-2018 02:03:06     /opt/coopr/provisioner/lib/provisioner/worker.rb:302:in `block (2 levels) in work'
10-Nov-2018 02:03:06     /opt/coopr/provisioner/lib/provisioner/worker/signalhandler.rb:48:in `dont_interupt'
10-Nov-2018 02:03:06     /opt/coopr/provisioner/lib/provisioner/worker.rb:300:in `block in work'
10-Nov-2018 02:03:06     /opt/coopr/provisioner/lib/provisioner/worker.rb:292:in `loop'
10-Nov-2018 02:03:06     /opt/coopr/provisioner/lib/provisioner/worker.rb:292:in `work'
10-Nov-2018 02:03:06     /opt/coopr/provisioner/lib/provisioner/worker.rb:125:in `run'
10-Nov-2018 02:03:06     /opt/coopr/provisioner/lib/provisioner/../../bin/worker:27:in `<main>'
10-Nov-2018 02:03:06 2018-11-10T02:03:06Z
Collapse Distro Tests - CDH 5.12 Spinup and Test Download or View
10-Nov-2018 03:28:25 2018-11-10T03:28:25Z 2018-11-10T03:27:57Z it-itn5-dstc512-27-37109-1000.coopr.sh cdap INSTALL
10-Nov-2018 03:28:25 2018-11-10T03:28:25Z STDOUT: #<Coopr::Plugin::Utils::CommandExecutionError: Running Chef-solo>
10-Nov-2018 03:28:25 2018-11-10T03:28:25Z STDERR: #<Coopr::Plugin::Utils::CommandExecutionError: Running Chef-solo>
10-Nov-2018 03:28:25     /opt/coopr/provisioner/lib/provisioner/plugin/utils.rb:120:in `ssh_exec!'
10-Nov-2018 03:28:25     /opt/coopr/provisioner/lib/provisioner/worker/plugins/automators/chef_solo_automator/chef_solo_automator.rb:261:in `block in runchef'
10-Nov-2018 03:28:25     /opt/coopr/provisioner/embedded/lib/ruby/gems/1.9.1/gems/net-ssh-2.9.2/lib/net/ssh.rb:215:in `start'
10-Nov-2018 03:28:25     /opt/coopr/provisioner/lib/provisioner/worker/plugins/automators/chef_solo_automator/chef_solo_automator.rb:259:in `runchef'
10-Nov-2018 03:28:25     /opt/coopr/provisioner/lib/provisioner/worker/plugins/automators/chef_solo_automator/chef_solo_automator.rb:334:in `install'
10-Nov-2018 03:28:25     /opt/coopr/provisioner/lib/provisioner/plugin/automator.rb:49:in `runTask'
10-Nov-2018 03:28:25     /opt/coopr/provisioner/lib/provisioner/worker.rb:156:in `block in _run_plugin'
10-Nov-2018 03:28:25     /opt/coopr/provisioner/lib/provisioner/worker.rb:155:in `chdir'
10-Nov-2018 03:28:25     /opt/coopr/provisioner/lib/provisioner/worker.rb:155:in `_run_plugin'
10-Nov-2018 03:28:25     /opt/coopr/provisioner/lib/provisioner/worker.rb:187:in `delegate_task'
10-Nov-2018 03:28:25     /opt/coopr/provisioner/lib/provisioner/worker.rb:302:in `block (2 levels) in work'
10-Nov-2018 03:28:25     /opt/coopr/provisioner/lib/provisioner/worker/signalhandler.rb:48:in `dont_interupt'
10-Nov-2018 03:28:25     /opt/coopr/provisioner/lib/provisioner/worker.rb:300:in `block in work'
10-Nov-2018 03:28:25     /opt/coopr/provisioner/lib/provisioner/worker.rb:292:in `loop'
10-Nov-2018 03:28:25     /opt/coopr/provisioner/lib/provisioner/worker.rb:292:in `work'
10-Nov-2018 03:28:25     /opt/coopr/provisioner/lib/provisioner/worker.rb:125:in `run'
10-Nov-2018 03:28:25     /opt/coopr/provisioner/lib/provisioner/../../bin/worker:27:in `<main>'
10-Nov-2018 03:28:25 2018-11-10T03:28:25Z
10-Nov-2018 03:28:25 /var/bamboo/xml-data/build-dir/IT-ITN5-DSTC512/cdap-integration-tests/bin/coopr-runner.rb:483:in `block in poll_until_active': Cluster 00037109 is not in an active or pending state (RuntimeError)
10-Nov-2018 03:28:25         from /var/bamboo/xml-data/build-dir/IT-ITN5-DSTC512/cdap-integration-tests/bin/coopr-runner.rb:480:in `loop'
10-Nov-2018 03:28:25         from /var/bamboo/xml-data/build-dir/IT-ITN5-DSTC512/cdap-integration-tests/bin/coopr-runner.rb:480:in `poll_until_active'
10-Nov-2018 03:28:25         from /var/bamboo/xml-data/build-dir/IT-ITN5-DSTC512/cdap-integration-tests/bin/coopr-runner.rb:606:in `<main>'
Collapse Distro Tests - CDH 5.13 Spinup and Test Download or View
10-Nov-2018 03:16:29 [INFO] integration-test-core ............................. SUCCESS [10.372s]
10-Nov-2018 03:16:29 [INFO] integration-test-remote ........................... FAILURE [3:34:29.402s]
10-Nov-2018 03:16:29 [INFO] integration-test-standalone ....................... SKIPPED
10-Nov-2018 03:16:29 [INFO] upgrade-test ...................................... SKIPPED
10-Nov-2018 03:16:29 [INFO] long-running-test ................................. SKIPPED
10-Nov-2018 03:16:29 [INFO] ------------------------------------------------------------------------
10-Nov-2018 03:16:29 [INFO] BUILD FAILURE
10-Nov-2018 03:16:29 [INFO] ------------------------------------------------------------------------
10-Nov-2018 03:16:29 [INFO] Total time: 3:35:07.631s
10-Nov-2018 03:16:29 [INFO] Finished at: Sat Nov 10 03:16:29 UTC 2018
10-Nov-2018 03:16:29 [INFO] Final Memory: 80M/445M
10-Nov-2018 03:16:29 [INFO] ------------------------------------------------------------------------
10-Nov-2018 03:16:29 [ERROR] Failed to execute goal org.apache.maven.plugins:maven-surefire-plugin:2.18.1:test (default-test) on project integration-test-remote: There are test failures.
10-Nov-2018 03:16:29 [ERROR]
10-Nov-2018 03:16:29 [ERROR] Please refer to /var/bamboo/xml-data/build-dir/IT-ITN5-DSTC513/cdap-integration-tests/integration-test-remote/target/surefire-reports for the individual test results.
10-Nov-2018 03:16:29 [ERROR] -> [Help 1]
10-Nov-2018 03:16:29 [ERROR]
10-Nov-2018 03:16:29 [ERROR] To see the full stack trace of the errors, re-run Maven with the -e switch.
10-Nov-2018 03:16:29 [ERROR] Re-run Maven using the -X switch to enable full debug logging.
10-Nov-2018 03:16:29 [ERROR]
10-Nov-2018 03:16:29 [ERROR] For more information about the errors and possible solutions, please read the following articles:
10-Nov-2018 03:16:29 [ERROR] [Help 1] http://cwiki.apache.org/confluence/display/MAVEN/MojoFailureException
10-Nov-2018 03:16:29 [ERROR]
10-Nov-2018 03:16:29 [ERROR] After correcting the problems, you can resume the build with the command
10-Nov-2018 03:16:29 [ERROR]   mvn <goals> -rf :integration-test-remote
Collapse Distro Tests - CDH 5.14 Spinup and Test Download or View
10-Nov-2018 02:56:25 [INFO] integration-test-core ............................. SUCCESS [4.850s]
10-Nov-2018 02:56:25 [INFO] integration-test-remote ........................... FAILURE [3:10:19.797s]
10-Nov-2018 02:56:25 [INFO] integration-test-standalone ....................... SKIPPED
10-Nov-2018 02:56:25 [INFO] upgrade-test ...................................... SKIPPED
10-Nov-2018 02:56:25 [INFO] long-running-test ................................. SKIPPED
10-Nov-2018 02:56:25 [INFO] ------------------------------------------------------------------------
10-Nov-2018 02:56:25 [INFO] BUILD FAILURE
10-Nov-2018 02:56:25 [INFO] ------------------------------------------------------------------------
10-Nov-2018 02:56:25 [INFO] Total time: 3:10:36.825s
10-Nov-2018 02:56:25 [INFO] Finished at: Sat Nov 10 02:56:25 UTC 2018
10-Nov-2018 02:56:26 [INFO] Final Memory: 85M/724M
10-Nov-2018 02:56:26 [INFO] ------------------------------------------------------------------------
10-Nov-2018 02:56:26 [ERROR] Failed to execute goal org.apache.maven.plugins:maven-surefire-plugin:2.18.1:test (default-test) on project integration-test-remote: There are test failures.
10-Nov-2018 02:56:26 [ERROR]
10-Nov-2018 02:56:26 [ERROR] Please refer to /var/bamboo/xml-data/build-dir/IT-ITN5-DSTC514/cdap-integration-tests/integration-test-remote/target/surefire-reports for the individual test results.
10-Nov-2018 02:56:26 [ERROR] -> [Help 1]
10-Nov-2018 02:56:26 [ERROR]
10-Nov-2018 02:56:26 [ERROR] To see the full stack trace of the errors, re-run Maven with the -e switch.
10-Nov-2018 02:56:26 [ERROR] Re-run Maven using the -X switch to enable full debug logging.
10-Nov-2018 02:56:26 [ERROR]
10-Nov-2018 02:56:26 [ERROR] For more information about the errors and possible solutions, please read the following articles:
10-Nov-2018 02:56:26 [ERROR] [Help 1] http://cwiki.apache.org/confluence/display/MAVEN/MojoFailureException
10-Nov-2018 02:56:26 [ERROR]
10-Nov-2018 02:56:26 [ERROR] After correcting the problems, you can resume the build with the command
10-Nov-2018 02:56:26 [ERROR]   mvn <goals> -rf :integration-test-remote
Collapse Distro Tests - HDP 2.4 Spinup and Test Download or View
10-Nov-2018 04:28:33 [INFO] integration-test-core ............................. SUCCESS [7.194s]
10-Nov-2018 04:28:33 [INFO] integration-test-remote ........................... FAILURE [4:31:35.616s]
10-Nov-2018 04:28:33 [INFO] integration-test-standalone ....................... SKIPPED
10-Nov-2018 04:28:33 [INFO] upgrade-test ...................................... SKIPPED
10-Nov-2018 04:28:33 [INFO] long-running-test ................................. SKIPPED
10-Nov-2018 04:28:33 [INFO] ------------------------------------------------------------------------
10-Nov-2018 04:28:33 [INFO] BUILD FAILURE
10-Nov-2018 04:28:33 [INFO] ------------------------------------------------------------------------
10-Nov-2018 04:28:33 [INFO] Total time: 4:32:11.379s
10-Nov-2018 04:28:33 [INFO] Finished at: Sat Nov 10 04:28:33 UTC 2018
10-Nov-2018 04:28:34 [INFO] Final Memory: 84M/665M
10-Nov-2018 04:28:34 [INFO] ------------------------------------------------------------------------
10-Nov-2018 04:28:34 [ERROR] Failed to execute goal org.apache.maven.plugins:maven-surefire-plugin:2.18.1:test (default-test) on project integration-test-remote: There are test failures.
10-Nov-2018 04:28:34 [ERROR]
10-Nov-2018 04:28:34 [ERROR] Please refer to /var/bamboo/xml-data/build-dir/IT-ITN5-DSTH24/cdap-integration-tests/integration-test-remote/target/surefire-reports for the individual test results.
10-Nov-2018 04:28:34 [ERROR] -> [Help 1]
10-Nov-2018 04:28:34 [ERROR]
10-Nov-2018 04:28:34 [ERROR] To see the full stack trace of the errors, re-run Maven with the -e switch.
10-Nov-2018 04:28:34 [ERROR] Re-run Maven using the -X switch to enable full debug logging.
10-Nov-2018 04:28:34 [ERROR]
10-Nov-2018 04:28:34 [ERROR] For more information about the errors and possible solutions, please read the following articles:
10-Nov-2018 04:28:34 [ERROR] [Help 1] http://cwiki.apache.org/confluence/display/MAVEN/MojoFailureException
10-Nov-2018 04:28:34 [ERROR]
10-Nov-2018 04:28:34 [ERROR] After correcting the problems, you can resume the build with the command
10-Nov-2018 04:28:34 [ERROR]   mvn <goals> -rf :integration-test-remote
Collapse Distro Tests - HDP 2.6 Spinup and Test Download or View
10-Nov-2018 03:34:07 [INFO] integration-test-core ............................. SUCCESS [5.872s]
10-Nov-2018 03:34:07 [INFO] integration-test-remote ........................... FAILURE [3:47:02.581s]
10-Nov-2018 03:34:07 [INFO] integration-test-standalone ....................... SKIPPED
10-Nov-2018 03:34:07 [INFO] upgrade-test ...................................... SKIPPED
10-Nov-2018 03:34:07 [INFO] long-running-test ................................. SKIPPED
10-Nov-2018 03:34:07 [INFO] ------------------------------------------------------------------------
10-Nov-2018 03:34:07 [INFO] BUILD FAILURE
10-Nov-2018 03:34:07 [INFO] ------------------------------------------------------------------------
10-Nov-2018 03:34:07 [INFO] Total time: 3:47:18.298s
10-Nov-2018 03:34:07 [INFO] Finished at: Sat Nov 10 03:34:07 UTC 2018
10-Nov-2018 03:34:07 [INFO] Final Memory: 88M/992M
10-Nov-2018 03:34:07 [INFO] ------------------------------------------------------------------------
10-Nov-2018 03:34:07 [ERROR] Failed to execute goal org.apache.maven.plugins:maven-surefire-plugin:2.18.1:test (default-test) on project integration-test-remote: There are test failures.
10-Nov-2018 03:34:07 [ERROR]
10-Nov-2018 03:34:07 [ERROR] Please refer to /var/bamboo/xml-data/build-dir/IT-ITN5-DSTH26/cdap-integration-tests/integration-test-remote/target/surefire-reports for the individual test results.
10-Nov-2018 03:34:07 [ERROR] -> [Help 1]
10-Nov-2018 03:34:07 [ERROR]
10-Nov-2018 03:34:07 [ERROR] To see the full stack trace of the errors, re-run Maven with the -e switch.
10-Nov-2018 03:34:07 [ERROR] Re-run Maven using the -X switch to enable full debug logging.
10-Nov-2018 03:34:07 [ERROR]
10-Nov-2018 03:34:07 [ERROR] For more information about the errors and possible solutions, please read the following articles:
10-Nov-2018 03:34:07 [ERROR] [Help 1] http://cwiki.apache.org/confluence/display/MAVEN/MojoFailureException
10-Nov-2018 03:34:07 [ERROR]
10-Nov-2018 03:34:07 [ERROR] After correcting the problems, you can resume the build with the command
10-Nov-2018 03:34:07 [ERROR]   mvn <goals> -rf :integration-test-remote