Build #3

Build: #3 failed Scheduled

Build result summary

Details

Completed
Duration
702 minutes
Labels
None
Revision
5993fca8b981c411bb12fee505a5a600a31a9717 5993fca8b981c411bb12fee505a5a600a31a9717
Total tests
270
Failing since
#1 (Manual run by Ajai Narayan)

Responsible

This build has been failing since #1
No one has taken responsibility

Tests

Existing test failures 6
Status Test Failing since View job Duration
io.cdap.cdap.security.spi.authorization.UnauthorizedException: Invalid source link
	at io.cdap.cdap.client.util.RESTClient.execute(RESTClient.java:129)
	at io.cdap.cdap.client.util.RESTClient.execute(RESTClient.java:82)
	at io.cdap.cdap.app.etl.ETLTestBase.installPluginFromMarket(ETLTestBase.java:207)
	at io.cdap.cdap.app.etl.batch.HivePluginTest.testHivePlugins(HivePluginTest.java:76)
io.cdap.cdap.security.spi.authorization.UnauthorizedException: Invalid source link
	at io.cdap.cdap.client.util.RESTClient.execute(RESTClient.java:129)
	at io.cdap.cdap.client.util.RESTClient.execute(RESTClient.java:82)
	at io.cdap.cdap.app.etl.ETLTestBase.installPluginFromMarket(ETLTestBase.java:207)
	at io.cdap.cdap.app.etl.batch.HivePluginTest.testHivePlugins(HivePluginTest.java:76)
io.cdap.cdap.security.spi.authorization.UnauthorizedException: Invalid source link
	at io.cdap.cdap.client.util.RESTClient.execute(RESTClient.java:129)
	at io.cdap.cdap.client.util.RESTClient.execute(RESTClient.java:82)
	at io.cdap.cdap.app.etl.ETLTestBase.installPluginFromMarket(ETLTestBase.java:207)
	at io.cdap.cdap.app.etl.batch.HivePluginTest.testHivePlugins(HivePluginTest.java:76)
io.cdap.cdap.security.spi.authorization.UnauthorizedException: Invalid source link
	at io.cdap.cdap.client.util.RESTClient.execute(RESTClient.java:129)
	at io.cdap.cdap.client.util.RESTClient.execute(RESTClient.java:82)
	at io.cdap.cdap.app.etl.ETLTestBase.installPluginFromMarket(ETLTestBase.java:207)
	at io.cdap.cdap.app.etl.batch.HivePluginTest.testHivePlugins(HivePluginTest.java:76)
io.cdap.cdap.security.spi.authorization.UnauthorizedException: Invalid source link
	at io.cdap.cdap.client.util.RESTClient.execute(RESTClient.java:129)
	at io.cdap.cdap.client.util.RESTClient.execute(RESTClient.java:82)
	at io.cdap.cdap.app.etl.ETLTestBase.installPluginFromMarket(ETLTestBase.java:207)
	at io.cdap.cdap.app.etl.batch.HivePluginTest.testHivePlugins(HivePluginTest.java:76)
io.cdap.cdap.security.spi.authorization.UnauthorizedException: Invalid source link
	at io.cdap.cdap.client.util.RESTClient.execute(RESTClient.java:129)
	at io.cdap.cdap.client.util.RESTClient.execute(RESTClient.java:82)
	at io.cdap.cdap.app.etl.ETLTestBase.installPluginFromMarket(ETLTestBase.java:207)
	at io.cdap.cdap.app.etl.batch.HivePluginTest.testHivePlugins(HivePluginTest.java:76)
Fixed tests 162
Status Test Failing since View job Duration
Successful KVTableWithProjectionTest testKVTableWithProjection History
Failing since build #2 (Manual run by Ajai Narayan) Distro Tests - CDH 5.10 5 mins
Successful KVTableWithProjectionTest testKVTableWithProjection History
Failing since build #2 (Manual run by Ajai Narayan) Distro Tests - CDH 5.13 5 mins
Successful KVTableWithProjectionTest testKVTableWithProjection History
Failing since build #2 (Manual run by Ajai Narayan) Distro Tests - CDH 5.14 5 mins
Successful KVTableWithProjectionTest testKVTableWithProjection History
Failing since build #2 (Manual run by Ajai Narayan) Distro Tests - CDH 5.5 4 mins
Successful KVTableWithProjectionTest testKVTableWithProjection History
Failing since build #2 (Manual run by Ajai Narayan) Distro Tests - CDH 5.6 5 mins
Successful KVTableWithProjectionTest testKVTableWithProjection History
Failing since build #2 (Manual run by Ajai Narayan) Distro Tests - CDH 5.8 4 mins
Successful TPFSAvroSinkSourceTest testTPFSWithProjection History
Failing since build #2 (Manual run by Ajai Narayan) Distro Tests - CDH 5.10 8 mins
Successful TPFSAvroSinkSourceTest testTPFSWithProjection History
Failing since build #2 (Manual run by Ajai Narayan) Distro Tests - CDH 5.13 7 mins
Successful TPFSAvroSinkSourceTest testTPFSWithProjection History
Failing since build #2 (Manual run by Ajai Narayan) Distro Tests - CDH 5.14 8 mins
Successful TPFSAvroSinkSourceTest testTPFSWithProjection History
Failing since build #2 (Manual run by Ajai Narayan) Distro Tests - CDH 5.5 7 mins
Successful TPFSAvroSinkSourceTest testTPFSWithProjection History
Failing since build #2 (Manual run by Ajai Narayan) Distro Tests - CDH 5.6 8 mins
Successful TPFSAvroSinkSourceTest testTPFSWithProjection History
Failing since build #2 (Manual run by Ajai Narayan) Distro Tests - CDH 5.8 8 mins
Successful BatchAggregatorTest test History
Failing since build #2 (Manual run by Ajai Narayan) Distro Tests - CDH 5.10 9 mins
Successful BatchAggregatorTest test History
Failing since build #2 (Manual run by Ajai Narayan) Distro Tests - CDH 5.13 9 mins
Successful BatchAggregatorTest test History
Failing since build #2 (Manual run by Ajai Narayan) Distro Tests - CDH 5.14 9 mins
Successful BatchAggregatorTest test History
Failing since build #2 (Manual run by Ajai Narayan) Distro Tests - CDH 5.5 8 mins
Successful BatchAggregatorTest test History
Failing since build #2 (Manual run by Ajai Narayan) Distro Tests - CDH 5.6 9 mins
Successful BatchAggregatorTest test History
Failing since build #2 (Manual run by Ajai Narayan) Distro Tests - CDH 5.8 8 mins
Successful BatchCubeSinkTest test History
Failing since build #2 (Manual run by Ajai Narayan) Distro Tests - CDH 5.10 5 mins
Successful BatchCubeSinkTest test History
Failing since build #2 (Manual run by Ajai Narayan) Distro Tests - CDH 5.13 5 mins
Successful BatchCubeSinkTest test History
Failing since build #2 (Manual run by Ajai Narayan) Distro Tests - CDH 5.14 5 mins
Successful BatchCubeSinkTest test History
Failing since build #2 (Manual run by Ajai Narayan) Distro Tests - CDH 5.5 4 mins
Successful BatchCubeSinkTest test History
Failing since build #2 (Manual run by Ajai Narayan) Distro Tests - CDH 5.6 5 mins
Successful BatchCubeSinkTest test History
Failing since build #2 (Manual run by Ajai Narayan) Distro Tests - CDH 5.8 5 mins
Successful BatchJoinerTest testJoinerSpark History
Failing since build #2 (Manual run by Ajai Narayan) Distro Tests - CDH 5.10 7 mins
Successful BatchJoinerTest testJoinerMR History
Failing since build #2 (Manual run by Ajai Narayan) Distro Tests - CDH 5.10 11 mins
Successful BatchJoinerTest testJoinerSpark History
Failing since build #2 (Manual run by Ajai Narayan) Distro Tests - CDH 5.13 7 mins
Successful BatchJoinerTest testJoinerMR History
Failing since build #2 (Manual run by Ajai Narayan) Distro Tests - CDH 5.13 12 mins
Successful BatchJoinerTest testJoinerSpark History
Failing since build #2 (Manual run by Ajai Narayan) Distro Tests - CDH 5.14 7 mins
Successful BatchJoinerTest testJoinerMR History
Failing since build #2 (Manual run by Ajai Narayan) Distro Tests - CDH 5.14 12 mins
Successful BatchJoinerTest testJoinerSpark History
Failing since build #2 (Manual run by Ajai Narayan) Distro Tests - CDH 5.5 6 mins
Successful BatchJoinerTest testJoinerMR History
Failing since build #2 (Manual run by Ajai Narayan) Distro Tests - CDH 5.5 10 mins
Successful BatchJoinerTest testJoinerSpark History
Failing since build #2 (Manual run by Ajai Narayan) Distro Tests - CDH 5.6 7 mins
Successful BatchJoinerTest testJoinerMR History
Failing since build #2 (Manual run by Ajai Narayan) Distro Tests - CDH 5.6 12 mins
Successful BatchJoinerTest testJoinerSpark History
Failing since build #2 (Manual run by Ajai Narayan) Distro Tests - CDH 5.8 6 mins
Successful BatchJoinerTest testJoinerMR History
Failing since build #2 (Manual run by Ajai Narayan) Distro Tests - CDH 5.8 11 mins
Successful ETLMapReduceTest testKVToKV History
Failing since build #2 (Manual run by Ajai Narayan) Distro Tests - CDH 5.10 5 mins
Successful ETLMapReduceTest testDAGInvalidSchema History
Failing since build #2 (Manual run by Ajai Narayan) Distro Tests - CDH 5.10 3 secs
Successful ETLMapReduceTest testDAG History
Failing since build #2 (Manual run by Ajai Narayan) Distro Tests - CDH 5.10 4 mins
Successful ETLMapReduceTest testDAGSchemaChanges History
Failing since build #2 (Manual run by Ajai Narayan) Distro Tests - CDH 5.10 5 mins
Successful ETLMapReduceTest testKVToKV History
Failing since build #2 (Manual run by Ajai Narayan) Distro Tests - CDH 5.13 5 mins
Successful ETLMapReduceTest testDAGInvalidSchema History
Failing since build #2 (Manual run by Ajai Narayan) Distro Tests - CDH 5.13 3 secs
Successful ETLMapReduceTest testDAG History
Failing since build #2 (Manual run by Ajai Narayan) Distro Tests - CDH 5.13 5 mins
Successful ETLMapReduceTest testDAGSchemaChanges History
Failing since build #2 (Manual run by Ajai Narayan) Distro Tests - CDH 5.13 5 mins
Successful ETLMapReduceTest testDAGInvalidSchema History
Failing since build #2 (Manual run by Ajai Narayan) Distro Tests - CDH 5.14 3 secs
Successful ETLMapReduceTest testDAG History
Failing since build #2 (Manual run by Ajai Narayan) Distro Tests - CDH 5.14 5 mins
Successful ETLMapReduceTest testDAGSchemaChanges History
Failing since build #2 (Manual run by Ajai Narayan) Distro Tests - CDH 5.14 5 mins
Successful ETLMapReduceTest testKVToKV History
Failing since build #2 (Manual run by Ajai Narayan) Distro Tests - CDH 5.14 5 mins
Successful ETLMapReduceTest testKVToKV History
Failing since build #2 (Manual run by Ajai Narayan) Distro Tests - CDH 5.5 4 mins
Successful ETLMapReduceTest testDAGInvalidSchema History
Failing since build #2 (Manual run by Ajai Narayan) Distro Tests - CDH 5.5 3 secs