Build #323

Build: #323 failed Scheduled with changes by albertshau <ashau@google.com>

Build result summary

Details

Completed
Duration
327 minutes
Labels
None
Revision
04e85e4a550226ea682b06dd26ab741d01ef604a 04e85e4a550226ea682b06dd26ab741d01ef604a
Total tests
815
Failing since
#314 (Scheduled with changes by albertshau <ashau@google.com>)

Responsible

This build has been failing since #314
No one has taken responsibility

Code commits

Author Commit Message Commit date
albertshau <ashau@google.com> albertshau <ashau@google.com> 04e85e4a550226ea682b06dd26ab741d01ef604a 04e85e4a550226ea682b06dd26ab741d01ef604a Merge pull request #1033 from cdapio/disable-yarn-mem-check
disable yarn pmem check
albertshau <ashau@google.com> albertshau <ashau@google.com> 14b7298b067d7cb958fbb9008ece8f09ef979a95 14b7298b067d7cb958fbb9008ece8f09ef979a95 disable yarn pmem check
CDAP services are getting killed by yarn due to physical memory
constraints. Disable the pmem check to avoid this.

Tests

New test failures 3
Status Test View job Duration
Collapse Failed ETLMapReduceTest testKVToKV History
Distro Tests - MapR 5.1 5 mins
java.util.concurrent.TimeoutException: Timeout occurred. Expected STOPPED but found RUNNING.
	at io.cdap.cdap.common.utils.Tasks.waitFor(Tasks.java:70)
	at io.cdap.cdap.common.utils.Tasks.waitFor(Tasks.java:91)
	at io.cdap.cdap.client.ProgramClient.waitForStatus(ProgramClient.java:347)
	at io.cdap.cdap.client.ProgramClient.stopAll(ProgramClient.java:278)
	at io.cdap.cdap.test.IntegrationTestBase.doClear(IntegrationTestBase.java:390)
	at io.cdap.cdap.test.IntegrationTestBase.tearDown(IntegrationTestBase.java:124)
	at sun.reflect.NativeMethodAccessorImpl.invoke0(Native Method)
(41 more lines...)
Collapse Failed XMLReaderTest testInvalidNodePathWithMoveAction History
Distro Tests - MapR 5.1 2 mins
java.util.concurrent.TimeoutException: Timeout occurred. Expected STOPPED but found RUNNING.
	at io.cdap.cdap.common.utils.Tasks.waitFor(Tasks.java:70)
	at io.cdap.cdap.common.utils.Tasks.waitFor(Tasks.java:91)
	at io.cdap.cdap.client.ProgramClient.waitForStatus(ProgramClient.java:347)
	at io.cdap.cdap.client.ProgramClient.stopAll(ProgramClient.java:278)
	at io.cdap.cdap.test.IntegrationTestBase.doClear(IntegrationTestBase.java:390)
	at io.cdap.cdap.test.IntegrationTestBase.setUp(IntegrationTestBase.java:107)
	at sun.reflect.GeneratedMethodAccessor2.invoke(Unknown Source)
(41 more lines...)
Collapse Failed XMLReaderTest testPreProcessingRequired History
Distro Tests - MapR 5.1 3 mins
java.lang.RuntimeException: java.io.IOException: Failed to execute metadata mutation, with request: io.cdap.common.http.HttpRequest@50c97185
	at io.cdap.cdap.client.util.RESTClient.upload(RESTClient.java:160)
	at io.cdap.cdap.client.ApplicationClient.deployApp(ApplicationClient.java:449)
	at io.cdap.cdap.client.ApplicationClient.deploy(ApplicationClient.java:377)
	at io.cdap.cdap.client.ApplicationClient.deploy(ApplicationClient.java:353)
	at io.cdap.cdap.test.IntegrationTestManager.deployApplication(IntegrationTestManager.java:180)
	at io.cdap.cdap.test.AudiTestBase.deployServiceForDataset(AudiTestBase.java:264)
	at io.cdap.cdap.test.AudiTestBase.deployServiceForDataset(AudiTestBase.java:256)
(2 more lines...)
Existing test failures 12
Status Test Failing since View job Duration
java.util.concurrent.TimeoutException: Timeout occurred. Expected true but found false.
	at io.cdap.cdap.common.utils.Tasks.waitFor(Tasks.java:70)
	at io.cdap.cdap.common.utils.Tasks.waitFor(Tasks.java:91)
	at io.cdap.cdap.common.utils.Tasks.waitFor(Tasks.java:130)
	at io.cdap.cdap.test.AbstractProgramManager.waitForRuns(AbstractProgramManager.java:96)
	at io.cdap.cdap.test.AbstractProgramManager.waitForRun(AbstractProgramManager.java:90)
	at io.cdap.cdap.app.etl.batch.TPFSParquetSinkSourceTest.testTPFSWithProjection(TPFSParquetSinkSourceTest.java:91)
	at io.cdap.cdap.app.etl.batch.TPFSParquetSinkSourceTest.testMR(TPFSParquetSinkSourceTest.java:61)
java.util.concurrent.TimeoutException: Timeout occurred. Expected STOPPED but found RUNNING.
	at io.cdap.cdap.common.utils.Tasks.waitFor(Tasks.java:70)
	at io.cdap.cdap.common.utils.Tasks.waitFor(Tasks.java:91)
	at io.cdap.cdap.client.ProgramClient.waitForStatus(ProgramClient.java:347)
	at io.cdap.cdap.client.ProgramClient.stopAll(ProgramClient.java:278)
	at io.cdap.cdap.test.IntegrationTestBase.doClear(IntegrationTestBase.java:390)
	at io.cdap.cdap.test.IntegrationTestBase.setUp(IntegrationTestBase.java:107)
	at sun.reflect.GeneratedMethodAccessor2.invoke(Unknown Source)
(41 more lines...)
java.util.concurrent.TimeoutException: CDAP Services are not available. Retried for 600 seconds.
	at io.cdap.cdap.test.IntegrationTestBase.checkServicesWithRetry(IntegrationTestBase.java:265)
	at io.cdap.cdap.test.IntegrationTestBase.checkSystemServices(IntegrationTestBase.java:200)
	at io.cdap.cdap.test.IntegrationTestBase.setUp(IntegrationTestBase.java:97)
	at sun.reflect.GeneratedMethodAccessor2.invoke(Unknown Source)
	at sun.reflect.DelegatingMethodAccessorImpl.invoke(DelegatingMethodAccessorImpl.java:43)
	at java.lang.reflect.Method.invoke(Method.java:498)
	at org.junit.runners.model.FrameworkMethod$1.runReflectiveCall(FrameworkMethod.java:50)
(38 more lines...)
java.util.concurrent.TimeoutException: CDAP Services are not available. Retried for 600 seconds.
	at io.cdap.cdap.test.IntegrationTestBase.checkServicesWithRetry(IntegrationTestBase.java:265)
	at io.cdap.cdap.test.IntegrationTestBase.checkSystemServices(IntegrationTestBase.java:200)
	at io.cdap.cdap.test.IntegrationTestBase.setUp(IntegrationTestBase.java:97)
	at sun.reflect.GeneratedMethodAccessor2.invoke(Unknown Source)
	at sun.reflect.DelegatingMethodAccessorImpl.invoke(DelegatingMethodAccessorImpl.java:43)
	at java.lang.reflect.Method.invoke(Method.java:498)
	at org.junit.runners.model.FrameworkMethod$1.runReflectiveCall(FrameworkMethod.java:50)
(38 more lines...)
java.util.concurrent.TimeoutException: CDAP Services are not available. Retried for 600 seconds.
	at io.cdap.cdap.test.IntegrationTestBase.checkServicesWithRetry(IntegrationTestBase.java:265)
	at io.cdap.cdap.test.IntegrationTestBase.checkSystemServices(IntegrationTestBase.java:200)
	at io.cdap.cdap.test.IntegrationTestBase.setUp(IntegrationTestBase.java:97)
	at sun.reflect.GeneratedMethodAccessor2.invoke(Unknown Source)
	at sun.reflect.DelegatingMethodAccessorImpl.invoke(DelegatingMethodAccessorImpl.java:43)
	at java.lang.reflect.Method.invoke(Method.java:498)
	at org.junit.runners.model.FrameworkMethod$1.runReflectiveCall(FrameworkMethod.java:50)
(38 more lines...)
java.util.concurrent.TimeoutException: CDAP Services are not available. Retried for 600 seconds.
	at io.cdap.cdap.test.IntegrationTestBase.checkServicesWithRetry(IntegrationTestBase.java:265)
	at io.cdap.cdap.test.IntegrationTestBase.checkSystemServices(IntegrationTestBase.java:200)
	at io.cdap.cdap.test.IntegrationTestBase.setUp(IntegrationTestBase.java:97)
	at sun.reflect.GeneratedMethodAccessor2.invoke(Unknown Source)
	at sun.reflect.DelegatingMethodAccessorImpl.invoke(DelegatingMethodAccessorImpl.java:43)
	at java.lang.reflect.Method.invoke(Method.java:498)
	at org.junit.runners.model.FrameworkMethod$1.runReflectiveCall(FrameworkMethod.java:50)
(38 more lines...)
java.util.concurrent.TimeoutException: CDAP Services are not available. Retried for 600 seconds.
	at io.cdap.cdap.test.IntegrationTestBase.checkServicesWithRetry(IntegrationTestBase.java:265)
	at io.cdap.cdap.test.IntegrationTestBase.checkSystemServices(IntegrationTestBase.java:200)
	at io.cdap.cdap.test.IntegrationTestBase.setUp(IntegrationTestBase.java:97)
	at sun.reflect.GeneratedMethodAccessor2.invoke(Unknown Source)
	at sun.reflect.DelegatingMethodAccessorImpl.invoke(DelegatingMethodAccessorImpl.java:43)
	at java.lang.reflect.Method.invoke(Method.java:498)
	at org.junit.runners.model.FrameworkMethod$1.runReflectiveCall(FrameworkMethod.java:50)
(38 more lines...)
java.util.concurrent.TimeoutException: CDAP Services are not available. Retried for 600 seconds.
	at io.cdap.cdap.test.IntegrationTestBase.checkServicesWithRetry(IntegrationTestBase.java:265)
	at io.cdap.cdap.test.IntegrationTestBase.checkSystemServices(IntegrationTestBase.java:200)
	at io.cdap.cdap.test.IntegrationTestBase.setUp(IntegrationTestBase.java:97)
	at sun.reflect.GeneratedMethodAccessor2.invoke(Unknown Source)
	at sun.reflect.DelegatingMethodAccessorImpl.invoke(DelegatingMethodAccessorImpl.java:43)
	at java.lang.reflect.Method.invoke(Method.java:498)
	at org.junit.runners.model.FrameworkMethod$1.runReflectiveCall(FrameworkMethod.java:50)
(38 more lines...)
java.util.concurrent.TimeoutException: CDAP Services are not available. Retried for 600 seconds.
	at io.cdap.cdap.test.IntegrationTestBase.checkServicesWithRetry(IntegrationTestBase.java:265)
	at io.cdap.cdap.test.IntegrationTestBase.checkSystemServices(IntegrationTestBase.java:200)
	at io.cdap.cdap.test.IntegrationTestBase.setUp(IntegrationTestBase.java:97)
	at sun.reflect.GeneratedMethodAccessor2.invoke(Unknown Source)
	at sun.reflect.DelegatingMethodAccessorImpl.invoke(DelegatingMethodAccessorImpl.java:43)
	at java.lang.reflect.Method.invoke(Method.java:498)
	at org.junit.runners.model.FrameworkMethod$1.runReflectiveCall(FrameworkMethod.java:50)
(38 more lines...)
java.io.IOException: 500: Exception occurred while handling request: Timeout waiting for task.
	at io.cdap.cdap.client.util.RESTClient.execute(RESTClient.java:132)
	at io.cdap.cdap.client.util.RESTClient.execute(RESTClient.java:69)
	at io.cdap.cdap.apps.fileset.PartitionCorrectorTest.test(PartitionCorrectorTest.java:56)
java.io.IOException: 500: Exception occurred while handling request: Timeout waiting for task.
	at io.cdap.cdap.client.util.RESTClient.execute(RESTClient.java:132)
	at io.cdap.cdap.client.util.RESTClient.execute(RESTClient.java:69)
	at io.cdap.cdap.apps.fileset.PartitionCorrectorTest.test(PartitionCorrectorTest.java:56)
java.util.concurrent.TimeoutException: CDAP Services are not available. Retried for 600 seconds.
	at io.cdap.cdap.test.IntegrationTestBase.checkServicesWithRetry(IntegrationTestBase.java:265)
	at io.cdap.cdap.test.IntegrationTestBase.checkSystemServices(IntegrationTestBase.java:200)
	at io.cdap.cdap.test.IntegrationTestBase.setUp(IntegrationTestBase.java:97)
	at sun.reflect.GeneratedMethodAccessor2.invoke(Unknown Source)
	at sun.reflect.DelegatingMethodAccessorImpl.invoke(DelegatingMethodAccessorImpl.java:43)
	at java.lang.reflect.Method.invoke(Method.java:498)
	at org.junit.runners.model.FrameworkMethod$1.runReflectiveCall(FrameworkMethod.java:50)
(38 more lines...)
Fixed tests 14
Status Test Failing since View job Duration
Successful TPFSAvroSinkSourceTest testTPFSWithProjection History
Failing since build #322 (Scheduled) Distro Tests - CDH 5.10 7 mins
Successful TPFSAvroSinkSourceTest testTPFSWithProjection History
Failing since build #322 (Scheduled) Distro Tests - CDH 5.4 9 mins
Successful TPFSAvroSinkSourceTest testTPFSWithProjection History
Failing since build #322 (Scheduled) Distro Tests - CDH 5.8 7 mins
Successful TPFSParquetSinkSourceTest testMR History
Failing since build #322 (Scheduled) Distro Tests - CDH 5.6 8 mins
Successful TPFSParquetSinkSourceTest testMR History
Failing since build #322 (Scheduled) Distro Tests - CDH 5.7 9 mins
Successful TPFSParquetSinkSourceTest testMR History
Failing since build #322 (Scheduled) Distro Tests - CDH 5.9 7 mins
Successful ValueMapperTest test History
Failing since build #322 (Scheduled) Distro Tests - CDH 5.13 6 mins
Successful ValueMapperTest test History
Failing since build #322 (Scheduled) Distro Tests - CDH 5.15 5 mins
Successful XMLReaderTest testInvalidPatternWithDeleteAction History
Failing since build #322 (Scheduled) Distro Tests - CDH 5.5 4 mins
Successful XMLReaderTest testInvalidPatternWithDeleteAction History
Failing since build #322 (Scheduled) Distro Tests - HDP 2.4 5 mins
Successful DataStreamsTest testDataStreams History
Failing since build #322 (Scheduled) Distro Tests - HDP 2.3 3 mins
Successful WranglerTest testWranglerMR History
Failing since build #322 (Scheduled) Distro Tests - CDH 5.11 6 mins
Successful WranglerTest testWranglerMR History
Failing since build #322 (Scheduled) Distro Tests - CDH 5.12 6 mins
Successful WranglerTest testWranglerMR History
Failing since build #322 (Scheduled) Distro Tests - CDH 5.14 6 mins