Build #323

Build: #323 failed

Job: Distro Tests - MapR 5.2 MEP 1.1 failed

Job result summary

Completed
Duration
270 minutes
Agent
bamboo-agent10
Revision
04e85e4a550226ea682b06dd26ab741d01ef604a 04e85e4a550226ea682b06dd26ab741d01ef604a
Total tests
40
Failing since
#314 (Scheduled – )

Tests

  • 40 tests in total
  • 11 tests failed
  • 199 minutes taken in total.
Existing test failures 11
Status Test Failing since Duration
java.util.concurrent.TimeoutException: Timeout occurred. Expected true but found false.
	at io.cdap.cdap.common.utils.Tasks.waitFor(Tasks.java:70)
	at io.cdap.cdap.common.utils.Tasks.waitFor(Tasks.java:91)
	at io.cdap.cdap.common.utils.Tasks.waitFor(Tasks.java:130)
	at io.cdap.cdap.test.AbstractProgramManager.waitForRuns(AbstractProgramManager.java:96)
	at io.cdap.cdap.test.AbstractProgramManager.waitForRun(AbstractProgramManager.java:90)
	at io.cdap.cdap.app.etl.batch.TPFSParquetSinkSourceTest.testTPFSWithProjection(TPFSParquetSinkSourceTest.java:91)
	at io.cdap.cdap.app.etl.batch.TPFSParquetSinkSourceTest.testMR(TPFSParquetSinkSourceTest.java:61)
java.util.concurrent.TimeoutException: Timeout occurred. Expected STOPPED but found RUNNING.
	at io.cdap.cdap.common.utils.Tasks.waitFor(Tasks.java:70)
	at io.cdap.cdap.common.utils.Tasks.waitFor(Tasks.java:91)
	at io.cdap.cdap.client.ProgramClient.waitForStatus(ProgramClient.java:347)
	at io.cdap.cdap.client.ProgramClient.stopAll(ProgramClient.java:278)
	at io.cdap.cdap.test.IntegrationTestBase.doClear(IntegrationTestBase.java:390)
	at io.cdap.cdap.test.IntegrationTestBase.setUp(IntegrationTestBase.java:107)
	at sun.reflect.GeneratedMethodAccessor2.invoke(Unknown Source)
(41 more lines...)
java.util.concurrent.TimeoutException: CDAP Services are not available. Retried for 600 seconds.
	at io.cdap.cdap.test.IntegrationTestBase.checkServicesWithRetry(IntegrationTestBase.java:265)
	at io.cdap.cdap.test.IntegrationTestBase.checkSystemServices(IntegrationTestBase.java:200)
	at io.cdap.cdap.test.IntegrationTestBase.setUp(IntegrationTestBase.java:97)
	at sun.reflect.GeneratedMethodAccessor2.invoke(Unknown Source)
	at sun.reflect.DelegatingMethodAccessorImpl.invoke(DelegatingMethodAccessorImpl.java:43)
	at java.lang.reflect.Method.invoke(Method.java:498)
	at org.junit.runners.model.FrameworkMethod$1.runReflectiveCall(FrameworkMethod.java:50)
(38 more lines...)
java.util.concurrent.TimeoutException: CDAP Services are not available. Retried for 600 seconds.
	at io.cdap.cdap.test.IntegrationTestBase.checkServicesWithRetry(IntegrationTestBase.java:265)
	at io.cdap.cdap.test.IntegrationTestBase.checkSystemServices(IntegrationTestBase.java:200)
	at io.cdap.cdap.test.IntegrationTestBase.setUp(IntegrationTestBase.java:97)
	at sun.reflect.GeneratedMethodAccessor2.invoke(Unknown Source)
	at sun.reflect.DelegatingMethodAccessorImpl.invoke(DelegatingMethodAccessorImpl.java:43)
	at java.lang.reflect.Method.invoke(Method.java:498)
	at org.junit.runners.model.FrameworkMethod$1.runReflectiveCall(FrameworkMethod.java:50)
(38 more lines...)
java.util.concurrent.TimeoutException: CDAP Services are not available. Retried for 600 seconds.
	at io.cdap.cdap.test.IntegrationTestBase.checkServicesWithRetry(IntegrationTestBase.java:265)
	at io.cdap.cdap.test.IntegrationTestBase.checkSystemServices(IntegrationTestBase.java:200)
	at io.cdap.cdap.test.IntegrationTestBase.setUp(IntegrationTestBase.java:97)
	at sun.reflect.GeneratedMethodAccessor2.invoke(Unknown Source)
	at sun.reflect.DelegatingMethodAccessorImpl.invoke(DelegatingMethodAccessorImpl.java:43)
	at java.lang.reflect.Method.invoke(Method.java:498)
	at org.junit.runners.model.FrameworkMethod$1.runReflectiveCall(FrameworkMethod.java:50)
(38 more lines...)
java.util.concurrent.TimeoutException: CDAP Services are not available. Retried for 600 seconds.
	at io.cdap.cdap.test.IntegrationTestBase.checkServicesWithRetry(IntegrationTestBase.java:265)
	at io.cdap.cdap.test.IntegrationTestBase.checkSystemServices(IntegrationTestBase.java:200)
	at io.cdap.cdap.test.IntegrationTestBase.setUp(IntegrationTestBase.java:97)
	at sun.reflect.GeneratedMethodAccessor2.invoke(Unknown Source)
	at sun.reflect.DelegatingMethodAccessorImpl.invoke(DelegatingMethodAccessorImpl.java:43)
	at java.lang.reflect.Method.invoke(Method.java:498)
	at org.junit.runners.model.FrameworkMethod$1.runReflectiveCall(FrameworkMethod.java:50)
(38 more lines...)
java.util.concurrent.TimeoutException: CDAP Services are not available. Retried for 600 seconds.
	at io.cdap.cdap.test.IntegrationTestBase.checkServicesWithRetry(IntegrationTestBase.java:265)
	at io.cdap.cdap.test.IntegrationTestBase.checkSystemServices(IntegrationTestBase.java:200)
	at io.cdap.cdap.test.IntegrationTestBase.setUp(IntegrationTestBase.java:97)
	at sun.reflect.GeneratedMethodAccessor2.invoke(Unknown Source)
	at sun.reflect.DelegatingMethodAccessorImpl.invoke(DelegatingMethodAccessorImpl.java:43)
	at java.lang.reflect.Method.invoke(Method.java:498)
	at org.junit.runners.model.FrameworkMethod$1.runReflectiveCall(FrameworkMethod.java:50)
(38 more lines...)
java.util.concurrent.TimeoutException: CDAP Services are not available. Retried for 600 seconds.
	at io.cdap.cdap.test.IntegrationTestBase.checkServicesWithRetry(IntegrationTestBase.java:265)
	at io.cdap.cdap.test.IntegrationTestBase.checkSystemServices(IntegrationTestBase.java:200)
	at io.cdap.cdap.test.IntegrationTestBase.setUp(IntegrationTestBase.java:97)
	at sun.reflect.GeneratedMethodAccessor2.invoke(Unknown Source)
	at sun.reflect.DelegatingMethodAccessorImpl.invoke(DelegatingMethodAccessorImpl.java:43)
	at java.lang.reflect.Method.invoke(Method.java:498)
	at org.junit.runners.model.FrameworkMethod$1.runReflectiveCall(FrameworkMethod.java:50)
(38 more lines...)
java.util.concurrent.TimeoutException: CDAP Services are not available. Retried for 600 seconds.
	at io.cdap.cdap.test.IntegrationTestBase.checkServicesWithRetry(IntegrationTestBase.java:265)
	at io.cdap.cdap.test.IntegrationTestBase.checkSystemServices(IntegrationTestBase.java:200)
	at io.cdap.cdap.test.IntegrationTestBase.setUp(IntegrationTestBase.java:97)
	at sun.reflect.GeneratedMethodAccessor2.invoke(Unknown Source)
	at sun.reflect.DelegatingMethodAccessorImpl.invoke(DelegatingMethodAccessorImpl.java:43)
	at java.lang.reflect.Method.invoke(Method.java:498)
	at org.junit.runners.model.FrameworkMethod$1.runReflectiveCall(FrameworkMethod.java:50)
(38 more lines...)
java.io.IOException: 500: Exception occurred while handling request: Timeout waiting for task.
	at io.cdap.cdap.client.util.RESTClient.execute(RESTClient.java:132)
	at io.cdap.cdap.client.util.RESTClient.execute(RESTClient.java:69)
	at io.cdap.cdap.apps.fileset.PartitionCorrectorTest.test(PartitionCorrectorTest.java:56)
java.util.concurrent.TimeoutException: CDAP Services are not available. Retried for 600 seconds.
	at io.cdap.cdap.test.IntegrationTestBase.checkServicesWithRetry(IntegrationTestBase.java:265)
	at io.cdap.cdap.test.IntegrationTestBase.checkSystemServices(IntegrationTestBase.java:200)
	at io.cdap.cdap.test.IntegrationTestBase.setUp(IntegrationTestBase.java:97)
	at sun.reflect.GeneratedMethodAccessor2.invoke(Unknown Source)
	at sun.reflect.DelegatingMethodAccessorImpl.invoke(DelegatingMethodAccessorImpl.java:43)
	at java.lang.reflect.Method.invoke(Method.java:498)
	at org.junit.runners.model.FrameworkMethod$1.runReflectiveCall(FrameworkMethod.java:50)
(38 more lines...)

Error summary

The build generated some errors. See the full build log for more details.

Java HotSpot(TM) 64-Bit Server VM warning: ignoring option MaxPermSize=128m; support was removed in 8.0
Warning:  org.apache.xerces.jaxp.SAXParserImpl$JAXPSAXParser: Property 'http://www.oracle.com/xml/jaxp/properties/entityExpansionLimit' is not recognized.
Compiler warnings:
  WARNING:  'org.apache.xerces.jaxp.SAXParserImpl: Property 'http://javax.xml.XMLConstants/property/accessExternalDTD' is not recognized.'
Warning:  org.apache.xerces.parsers.SAXParser: Feature 'http://javax.xml.XMLConstants/feature/secure-processing' is not recognized.
Warning:  org.apache.xerces.parsers.SAXParser: Property 'http://javax.xml.XMLConstants/property/accessExternalDTD' is not recognized.
Warning:  org.apache.xerces.parsers.SAXParser: Property 'http://www.oracle.com/xml/jaxp/properties/entityExpansionLimit' is not recognized.
Warning:  org.apache.xerces.jaxp.SAXParserImpl$JAXPSAXParser: Property 'http://www.oracle.com/xml/jaxp/properties/entityExpansionLimit' is not recognized.
Compiler warnings:
  WARNING:  'org.apache.xerces.jaxp.SAXParserImpl: Property 'http://javax.xml.XMLConstants/property/accessExternalDTD' is not recognized.'
Warning:  org.apache.xerces.parsers.SAXParser: Feature 'http://javax.xml.XMLConstants/feature/secure-processing' is not recognized.
Warning:  org.apache.xerces.parsers.SAXParser: Property 'http://javax.xml.XMLConstants/property/accessExternalDTD' is not recognized.
Warning:  org.apache.xerces.parsers.SAXParser: Property 'http://www.oracle.com/xml/jaxp/properties/entityExpansionLimit' is not recognized.
Warning:  org.apache.xerces.jaxp.SAXParserImpl$JAXPSAXParser: Property 'http://www.oracle.com/xml/jaxp/properties/entityExpansionLimit' is not recognized.
Compiler warnings:
  WARNING:  'org.apache.xerces.jaxp.SAXParserImpl: Property 'http://javax.xml.XMLConstants/property/accessExternalDTD' is not recognized.'
Warning:  org.apache.xerces.parsers.SAXParser: Feature 'http://javax.xml.XMLConstants/feature/secure-processing' is not recognized.
Warning:  org.apache.xerces.parsers.SAXParser: Property 'http://javax.xml.XMLConstants/property/accessExternalDTD' is not recognized.
Warning:  org.apache.xerces.parsers.SAXParser: Property 'http://www.oracle.com/xml/jaxp/properties/entityExpansionLimit' is not recognized.
SLF4J: Class path contains multiple SLF4J bindings.
SLF4J: Found binding in [jar:file:/home/bamboo/.m2/repository/io/cdap/cdap/cdap-cli/6.1.0-SNAPSHOT/cdap-cli-6.1.0-SNAPSHOT.jar!/org/slf4j/impl/StaticLoggerBinder.class]
SLF4J: Found binding in [jar:file:/home/bamboo/.m2/repository/io/cdap/cdap/cdap-explore-jdbc/6.1.0-SNAPSHOT/cdap-explore-jdbc-6.1.0-SNAPSHOT.jar!/org/slf4j/impl/StaticLoggerBinder.class]
SLF4J: Found binding in [jar:file:/home/bamboo/.m2/repository/ch/qos/logback/logback-classic/1.0.9/logback-classic-1.0.9.jar!/org/slf4j/impl/StaticLoggerBinder.class]
SLF4J: See http://www.slf4j.org/codes.html#multiple_bindings for an explanation.
SLF4J: Actual binding is of type [ch.qos.logback.classic.util.ContextSelectorStaticBinder]