Build #320

Build: #320 failed

Job: Distro Tests - MapR 5.2 MEP 1.1 failed

Test results

  • 40 tests in total
  • 18 tests failed
  • 17 failures are new
  • 188 minutes taken in total.

Build 320 has the following 18 errors: 17 new failure(s) occurred since the previous build.

New test failures 17
Status Test Duration
Collapse Failed TPFSAvroSinkSourceTest testTPFSWithProjection History
2 mins
java.util.concurrent.TimeoutException: Timeout occurred. Expected STOPPED but found RUNNING.
	at io.cdap.cdap.common.utils.Tasks.waitFor(Tasks.java:70)
	at io.cdap.cdap.common.utils.Tasks.waitFor(Tasks.java:91)
	at io.cdap.cdap.client.ProgramClient.waitForStatus(ProgramClient.java:347)
	at io.cdap.cdap.client.ProgramClient.stopAll(ProgramClient.java:278)
	at io.cdap.cdap.test.IntegrationTestBase.doClear(IntegrationTestBase.java:390)
	at io.cdap.cdap.test.IntegrationTestBase.setUp(IntegrationTestBase.java:107)
	at sun.reflect.GeneratedMethodAccessor2.invoke(Unknown Source)
(41 more lines...)
Collapse Failed ETLMapReduceTest testKVToKV History
2 mins
java.lang.RuntimeException: java.io.IOException: 500: Exception occurred while handling request: KeeperErrorCode = ConnectionLoss for /hbase
	at io.cdap.cdap.client.util.RESTClient.execute(RESTClient.java:132)
	at io.cdap.cdap.client.util.RESTClient.execute(RESTClient.java:91)
	at io.cdap.cdap.remote.dataset.kvtable.RemoteKeyValueTable.doPost(RemoteKeyValueTable.java:170)
	at io.cdap.cdap.remote.dataset.kvtable.RemoteKeyValueTable.write(RemoteKeyValueTable.java:96)
	at io.cdap.cdap.remote.dataset.kvtable.RemoteKeyValueTable.write(RemoteKeyValueTable.java:101)
	at io.cdap.cdap.app.etl.batch.ETLMapReduceTest.testKVToKV(ETLMapReduceTest.java:102)
Collapse Failed RowDenormalizerTest test History
2 mins
java.util.concurrent.TimeoutException: Timeout occurred. Expected STOPPED but found RUNNING.
	at io.cdap.cdap.common.utils.Tasks.waitFor(Tasks.java:70)
	at io.cdap.cdap.common.utils.Tasks.waitFor(Tasks.java:91)
	at io.cdap.cdap.client.ProgramClient.waitForStatus(ProgramClient.java:347)
	at io.cdap.cdap.client.ProgramClient.stopAll(ProgramClient.java:278)
	at io.cdap.cdap.test.IntegrationTestBase.doClear(IntegrationTestBase.java:390)
	at io.cdap.cdap.test.IntegrationTestBase.setUp(IntegrationTestBase.java:107)
	at sun.reflect.GeneratedMethodAccessor2.invoke(Unknown Source)
(41 more lines...)
Collapse Failed TPFSParquetSinkSourceTest testMR History
2 mins
java.util.concurrent.TimeoutException: Timeout occurred. Expected STOPPED but found RUNNING.
	at io.cdap.cdap.common.utils.Tasks.waitFor(Tasks.java:70)
	at io.cdap.cdap.common.utils.Tasks.waitFor(Tasks.java:91)
	at io.cdap.cdap.client.ProgramClient.waitForStatus(ProgramClient.java:347)
	at io.cdap.cdap.client.ProgramClient.stopAll(ProgramClient.java:278)
	at io.cdap.cdap.test.IntegrationTestBase.doClear(IntegrationTestBase.java:390)
	at io.cdap.cdap.test.IntegrationTestBase.setUp(IntegrationTestBase.java:107)
	at sun.reflect.GeneratedMethodAccessor2.invoke(Unknown Source)
(41 more lines...)
Collapse Failed ValueMapperTest test History
11 mins
java.util.concurrent.TimeoutException: CDAP Services are not available. Retried for 600 seconds.
	at io.cdap.cdap.test.IntegrationTestBase.checkServicesWithRetry(IntegrationTestBase.java:265)
	at io.cdap.cdap.test.IntegrationTestBase.checkSystemServices(IntegrationTestBase.java:200)
	at io.cdap.cdap.test.IntegrationTestBase.setUp(IntegrationTestBase.java:97)
	at sun.reflect.GeneratedMethodAccessor2.invoke(Unknown Source)
	at sun.reflect.DelegatingMethodAccessorImpl.invoke(DelegatingMethodAccessorImpl.java:43)
	at java.lang.reflect.Method.invoke(Method.java:498)
	at org.junit.runners.model.FrameworkMethod$1.runReflectiveCall(FrameworkMethod.java:50)
(38 more lines...)
Collapse Failed XMLReaderTest testInvalidNodePathWithMoveAction History
11 mins
java.util.concurrent.TimeoutException: CDAP Services are not available. Retried for 600 seconds.
	at io.cdap.cdap.test.IntegrationTestBase.checkServicesWithRetry(IntegrationTestBase.java:265)
	at io.cdap.cdap.test.IntegrationTestBase.checkSystemServices(IntegrationTestBase.java:200)
	at io.cdap.cdap.test.IntegrationTestBase.setUp(IntegrationTestBase.java:97)
	at sun.reflect.GeneratedMethodAccessor2.invoke(Unknown Source)
	at sun.reflect.DelegatingMethodAccessorImpl.invoke(DelegatingMethodAccessorImpl.java:43)
	at java.lang.reflect.Method.invoke(Method.java:498)
	at org.junit.runners.model.FrameworkMethod$1.runReflectiveCall(FrameworkMethod.java:50)
(38 more lines...)
Collapse Failed XMLReaderTest testInvalidPatternWithDeleteAction History
11 mins
java.util.concurrent.TimeoutException: CDAP Services are not available. Retried for 600 seconds.
	at io.cdap.cdap.test.IntegrationTestBase.checkServicesWithRetry(IntegrationTestBase.java:265)
	at io.cdap.cdap.test.IntegrationTestBase.checkSystemServices(IntegrationTestBase.java:200)
	at io.cdap.cdap.test.IntegrationTestBase.setUp(IntegrationTestBase.java:97)
	at sun.reflect.GeneratedMethodAccessor2.invoke(Unknown Source)
	at sun.reflect.DelegatingMethodAccessorImpl.invoke(DelegatingMethodAccessorImpl.java:43)
	at java.lang.reflect.Method.invoke(Method.java:498)
	at org.junit.runners.model.FrameworkMethod$1.runReflectiveCall(FrameworkMethod.java:50)
(38 more lines...)
Collapse Failed XMLReaderTest testPatternWithDeleteAction History
11 mins
java.util.concurrent.TimeoutException: CDAP Services are not available. Retried for 600 seconds.
	at io.cdap.cdap.test.IntegrationTestBase.checkServicesWithRetry(IntegrationTestBase.java:265)
	at io.cdap.cdap.test.IntegrationTestBase.checkSystemServices(IntegrationTestBase.java:200)
	at io.cdap.cdap.test.IntegrationTestBase.setUp(IntegrationTestBase.java:97)
	at sun.reflect.GeneratedMethodAccessor2.invoke(Unknown Source)
	at sun.reflect.DelegatingMethodAccessorImpl.invoke(DelegatingMethodAccessorImpl.java:43)
	at java.lang.reflect.Method.invoke(Method.java:498)
	at org.junit.runners.model.FrameworkMethod$1.runReflectiveCall(FrameworkMethod.java:50)
(38 more lines...)
Collapse Failed XMLReaderTest testPreProcessingNotRequired History
11 mins
java.util.concurrent.TimeoutException: CDAP Services are not available. Retried for 600 seconds.
	at io.cdap.cdap.test.IntegrationTestBase.checkServicesWithRetry(IntegrationTestBase.java:265)
	at io.cdap.cdap.test.IntegrationTestBase.checkSystemServices(IntegrationTestBase.java:200)
	at io.cdap.cdap.test.IntegrationTestBase.setUp(IntegrationTestBase.java:97)
	at sun.reflect.GeneratedMethodAccessor2.invoke(Unknown Source)
	at sun.reflect.DelegatingMethodAccessorImpl.invoke(DelegatingMethodAccessorImpl.java:43)
	at java.lang.reflect.Method.invoke(Method.java:498)
	at org.junit.runners.model.FrameworkMethod$1.runReflectiveCall(FrameworkMethod.java:50)
(38 more lines...)
Collapse Failed XMLReaderTest testPreProcessingRequired History
11 mins
java.util.concurrent.TimeoutException: CDAP Services are not available. Retried for 600 seconds.
	at io.cdap.cdap.test.IntegrationTestBase.checkServicesWithRetry(IntegrationTestBase.java:265)
	at io.cdap.cdap.test.IntegrationTestBase.checkSystemServices(IntegrationTestBase.java:200)
	at io.cdap.cdap.test.IntegrationTestBase.setUp(IntegrationTestBase.java:97)
	at sun.reflect.GeneratedMethodAccessor2.invoke(Unknown Source)
	at sun.reflect.DelegatingMethodAccessorImpl.invoke(DelegatingMethodAccessorImpl.java:43)
	at java.lang.reflect.Method.invoke(Method.java:498)
	at org.junit.runners.model.FrameworkMethod$1.runReflectiveCall(FrameworkMethod.java:50)
(38 more lines...)
Collapse Failed WranglerServiceTest test History
11 mins
java.util.concurrent.TimeoutException: CDAP Services are not available. Retried for 600 seconds.
	at io.cdap.cdap.test.IntegrationTestBase.checkServicesWithRetry(IntegrationTestBase.java:265)
	at io.cdap.cdap.test.IntegrationTestBase.checkSystemServices(IntegrationTestBase.java:200)
	at io.cdap.cdap.test.IntegrationTestBase.setUp(IntegrationTestBase.java:97)
	at sun.reflect.GeneratedMethodAccessor2.invoke(Unknown Source)
	at sun.reflect.DelegatingMethodAccessorImpl.invoke(DelegatingMethodAccessorImpl.java:43)
	at java.lang.reflect.Method.invoke(Method.java:498)
	at org.junit.runners.model.FrameworkMethod$1.runReflectiveCall(FrameworkMethod.java:50)
(38 more lines...)
Collapse Failed WranglerTest testWranglerMR History
11 mins
java.util.concurrent.TimeoutException: CDAP Services are not available. Retried for 600 seconds.
	at io.cdap.cdap.test.IntegrationTestBase.checkServicesWithRetry(IntegrationTestBase.java:265)
	at io.cdap.cdap.test.IntegrationTestBase.checkSystemServices(IntegrationTestBase.java:200)
	at io.cdap.cdap.test.IntegrationTestBase.setUp(IntegrationTestBase.java:97)
	at sun.reflect.GeneratedMethodAccessor2.invoke(Unknown Source)
	at sun.reflect.DelegatingMethodAccessorImpl.invoke(DelegatingMethodAccessorImpl.java:43)
	at java.lang.reflect.Method.invoke(Method.java:498)
	at org.junit.runners.model.FrameworkMethod$1.runReflectiveCall(FrameworkMethod.java:50)
(38 more lines...)
Collapse Failed ServiceWorkerTest test History
2 mins
java.util.concurrent.TimeoutException: Timeout occurred. Expected STOPPED but found RUNNING.
	at io.cdap.cdap.common.utils.Tasks.waitFor(Tasks.java:70)
	at io.cdap.cdap.common.utils.Tasks.waitFor(Tasks.java:91)
	at io.cdap.cdap.client.ProgramClient.waitForStatus(ProgramClient.java:347)
	at io.cdap.cdap.client.ProgramClient.stopAll(ProgramClient.java:278)
	at io.cdap.cdap.test.IntegrationTestBase.doClear(IntegrationTestBase.java:390)
	at io.cdap.cdap.test.IntegrationTestBase.setUp(IntegrationTestBase.java:107)
	at sun.reflect.GeneratedMethodAccessor2.invoke(Unknown Source)
(41 more lines...)
Collapse Failed WorkflowTest test History
11 mins
java.util.concurrent.TimeoutException: CDAP Services are not available. Retried for 600 seconds.
	at io.cdap.cdap.test.IntegrationTestBase.checkServicesWithRetry(IntegrationTestBase.java:265)
	at io.cdap.cdap.test.IntegrationTestBase.checkSystemServices(IntegrationTestBase.java:200)
	at io.cdap.cdap.test.IntegrationTestBase.setUp(IntegrationTestBase.java:97)
	at sun.reflect.GeneratedMethodAccessor2.invoke(Unknown Source)
	at sun.reflect.DelegatingMethodAccessorImpl.invoke(DelegatingMethodAccessorImpl.java:43)
	at java.lang.reflect.Method.invoke(Method.java:498)
	at org.junit.runners.model.FrameworkMethod$1.runReflectiveCall(FrameworkMethod.java:50)
(38 more lines...)
Collapse Failed RemoteCubeTest test History
2 mins
java.lang.RuntimeException: java.io.IOException: 500: Exception occurred while handling request: canCommit() is called for transaction 1568445796396000000 that is not in progress (it is known to be invalid)
	at io.cdap.cdap.client.util.RESTClient.execute(RESTClient.java:132)
	at io.cdap.cdap.client.util.RESTClient.execute(RESTClient.java:91)
	at io.cdap.cdap.remote.dataset.cube.RemoteCube.doPost(RemoteCube.java:116)
	at io.cdap.cdap.remote.dataset.cube.RemoteCube.doPost(RemoteCube.java:109)
	at io.cdap.cdap.remote.dataset.cube.RemoteCube.query(RemoteCube.java:78)
	at io.cdap.cdap.remote.dataset.test.RemoteCubeTest.test(RemoteCubeTest.java:118)
Collapse Failed RemoteKeyValueTest test History
2 mins
java.lang.RuntimeException: java.io.IOException: 500: Exception occurred while handling request: KeeperErrorCode = ConnectionLoss for /hbase
	at io.cdap.cdap.client.util.RESTClient.execute(RESTClient.java:132)
	at io.cdap.cdap.client.util.RESTClient.execute(RESTClient.java:91)
	at io.cdap.cdap.remote.dataset.kvtable.RemoteKeyValueTable.doPost(RemoteKeyValueTable.java:170)
	at io.cdap.cdap.remote.dataset.kvtable.RemoteKeyValueTable.doPost(RemoteKeyValueTable.java:163)
	at io.cdap.cdap.remote.dataset.kvtable.RemoteKeyValueTable.read(RemoteKeyValueTable.java:77)
	at io.cdap.cdap.remote.dataset.test.RemoteKeyValueTest.test(RemoteKeyValueTest.java:40)
Collapse Failed RemoteTableTest test History
2 mins
java.util.concurrent.TimeoutException: Timeout occurred. Expected STOPPED but found RUNNING.
	at io.cdap.cdap.common.utils.Tasks.waitFor(Tasks.java:70)
	at io.cdap.cdap.common.utils.Tasks.waitFor(Tasks.java:91)
	at io.cdap.cdap.client.ProgramClient.waitForStatus(ProgramClient.java:347)
	at io.cdap.cdap.client.ProgramClient.stopAll(ProgramClient.java:278)
	at io.cdap.cdap.test.IntegrationTestBase.doClear(IntegrationTestBase.java:390)
	at io.cdap.cdap.test.IntegrationTestBase.setUp(IntegrationTestBase.java:107)
	at sun.reflect.GeneratedMethodAccessor2.invoke(Unknown Source)
(41 more lines...)
Existing test failures 1
Status Test Failing since Duration
java.io.IOException: 500: Exception occurred while handling request: KeeperErrorCode = ConnectionLoss for /hbase
	at io.cdap.cdap.client.util.RESTClient.execute(RESTClient.java:132)
	at io.cdap.cdap.client.util.RESTClient.execute(RESTClient.java:69)
	at io.cdap.cdap.apps.fileset.PartitionCorrectorTest.test(PartitionCorrectorTest.java:56)