Build #320

Build: #320 failed

Job: Distro Tests - MapR 5.1 failed

Test results

  • 40 tests in total
  • 20 tests failed
  • 18 failures are new
  • 108 minutes taken in total.

Build 320 has the following 20 errors: 18 new failure(s) occurred since the previous build.

New test failures 18
Status Test Duration
Collapse Failed TPFSAvroSinkSourceTest testTPFSWithProjection History
2 mins
java.util.concurrent.TimeoutException: Timeout occurred. Expected STOPPED but found RUNNING.
	at io.cdap.cdap.common.utils.Tasks.waitFor(Tasks.java:70)
	at io.cdap.cdap.common.utils.Tasks.waitFor(Tasks.java:91)
	at io.cdap.cdap.client.ProgramClient.waitForStatus(ProgramClient.java:347)
	at io.cdap.cdap.client.ProgramClient.stopAll(ProgramClient.java:278)
	at io.cdap.cdap.test.IntegrationTestBase.doClear(IntegrationTestBase.java:390)
	at io.cdap.cdap.test.IntegrationTestBase.setUp(IntegrationTestBase.java:107)
	at sun.reflect.GeneratedMethodAccessor2.invoke(Unknown Source)
(41 more lines...)
Collapse Failed ETLMapReduceTest testKVToKV History
2 mins
java.lang.RuntimeException: java.io.IOException: 500: Exception occurred while handling request: KeeperErrorCode = ConnectionLoss for /hbase
	at io.cdap.cdap.client.util.RESTClient.execute(RESTClient.java:132)
	at io.cdap.cdap.client.util.RESTClient.execute(RESTClient.java:91)
	at io.cdap.cdap.remote.dataset.kvtable.RemoteKeyValueTable.doPost(RemoteKeyValueTable.java:170)
	at io.cdap.cdap.remote.dataset.kvtable.RemoteKeyValueTable.write(RemoteKeyValueTable.java:96)
	at io.cdap.cdap.remote.dataset.kvtable.RemoteKeyValueTable.write(RemoteKeyValueTable.java:101)
	at io.cdap.cdap.app.etl.batch.ETLMapReduceTest.testKVToKV(ETLMapReduceTest.java:102)
Collapse Failed TPFSParquetSinkSourceTest testMR History
2 mins
java.util.concurrent.TimeoutException: Timeout occurred. Expected STOPPED but found RUNNING.
	at io.cdap.cdap.common.utils.Tasks.waitFor(Tasks.java:70)
	at io.cdap.cdap.common.utils.Tasks.waitFor(Tasks.java:91)
	at io.cdap.cdap.client.ProgramClient.waitForStatus(ProgramClient.java:347)
	at io.cdap.cdap.client.ProgramClient.stopAll(ProgramClient.java:278)
	at io.cdap.cdap.test.IntegrationTestBase.doClear(IntegrationTestBase.java:390)
	at io.cdap.cdap.test.IntegrationTestBase.setUp(IntegrationTestBase.java:107)
	at sun.reflect.GeneratedMethodAccessor2.invoke(Unknown Source)
(41 more lines...)
Collapse Failed ValueMapperTest test History
2 mins
java.util.concurrent.TimeoutException: Timeout occurred. Expected STOPPED but found RUNNING.
	at io.cdap.cdap.common.utils.Tasks.waitFor(Tasks.java:70)
	at io.cdap.cdap.common.utils.Tasks.waitFor(Tasks.java:91)
	at io.cdap.cdap.client.ProgramClient.waitForStatus(ProgramClient.java:347)
	at io.cdap.cdap.client.ProgramClient.stopAll(ProgramClient.java:278)
	at io.cdap.cdap.test.IntegrationTestBase.doClear(IntegrationTestBase.java:390)
	at io.cdap.cdap.test.IntegrationTestBase.setUp(IntegrationTestBase.java:107)
	at sun.reflect.GeneratedMethodAccessor2.invoke(Unknown Source)
(41 more lines...)
Collapse Failed XMLReaderTest testInvalidNodePathWithMoveAction History
2 mins
java.util.concurrent.TimeoutException: Timeout occurred. Expected STOPPED but found RUNNING.
	at io.cdap.cdap.common.utils.Tasks.waitFor(Tasks.java:70)
	at io.cdap.cdap.common.utils.Tasks.waitFor(Tasks.java:91)
	at io.cdap.cdap.client.ProgramClient.waitForStatus(ProgramClient.java:347)
	at io.cdap.cdap.client.ProgramClient.stopAll(ProgramClient.java:278)
	at io.cdap.cdap.test.IntegrationTestBase.doClear(IntegrationTestBase.java:390)
	at io.cdap.cdap.test.IntegrationTestBase.setUp(IntegrationTestBase.java:107)
	at sun.reflect.GeneratedMethodAccessor2.invoke(Unknown Source)
(41 more lines...)
Collapse Failed XMLReaderTest testInvalidPatternWithDeleteAction History
2 mins
java.util.concurrent.TimeoutException: Timeout occurred. Expected STOPPED but found RUNNING.
	at io.cdap.cdap.common.utils.Tasks.waitFor(Tasks.java:70)
	at io.cdap.cdap.common.utils.Tasks.waitFor(Tasks.java:91)
	at io.cdap.cdap.client.ProgramClient.waitForStatus(ProgramClient.java:347)
	at io.cdap.cdap.client.ProgramClient.stopAll(ProgramClient.java:278)
	at io.cdap.cdap.test.IntegrationTestBase.doClear(IntegrationTestBase.java:390)
	at io.cdap.cdap.test.IntegrationTestBase.setUp(IntegrationTestBase.java:107)
	at sun.reflect.GeneratedMethodAccessor2.invoke(Unknown Source)
(41 more lines...)
Collapse Failed XMLReaderTest testPatternWithDeleteAction History
3 mins
java.util.concurrent.TimeoutException: Timeout occurred. Expected STOPPED but found RUNNING.
	at io.cdap.cdap.common.utils.Tasks.waitFor(Tasks.java:70)
	at io.cdap.cdap.common.utils.Tasks.waitFor(Tasks.java:91)
	at io.cdap.cdap.client.ProgramClient.waitForStatus(ProgramClient.java:347)
	at io.cdap.cdap.client.ProgramClient.stopAll(ProgramClient.java:278)
	at io.cdap.cdap.test.IntegrationTestBase.doClear(IntegrationTestBase.java:390)
	at io.cdap.cdap.test.IntegrationTestBase.setUp(IntegrationTestBase.java:107)
	at sun.reflect.GeneratedMethodAccessor2.invoke(Unknown Source)
(41 more lines...)
Collapse Failed XMLReaderTest testPreProcessingNotRequired History
2 mins
java.util.concurrent.TimeoutException: Timeout occurred. Expected STOPPED but found RUNNING.
	at io.cdap.cdap.common.utils.Tasks.waitFor(Tasks.java:70)
	at io.cdap.cdap.common.utils.Tasks.waitFor(Tasks.java:91)
	at io.cdap.cdap.client.ProgramClient.waitForStatus(ProgramClient.java:347)
	at io.cdap.cdap.client.ProgramClient.stopAll(ProgramClient.java:278)
	at io.cdap.cdap.test.IntegrationTestBase.doClear(IntegrationTestBase.java:390)
	at io.cdap.cdap.test.IntegrationTestBase.setUp(IntegrationTestBase.java:107)
	at sun.reflect.GeneratedMethodAccessor2.invoke(Unknown Source)
(41 more lines...)
Collapse Failed XMLReaderTest testPreProcessingRequired History
2 mins
java.util.concurrent.TimeoutException: Timeout occurred. Expected STOPPED but found RUNNING.
	at io.cdap.cdap.common.utils.Tasks.waitFor(Tasks.java:70)
	at io.cdap.cdap.common.utils.Tasks.waitFor(Tasks.java:91)
	at io.cdap.cdap.client.ProgramClient.waitForStatus(ProgramClient.java:347)
	at io.cdap.cdap.client.ProgramClient.stopAll(ProgramClient.java:278)
	at io.cdap.cdap.test.IntegrationTestBase.doClear(IntegrationTestBase.java:390)
	at io.cdap.cdap.test.IntegrationTestBase.setUp(IntegrationTestBase.java:107)
	at sun.reflect.GeneratedMethodAccessor2.invoke(Unknown Source)
(41 more lines...)
Collapse Failed WranglerServiceTest test History
2 mins
java.util.concurrent.TimeoutException: Timeout occurred. Expected STOPPED but found RUNNING.
	at io.cdap.cdap.common.utils.Tasks.waitFor(Tasks.java:70)
	at io.cdap.cdap.common.utils.Tasks.waitFor(Tasks.java:91)
	at io.cdap.cdap.client.ProgramClient.waitForStatus(ProgramClient.java:347)
	at io.cdap.cdap.client.ProgramClient.stopAll(ProgramClient.java:278)
	at io.cdap.cdap.test.IntegrationTestBase.doClear(IntegrationTestBase.java:390)
	at io.cdap.cdap.test.IntegrationTestBase.setUp(IntegrationTestBase.java:107)
	at sun.reflect.GeneratedMethodAccessor2.invoke(Unknown Source)
(41 more lines...)
Collapse Failed WranglerTest testWranglerMR History
2 mins
java.util.concurrent.TimeoutException: Timeout occurred. Expected STOPPED but found RUNNING.
	at io.cdap.cdap.common.utils.Tasks.waitFor(Tasks.java:70)
	at io.cdap.cdap.common.utils.Tasks.waitFor(Tasks.java:91)
	at io.cdap.cdap.client.ProgramClient.waitForStatus(ProgramClient.java:347)
	at io.cdap.cdap.client.ProgramClient.stopAll(ProgramClient.java:278)
	at io.cdap.cdap.test.IntegrationTestBase.doClear(IntegrationTestBase.java:390)
	at io.cdap.cdap.test.IntegrationTestBase.setUp(IntegrationTestBase.java:107)
	at sun.reflect.GeneratedMethodAccessor2.invoke(Unknown Source)
(41 more lines...)
Collapse Failed ReadlessIncrementTest testReadlessIncrementsInMapReduce History
2 mins
java.util.concurrent.TimeoutException: Timeout occurred. Expected STOPPED but found RUNNING.
	at io.cdap.cdap.common.utils.Tasks.waitFor(Tasks.java:70)
	at io.cdap.cdap.common.utils.Tasks.waitFor(Tasks.java:91)
	at io.cdap.cdap.client.ProgramClient.waitForStatus(ProgramClient.java:347)
	at io.cdap.cdap.client.ProgramClient.stopAll(ProgramClient.java:278)
	at io.cdap.cdap.test.IntegrationTestBase.doClear(IntegrationTestBase.java:390)
	at io.cdap.cdap.test.IntegrationTestBase.setUp(IntegrationTestBase.java:107)
	at sun.reflect.GeneratedMethodAccessor2.invoke(Unknown Source)
(41 more lines...)
Collapse Failed ServiceWorkerTest test History
2 mins
java.util.concurrent.TimeoutException: Timeout occurred. Expected STOPPED but found RUNNING.
	at io.cdap.cdap.common.utils.Tasks.waitFor(Tasks.java:70)
	at io.cdap.cdap.common.utils.Tasks.waitFor(Tasks.java:91)
	at io.cdap.cdap.client.ProgramClient.waitForStatus(ProgramClient.java:347)
	at io.cdap.cdap.client.ProgramClient.stopAll(ProgramClient.java:278)
	at io.cdap.cdap.test.IntegrationTestBase.doClear(IntegrationTestBase.java:390)
	at io.cdap.cdap.test.IntegrationTestBase.setUp(IntegrationTestBase.java:107)
	at sun.reflect.GeneratedMethodAccessor2.invoke(Unknown Source)
(41 more lines...)
Collapse Failed ProgramMetadataTest testWithLineage History
6 mins
java.util.concurrent.TimeoutException: Timeout occurred. Expected true but found false.
	at io.cdap.cdap.common.utils.Tasks.waitFor(Tasks.java:70)
	at io.cdap.cdap.common.utils.Tasks.waitFor(Tasks.java:91)
	at io.cdap.cdap.common.utils.Tasks.waitFor(Tasks.java:130)
	at io.cdap.cdap.test.AbstractProgramManager.waitForRuns(AbstractProgramManager.java:96)
	at io.cdap.cdap.test.AbstractProgramManager.waitForRun(AbstractProgramManager.java:90)
	at io.cdap.cdap.apps.metadata.ProgramMetadataTest.testWithLineage(ProgramMetadataTest.java:96)
Collapse Failed WorkflowTest test History
2 mins
java.util.concurrent.TimeoutException: Timeout occurred. Expected STOPPED but found RUNNING.
	at io.cdap.cdap.common.utils.Tasks.waitFor(Tasks.java:70)
	at io.cdap.cdap.common.utils.Tasks.waitFor(Tasks.java:91)
	at io.cdap.cdap.client.ProgramClient.waitForStatus(ProgramClient.java:347)
	at io.cdap.cdap.client.ProgramClient.stopAll(ProgramClient.java:278)
	at io.cdap.cdap.test.IntegrationTestBase.doClear(IntegrationTestBase.java:390)
	at io.cdap.cdap.test.IntegrationTestBase.setUp(IntegrationTestBase.java:107)
	at sun.reflect.GeneratedMethodAccessor2.invoke(Unknown Source)
(41 more lines...)
Collapse Failed RemoteCubeTest test History
2 mins
java.util.concurrent.TimeoutException: Timeout occurred. Expected STOPPED but found RUNNING.
	at io.cdap.cdap.common.utils.Tasks.waitFor(Tasks.java:70)
	at io.cdap.cdap.common.utils.Tasks.waitFor(Tasks.java:91)
	at io.cdap.cdap.client.ProgramClient.waitForStatus(ProgramClient.java:347)
	at io.cdap.cdap.client.ProgramClient.stopAll(ProgramClient.java:278)
	at io.cdap.cdap.test.IntegrationTestBase.doClear(IntegrationTestBase.java:390)
	at io.cdap.cdap.test.IntegrationTestBase.setUp(IntegrationTestBase.java:107)
	at sun.reflect.GeneratedMethodAccessor2.invoke(Unknown Source)
(41 more lines...)
Collapse Failed RemoteKeyValueTest test History
2 mins
java.util.concurrent.TimeoutException: Timeout occurred. Expected STOPPED but found RUNNING.
	at io.cdap.cdap.common.utils.Tasks.waitFor(Tasks.java:70)
	at io.cdap.cdap.common.utils.Tasks.waitFor(Tasks.java:91)
	at io.cdap.cdap.client.ProgramClient.waitForStatus(ProgramClient.java:347)
	at io.cdap.cdap.client.ProgramClient.stopAll(ProgramClient.java:278)
	at io.cdap.cdap.test.IntegrationTestBase.doClear(IntegrationTestBase.java:390)
	at io.cdap.cdap.test.IntegrationTestBase.setUp(IntegrationTestBase.java:107)
	at sun.reflect.GeneratedMethodAccessor2.invoke(Unknown Source)
(41 more lines...)
Collapse Failed RemoteTableTest test History
2 mins
java.util.concurrent.TimeoutException: Timeout occurred. Expected STOPPED but found RUNNING.
	at io.cdap.cdap.common.utils.Tasks.waitFor(Tasks.java:70)
	at io.cdap.cdap.common.utils.Tasks.waitFor(Tasks.java:91)
	at io.cdap.cdap.client.ProgramClient.waitForStatus(ProgramClient.java:347)
	at io.cdap.cdap.client.ProgramClient.stopAll(ProgramClient.java:278)
	at io.cdap.cdap.test.IntegrationTestBase.doClear(IntegrationTestBase.java:390)
	at io.cdap.cdap.test.IntegrationTestBase.setUp(IntegrationTestBase.java:107)
	at sun.reflect.GeneratedMethodAccessor2.invoke(Unknown Source)
(41 more lines...)
Existing test failures 2
Status Test Failing since Duration
java.util.concurrent.TimeoutException: Timeout occurred. Expected STOPPED but found RUNNING.
	at io.cdap.cdap.common.utils.Tasks.waitFor(Tasks.java:70)
	at io.cdap.cdap.common.utils.Tasks.waitFor(Tasks.java:91)
	at io.cdap.cdap.client.ProgramClient.waitForStatus(ProgramClient.java:347)
	at io.cdap.cdap.client.ProgramClient.stopAll(ProgramClient.java:278)
	at io.cdap.cdap.test.IntegrationTestBase.doClear(IntegrationTestBase.java:390)
	at io.cdap.cdap.test.IntegrationTestBase.setUp(IntegrationTestBase.java:107)
	at sun.reflect.GeneratedMethodAccessor2.invoke(Unknown Source)
(41 more lines...)
java.io.IOException: 500: Exception occurred while handling request: Timeout waiting for task.
	at io.cdap.cdap.client.util.RESTClient.execute(RESTClient.java:132)
	at io.cdap.cdap.client.util.RESTClient.execute(RESTClient.java:69)
	at io.cdap.cdap.apps.fileset.PartitionCorrectorTest.test(PartitionCorrectorTest.java:56)