Build #320

Build: #320 failed

Job: Distro Tests - MapR 5.1 failed

Job result summary

Completed
Duration
172 minutes
Agent
bamboo-vmxagent01.c.continuuity-loom-clusters.internal
Revision
fcfec769e9c31b9bb146700e0c07e75c044ab4c4 fcfec769e9c31b9bb146700e0c07e75c044ab4c4
Total tests
40
Failing since
#314 (Scheduled – )

Tests

  • 40 tests in total
  • 20 tests failed
  • 18 failures are new
  • 108 minutes taken in total.
New test failures 18
Status Test Duration
Collapse Failed TPFSAvroSinkSourceTest testTPFSWithProjection History
2 mins
java.util.concurrent.TimeoutException: Timeout occurred. Expected STOPPED but found RUNNING.
	at io.cdap.cdap.common.utils.Tasks.waitFor(Tasks.java:70)
	at io.cdap.cdap.common.utils.Tasks.waitFor(Tasks.java:91)
	at io.cdap.cdap.client.ProgramClient.waitForStatus(ProgramClient.java:347)
	at io.cdap.cdap.client.ProgramClient.stopAll(ProgramClient.java:278)
	at io.cdap.cdap.test.IntegrationTestBase.doClear(IntegrationTestBase.java:390)
	at io.cdap.cdap.test.IntegrationTestBase.setUp(IntegrationTestBase.java:107)
	at sun.reflect.GeneratedMethodAccessor2.invoke(Unknown Source)
(41 more lines...)
Collapse Failed ETLMapReduceTest testKVToKV History
2 mins
java.lang.RuntimeException: java.io.IOException: 500: Exception occurred while handling request: KeeperErrorCode = ConnectionLoss for /hbase
	at io.cdap.cdap.client.util.RESTClient.execute(RESTClient.java:132)
	at io.cdap.cdap.client.util.RESTClient.execute(RESTClient.java:91)
	at io.cdap.cdap.remote.dataset.kvtable.RemoteKeyValueTable.doPost(RemoteKeyValueTable.java:170)
	at io.cdap.cdap.remote.dataset.kvtable.RemoteKeyValueTable.write(RemoteKeyValueTable.java:96)
	at io.cdap.cdap.remote.dataset.kvtable.RemoteKeyValueTable.write(RemoteKeyValueTable.java:101)
	at io.cdap.cdap.app.etl.batch.ETLMapReduceTest.testKVToKV(ETLMapReduceTest.java:102)
Collapse Failed TPFSParquetSinkSourceTest testMR History
2 mins
java.util.concurrent.TimeoutException: Timeout occurred. Expected STOPPED but found RUNNING.
	at io.cdap.cdap.common.utils.Tasks.waitFor(Tasks.java:70)
	at io.cdap.cdap.common.utils.Tasks.waitFor(Tasks.java:91)
	at io.cdap.cdap.client.ProgramClient.waitForStatus(ProgramClient.java:347)
	at io.cdap.cdap.client.ProgramClient.stopAll(ProgramClient.java:278)
	at io.cdap.cdap.test.IntegrationTestBase.doClear(IntegrationTestBase.java:390)
	at io.cdap.cdap.test.IntegrationTestBase.setUp(IntegrationTestBase.java:107)
	at sun.reflect.GeneratedMethodAccessor2.invoke(Unknown Source)
(41 more lines...)
Collapse Failed ValueMapperTest test History
2 mins
java.util.concurrent.TimeoutException: Timeout occurred. Expected STOPPED but found RUNNING.
	at io.cdap.cdap.common.utils.Tasks.waitFor(Tasks.java:70)
	at io.cdap.cdap.common.utils.Tasks.waitFor(Tasks.java:91)
	at io.cdap.cdap.client.ProgramClient.waitForStatus(ProgramClient.java:347)
	at io.cdap.cdap.client.ProgramClient.stopAll(ProgramClient.java:278)
	at io.cdap.cdap.test.IntegrationTestBase.doClear(IntegrationTestBase.java:390)
	at io.cdap.cdap.test.IntegrationTestBase.setUp(IntegrationTestBase.java:107)
	at sun.reflect.GeneratedMethodAccessor2.invoke(Unknown Source)
(41 more lines...)
Collapse Failed XMLReaderTest testInvalidNodePathWithMoveAction History
2 mins
java.util.concurrent.TimeoutException: Timeout occurred. Expected STOPPED but found RUNNING.
	at io.cdap.cdap.common.utils.Tasks.waitFor(Tasks.java:70)
	at io.cdap.cdap.common.utils.Tasks.waitFor(Tasks.java:91)
	at io.cdap.cdap.client.ProgramClient.waitForStatus(ProgramClient.java:347)
	at io.cdap.cdap.client.ProgramClient.stopAll(ProgramClient.java:278)
	at io.cdap.cdap.test.IntegrationTestBase.doClear(IntegrationTestBase.java:390)
	at io.cdap.cdap.test.IntegrationTestBase.setUp(IntegrationTestBase.java:107)
	at sun.reflect.GeneratedMethodAccessor2.invoke(Unknown Source)
(41 more lines...)
Collapse Failed XMLReaderTest testInvalidPatternWithDeleteAction History
2 mins
java.util.concurrent.TimeoutException: Timeout occurred. Expected STOPPED but found RUNNING.
	at io.cdap.cdap.common.utils.Tasks.waitFor(Tasks.java:70)
	at io.cdap.cdap.common.utils.Tasks.waitFor(Tasks.java:91)
	at io.cdap.cdap.client.ProgramClient.waitForStatus(ProgramClient.java:347)
	at io.cdap.cdap.client.ProgramClient.stopAll(ProgramClient.java:278)
	at io.cdap.cdap.test.IntegrationTestBase.doClear(IntegrationTestBase.java:390)
	at io.cdap.cdap.test.IntegrationTestBase.setUp(IntegrationTestBase.java:107)
	at sun.reflect.GeneratedMethodAccessor2.invoke(Unknown Source)
(41 more lines...)
Collapse Failed XMLReaderTest testPatternWithDeleteAction History
3 mins
java.util.concurrent.TimeoutException: Timeout occurred. Expected STOPPED but found RUNNING.
	at io.cdap.cdap.common.utils.Tasks.waitFor(Tasks.java:70)
	at io.cdap.cdap.common.utils.Tasks.waitFor(Tasks.java:91)
	at io.cdap.cdap.client.ProgramClient.waitForStatus(ProgramClient.java:347)
	at io.cdap.cdap.client.ProgramClient.stopAll(ProgramClient.java:278)
	at io.cdap.cdap.test.IntegrationTestBase.doClear(IntegrationTestBase.java:390)
	at io.cdap.cdap.test.IntegrationTestBase.setUp(IntegrationTestBase.java:107)
	at sun.reflect.GeneratedMethodAccessor2.invoke(Unknown Source)
(41 more lines...)
Collapse Failed XMLReaderTest testPreProcessingNotRequired History
2 mins
java.util.concurrent.TimeoutException: Timeout occurred. Expected STOPPED but found RUNNING.
	at io.cdap.cdap.common.utils.Tasks.waitFor(Tasks.java:70)
	at io.cdap.cdap.common.utils.Tasks.waitFor(Tasks.java:91)
	at io.cdap.cdap.client.ProgramClient.waitForStatus(ProgramClient.java:347)
	at io.cdap.cdap.client.ProgramClient.stopAll(ProgramClient.java:278)
	at io.cdap.cdap.test.IntegrationTestBase.doClear(IntegrationTestBase.java:390)
	at io.cdap.cdap.test.IntegrationTestBase.setUp(IntegrationTestBase.java:107)
	at sun.reflect.GeneratedMethodAccessor2.invoke(Unknown Source)
(41 more lines...)
Collapse Failed XMLReaderTest testPreProcessingRequired History
2 mins
java.util.concurrent.TimeoutException: Timeout occurred. Expected STOPPED but found RUNNING.
	at io.cdap.cdap.common.utils.Tasks.waitFor(Tasks.java:70)
	at io.cdap.cdap.common.utils.Tasks.waitFor(Tasks.java:91)
	at io.cdap.cdap.client.ProgramClient.waitForStatus(ProgramClient.java:347)
	at io.cdap.cdap.client.ProgramClient.stopAll(ProgramClient.java:278)
	at io.cdap.cdap.test.IntegrationTestBase.doClear(IntegrationTestBase.java:390)
	at io.cdap.cdap.test.IntegrationTestBase.setUp(IntegrationTestBase.java:107)
	at sun.reflect.GeneratedMethodAccessor2.invoke(Unknown Source)
(41 more lines...)
Collapse Failed WranglerServiceTest test History
2 mins
java.util.concurrent.TimeoutException: Timeout occurred. Expected STOPPED but found RUNNING.
	at io.cdap.cdap.common.utils.Tasks.waitFor(Tasks.java:70)
	at io.cdap.cdap.common.utils.Tasks.waitFor(Tasks.java:91)
	at io.cdap.cdap.client.ProgramClient.waitForStatus(ProgramClient.java:347)
	at io.cdap.cdap.client.ProgramClient.stopAll(ProgramClient.java:278)
	at io.cdap.cdap.test.IntegrationTestBase.doClear(IntegrationTestBase.java:390)
	at io.cdap.cdap.test.IntegrationTestBase.setUp(IntegrationTestBase.java:107)
	at sun.reflect.GeneratedMethodAccessor2.invoke(Unknown Source)
(41 more lines...)
Collapse Failed WranglerTest testWranglerMR History
2 mins
java.util.concurrent.TimeoutException: Timeout occurred. Expected STOPPED but found RUNNING.
	at io.cdap.cdap.common.utils.Tasks.waitFor(Tasks.java:70)
	at io.cdap.cdap.common.utils.Tasks.waitFor(Tasks.java:91)
	at io.cdap.cdap.client.ProgramClient.waitForStatus(ProgramClient.java:347)
	at io.cdap.cdap.client.ProgramClient.stopAll(ProgramClient.java:278)
	at io.cdap.cdap.test.IntegrationTestBase.doClear(IntegrationTestBase.java:390)
	at io.cdap.cdap.test.IntegrationTestBase.setUp(IntegrationTestBase.java:107)
	at sun.reflect.GeneratedMethodAccessor2.invoke(Unknown Source)
(41 more lines...)
Collapse Failed ReadlessIncrementTest testReadlessIncrementsInMapReduce History
2 mins
java.util.concurrent.TimeoutException: Timeout occurred. Expected STOPPED but found RUNNING.
	at io.cdap.cdap.common.utils.Tasks.waitFor(Tasks.java:70)
	at io.cdap.cdap.common.utils.Tasks.waitFor(Tasks.java:91)
	at io.cdap.cdap.client.ProgramClient.waitForStatus(ProgramClient.java:347)
	at io.cdap.cdap.client.ProgramClient.stopAll(ProgramClient.java:278)
	at io.cdap.cdap.test.IntegrationTestBase.doClear(IntegrationTestBase.java:390)
	at io.cdap.cdap.test.IntegrationTestBase.setUp(IntegrationTestBase.java:107)
	at sun.reflect.GeneratedMethodAccessor2.invoke(Unknown Source)
(41 more lines...)
Collapse Failed ServiceWorkerTest test History
2 mins
java.util.concurrent.TimeoutException: Timeout occurred. Expected STOPPED but found RUNNING.
	at io.cdap.cdap.common.utils.Tasks.waitFor(Tasks.java:70)
	at io.cdap.cdap.common.utils.Tasks.waitFor(Tasks.java:91)
	at io.cdap.cdap.client.ProgramClient.waitForStatus(ProgramClient.java:347)
	at io.cdap.cdap.client.ProgramClient.stopAll(ProgramClient.java:278)
	at io.cdap.cdap.test.IntegrationTestBase.doClear(IntegrationTestBase.java:390)
	at io.cdap.cdap.test.IntegrationTestBase.setUp(IntegrationTestBase.java:107)
	at sun.reflect.GeneratedMethodAccessor2.invoke(Unknown Source)
(41 more lines...)
Collapse Failed ProgramMetadataTest testWithLineage History
6 mins
java.util.concurrent.TimeoutException: Timeout occurred. Expected true but found false.
	at io.cdap.cdap.common.utils.Tasks.waitFor(Tasks.java:70)
	at io.cdap.cdap.common.utils.Tasks.waitFor(Tasks.java:91)
	at io.cdap.cdap.common.utils.Tasks.waitFor(Tasks.java:130)
	at io.cdap.cdap.test.AbstractProgramManager.waitForRuns(AbstractProgramManager.java:96)
	at io.cdap.cdap.test.AbstractProgramManager.waitForRun(AbstractProgramManager.java:90)
	at io.cdap.cdap.apps.metadata.ProgramMetadataTest.testWithLineage(ProgramMetadataTest.java:96)
Collapse Failed WorkflowTest test History
2 mins
java.util.concurrent.TimeoutException: Timeout occurred. Expected STOPPED but found RUNNING.
	at io.cdap.cdap.common.utils.Tasks.waitFor(Tasks.java:70)
	at io.cdap.cdap.common.utils.Tasks.waitFor(Tasks.java:91)
	at io.cdap.cdap.client.ProgramClient.waitForStatus(ProgramClient.java:347)
	at io.cdap.cdap.client.ProgramClient.stopAll(ProgramClient.java:278)
	at io.cdap.cdap.test.IntegrationTestBase.doClear(IntegrationTestBase.java:390)
	at io.cdap.cdap.test.IntegrationTestBase.setUp(IntegrationTestBase.java:107)
	at sun.reflect.GeneratedMethodAccessor2.invoke(Unknown Source)
(41 more lines...)
Collapse Failed RemoteCubeTest test History
2 mins
java.util.concurrent.TimeoutException: Timeout occurred. Expected STOPPED but found RUNNING.
	at io.cdap.cdap.common.utils.Tasks.waitFor(Tasks.java:70)
	at io.cdap.cdap.common.utils.Tasks.waitFor(Tasks.java:91)
	at io.cdap.cdap.client.ProgramClient.waitForStatus(ProgramClient.java:347)
	at io.cdap.cdap.client.ProgramClient.stopAll(ProgramClient.java:278)
	at io.cdap.cdap.test.IntegrationTestBase.doClear(IntegrationTestBase.java:390)
	at io.cdap.cdap.test.IntegrationTestBase.setUp(IntegrationTestBase.java:107)
	at sun.reflect.GeneratedMethodAccessor2.invoke(Unknown Source)
(41 more lines...)
Collapse Failed RemoteKeyValueTest test History
2 mins
java.util.concurrent.TimeoutException: Timeout occurred. Expected STOPPED but found RUNNING.
	at io.cdap.cdap.common.utils.Tasks.waitFor(Tasks.java:70)
	at io.cdap.cdap.common.utils.Tasks.waitFor(Tasks.java:91)
	at io.cdap.cdap.client.ProgramClient.waitForStatus(ProgramClient.java:347)
	at io.cdap.cdap.client.ProgramClient.stopAll(ProgramClient.java:278)
	at io.cdap.cdap.test.IntegrationTestBase.doClear(IntegrationTestBase.java:390)
	at io.cdap.cdap.test.IntegrationTestBase.setUp(IntegrationTestBase.java:107)
	at sun.reflect.GeneratedMethodAccessor2.invoke(Unknown Source)
(41 more lines...)
Collapse Failed RemoteTableTest test History
2 mins
java.util.concurrent.TimeoutException: Timeout occurred. Expected STOPPED but found RUNNING.
	at io.cdap.cdap.common.utils.Tasks.waitFor(Tasks.java:70)
	at io.cdap.cdap.common.utils.Tasks.waitFor(Tasks.java:91)
	at io.cdap.cdap.client.ProgramClient.waitForStatus(ProgramClient.java:347)
	at io.cdap.cdap.client.ProgramClient.stopAll(ProgramClient.java:278)
	at io.cdap.cdap.test.IntegrationTestBase.doClear(IntegrationTestBase.java:390)
	at io.cdap.cdap.test.IntegrationTestBase.setUp(IntegrationTestBase.java:107)
	at sun.reflect.GeneratedMethodAccessor2.invoke(Unknown Source)
(41 more lines...)
Existing test failures 2
Status Test Failing since Duration
java.util.concurrent.TimeoutException: Timeout occurred. Expected STOPPED but found RUNNING.
	at io.cdap.cdap.common.utils.Tasks.waitFor(Tasks.java:70)
	at io.cdap.cdap.common.utils.Tasks.waitFor(Tasks.java:91)
	at io.cdap.cdap.client.ProgramClient.waitForStatus(ProgramClient.java:347)
	at io.cdap.cdap.client.ProgramClient.stopAll(ProgramClient.java:278)
	at io.cdap.cdap.test.IntegrationTestBase.doClear(IntegrationTestBase.java:390)
	at io.cdap.cdap.test.IntegrationTestBase.setUp(IntegrationTestBase.java:107)
	at sun.reflect.GeneratedMethodAccessor2.invoke(Unknown Source)
(41 more lines...)
java.io.IOException: 500: Exception occurred while handling request: Timeout waiting for task.
	at io.cdap.cdap.client.util.RESTClient.execute(RESTClient.java:132)
	at io.cdap.cdap.client.util.RESTClient.execute(RESTClient.java:69)
	at io.cdap.cdap.apps.fileset.PartitionCorrectorTest.test(PartitionCorrectorTest.java:56)

Error summary

The build generated some errors. See the full build log for more details.

Java HotSpot(TM) 64-Bit Server VM warning: ignoring option MaxPermSize=128m; support was removed in 8.0
Warning:  org.apache.xerces.jaxp.SAXParserImpl$JAXPSAXParser: Property 'http://www.oracle.com/xml/jaxp/properties/entityExpansionLimit' is not recognized.
Compiler warnings:
  WARNING:  'org.apache.xerces.jaxp.SAXParserImpl: Property 'http://javax.xml.XMLConstants/property/accessExternalDTD' is not recognized.'
Warning:  org.apache.xerces.parsers.SAXParser: Feature 'http://javax.xml.XMLConstants/feature/secure-processing' is not recognized.
Warning:  org.apache.xerces.parsers.SAXParser: Property 'http://javax.xml.XMLConstants/property/accessExternalDTD' is not recognized.
Warning:  org.apache.xerces.parsers.SAXParser: Property 'http://www.oracle.com/xml/jaxp/properties/entityExpansionLimit' is not recognized.
Warning:  org.apache.xerces.jaxp.SAXParserImpl$JAXPSAXParser: Property 'http://www.oracle.com/xml/jaxp/properties/entityExpansionLimit' is not recognized.
Compiler warnings:
  WARNING:  'org.apache.xerces.jaxp.SAXParserImpl: Property 'http://javax.xml.XMLConstants/property/accessExternalDTD' is not recognized.'
Warning:  org.apache.xerces.parsers.SAXParser: Feature 'http://javax.xml.XMLConstants/feature/secure-processing' is not recognized.
Warning:  org.apache.xerces.parsers.SAXParser: Property 'http://javax.xml.XMLConstants/property/accessExternalDTD' is not recognized.
Warning:  org.apache.xerces.parsers.SAXParser: Property 'http://www.oracle.com/xml/jaxp/properties/entityExpansionLimit' is not recognized.
Warning:  org.apache.xerces.jaxp.SAXParserImpl$JAXPSAXParser: Property 'http://www.oracle.com/xml/jaxp/properties/entityExpansionLimit' is not recognized.
Compiler warnings:
  WARNING:  'org.apache.xerces.jaxp.SAXParserImpl: Property 'http://javax.xml.XMLConstants/property/accessExternalDTD' is not recognized.'
Warning:  org.apache.xerces.parsers.SAXParser: Feature 'http://javax.xml.XMLConstants/feature/secure-processing' is not recognized.
Warning:  org.apache.xerces.parsers.SAXParser: Property 'http://javax.xml.XMLConstants/property/accessExternalDTD' is not recognized.
Warning:  org.apache.xerces.parsers.SAXParser: Property 'http://www.oracle.com/xml/jaxp/properties/entityExpansionLimit' is not recognized.
SLF4J: Class path contains multiple SLF4J bindings.
SLF4J: Found binding in [jar:file:/home/bamboo/.m2/repository/io/cdap/cdap/cdap-cli/6.1.0-SNAPSHOT/cdap-cli-6.1.0-SNAPSHOT.jar!/org/slf4j/impl/StaticLoggerBinder.class]
SLF4J: Found binding in [jar:file:/home/bamboo/.m2/repository/io/cdap/cdap/cdap-explore-jdbc/6.1.0-SNAPSHOT/cdap-explore-jdbc-6.1.0-SNAPSHOT.jar!/org/slf4j/impl/StaticLoggerBinder.class]
SLF4J: Found binding in [jar:file:/home/bamboo/.m2/repository/ch/qos/logback/logback-classic/1.0.9/logback-classic-1.0.9.jar!/org/slf4j/impl/StaticLoggerBinder.class]
SLF4J: See http://www.slf4j.org/codes.html#multiple_bindings for an explanation.
SLF4J: Actual binding is of type [ch.qos.logback.classic.util.ContextSelectorStaticBinder]