Build #316

Build: #316 failed

Job: Distro Tests - HDP 2.6 failed

Build log

The build generated 2,575 lines of output.The output is too long and has been truncated to the last 1,000 lines. Download or view full build log

12-Sep-2019 06:11:00         at org.junit.internal.builders.SuiteMethodBuilder.runnerForClass(SuiteMethodBuilder.java:10)
12-Sep-2019 06:11:00         at org.junit.runners.model.RunnerBuilder.safeRunnerForClass(RunnerBuilder.java:59)
12-Sep-2019 06:11:00         at org.junit.internal.builders.AllDefaultPossibilitiesBuilder.runnerForClass(AllDefaultPossibilitiesBuilder.java:26)
12-Sep-2019 06:11:00         at org.junit.runners.model.RunnerBuilder.safeRunnerForClass(RunnerBuilder.java:59)
12-Sep-2019 06:11:00         at org.junit.runners.model.RunnerBuilder.runners(RunnerBuilder.java:101)
12-Sep-2019 06:11:00         at org.junit.runners.model.RunnerBuilder.runners(RunnerBuilder.java:87)
12-Sep-2019 06:11:00         at org.junit.runners.Suite.<init>(Suite.java:102)
12-Sep-2019 06:11:00         at org.junit.runners.Suite.<init>(Suite.java:70)
12-Sep-2019 06:11:00         at sun.reflect.NativeConstructorAccessorImpl.newInstance0(Native Method)
12-Sep-2019 06:11:00         at sun.reflect.NativeConstructorAccessorImpl.newInstance(NativeConstructorAccessorImpl.java:62)
12-Sep-2019 06:11:00         at sun.reflect.DelegatingConstructorAccessorImpl.newInstance(DelegatingConstructorAccessorImpl.java:45)
12-Sep-2019 06:11:00         at java.lang.reflect.Constructor.newInstance(Constructor.java:423)
12-Sep-2019 06:11:00         at org.junit.internal.builders.AnnotatedBuilder.buildRunner(AnnotatedBuilder.java:107)
12-Sep-2019 06:11:00         at org.junit.internal.builders.AnnotatedBuilder.runnerForClass(AnnotatedBuilder.java:86)
12-Sep-2019 06:11:00         at org.junit.runners.model.RunnerBuilder.safeRunnerForClass(RunnerBuilder.java:59)
12-Sep-2019 06:11:00         at org.junit.internal.builders.AllDefaultPossibilitiesBuilder.runnerForClass(AllDefaultPossibilitiesBuilder.java:26)
12-Sep-2019 06:11:00         at org.junit.runners.model.RunnerBuilder.safeRunnerForClass(RunnerBuilder.java:59)
12-Sep-2019 06:11:00         at org.junit.internal.requests.ClassRequest.getRunner(ClassRequest.java:33)
12-Sep-2019 06:11:00         at org.apache.maven.surefire.junit4.JUnit4Provider.execute(JUnit4Provider.java:283)
12-Sep-2019 06:11:00         at org.apache.maven.surefire.junit4.JUnit4Provider.executeWithRerun(JUnit4Provider.java:173)
12-Sep-2019 06:11:00         at org.apache.maven.surefire.junit4.JUnit4Provider.executeTestSet(JUnit4Provider.java:153)
12-Sep-2019 06:11:00         at org.apache.maven.surefire.junit4.JUnit4Provider.invoke(JUnit4Provider.java:128)
12-Sep-2019 06:11:00         at org.apache.maven.surefire.booter.ForkedBooter.invokeProviderInSameClassLoader(ForkedBooter.java:203)
12-Sep-2019 06:11:00         at org.apache.maven.surefire.booter.ForkedBooter.runSuitesInProcess(ForkedBooter.java:155)
12-Sep-2019 06:11:00         at org.apache.maven.surefire.booter.ForkedBooter.main(ForkedBooter.java:103)
12-Sep-2019 06:11:00
12-Sep-2019 06:11:00 initializationError(io.cdap.cdap.apps.fileset.PartitionCorrectorTest)  Time elapsed: 0 sec  <<< ERROR!
12-Sep-2019 06:11:00 java.lang.SecurityException: Invalid signature file digest for Manifest main attributes
12-Sep-2019 06:11:00         at sun.security.util.SignatureFileVerifier.processImpl(SignatureFileVerifier.java:284)
12-Sep-2019 06:11:00         at sun.security.util.SignatureFileVerifier.process(SignatureFileVerifier.java:238)
12-Sep-2019 06:11:00         at java.util.jar.JarVerifier.processEntry(JarVerifier.java:316)
12-Sep-2019 06:11:00         at java.util.jar.JarVerifier.update(JarVerifier.java:228)
12-Sep-2019 06:11:00         at java.util.jar.JarFile.initializeVerifier(JarFile.java:383)
12-Sep-2019 06:11:00         at java.util.jar.JarFile.getInputStream(JarFile.java:450)
12-Sep-2019 06:11:00         at sun.misc.URLClassPath$JarLoader$2.getInputStream(URLClassPath.java:940)
12-Sep-2019 06:11:00         at sun.misc.Resource.cachedInputStream(Resource.java:77)
12-Sep-2019 06:11:00         at sun.misc.Resource.getByteBuffer(Resource.java:160)
12-Sep-2019 06:11:00         at java.net.URLClassLoader.defineClass(URLClassLoader.java:454)
12-Sep-2019 06:11:00         at java.net.URLClassLoader.access$100(URLClassLoader.java:73)
12-Sep-2019 06:11:00         at java.net.URLClassLoader$1.run(URLClassLoader.java:368)
12-Sep-2019 06:11:00         at java.net.URLClassLoader$1.run(URLClassLoader.java:362)
12-Sep-2019 06:11:00         at java.security.AccessController.doPrivileged(Native Method)
12-Sep-2019 06:11:00         at java.net.URLClassLoader.findClass(URLClassLoader.java:361)
12-Sep-2019 06:11:00         at java.lang.ClassLoader.loadClass(ClassLoader.java:424)
12-Sep-2019 06:11:00         at sun.misc.Launcher$AppClassLoader.loadClass(Launcher.java:331)
12-Sep-2019 06:11:00         at java.lang.ClassLoader.loadClass(ClassLoader.java:357)
12-Sep-2019 06:11:00         at java.lang.Class.getDeclaredMethods0(Native Method)
12-Sep-2019 06:11:00         at java.lang.Class.privateGetDeclaredMethods(Class.java:2701)
12-Sep-2019 06:11:00         at java.lang.Class.privateGetMethodRecursive(Class.java:3048)
12-Sep-2019 06:11:00         at java.lang.Class.getMethod0(Class.java:3018)
12-Sep-2019 06:11:00         at java.lang.Class.getMethod(Class.java:1784)
12-Sep-2019 06:11:00         at org.junit.internal.builders.SuiteMethodBuilder.hasSuiteMethod(SuiteMethodBuilder.java:18)
12-Sep-2019 06:11:00         at org.junit.internal.builders.SuiteMethodBuilder.runnerForClass(SuiteMethodBuilder.java:10)
12-Sep-2019 06:11:00         at org.junit.runners.model.RunnerBuilder.safeRunnerForClass(RunnerBuilder.java:59)
12-Sep-2019 06:11:00         at org.junit.internal.builders.AllDefaultPossibilitiesBuilder.runnerForClass(AllDefaultPossibilitiesBuilder.java:26)
12-Sep-2019 06:11:00         at org.junit.runners.model.RunnerBuilder.safeRunnerForClass(RunnerBuilder.java:59)
12-Sep-2019 06:11:00         at org.junit.runners.model.RunnerBuilder.runners(RunnerBuilder.java:101)
12-Sep-2019 06:11:00         at org.junit.runners.model.RunnerBuilder.runners(RunnerBuilder.java:87)
12-Sep-2019 06:11:00         at org.junit.runners.Suite.<init>(Suite.java:102)
12-Sep-2019 06:11:00         at org.junit.runners.Suite.<init>(Suite.java:70)
12-Sep-2019 06:11:00         at sun.reflect.NativeConstructorAccessorImpl.newInstance0(Native Method)
12-Sep-2019 06:11:00         at sun.reflect.NativeConstructorAccessorImpl.newInstance(NativeConstructorAccessorImpl.java:62)
12-Sep-2019 06:11:00         at sun.reflect.DelegatingConstructorAccessorImpl.newInstance(DelegatingConstructorAccessorImpl.java:45)
12-Sep-2019 06:11:00         at java.lang.reflect.Constructor.newInstance(Constructor.java:423)
12-Sep-2019 06:11:00         at org.junit.internal.builders.AnnotatedBuilder.buildRunner(AnnotatedBuilder.java:107)
12-Sep-2019 06:11:00         at org.junit.internal.builders.AnnotatedBuilder.runnerForClass(AnnotatedBuilder.java:86)
12-Sep-2019 06:11:00         at org.junit.runners.model.RunnerBuilder.safeRunnerForClass(RunnerBuilder.java:59)
12-Sep-2019 06:11:00         at org.junit.internal.builders.AllDefaultPossibilitiesBuilder.runnerForClass(AllDefaultPossibilitiesBuilder.java:26)
12-Sep-2019 06:11:00         at org.junit.runners.model.RunnerBuilder.safeRunnerForClass(RunnerBuilder.java:59)
12-Sep-2019 06:11:00         at org.junit.internal.requests.ClassRequest.getRunner(ClassRequest.java:33)
12-Sep-2019 06:11:00         at org.apache.maven.surefire.junit4.JUnit4Provider.execute(JUnit4Provider.java:283)
12-Sep-2019 06:11:00         at org.apache.maven.surefire.junit4.JUnit4Provider.executeWithRerun(JUnit4Provider.java:173)
12-Sep-2019 06:11:00         at org.apache.maven.surefire.junit4.JUnit4Provider.executeTestSet(JUnit4Provider.java:153)
12-Sep-2019 06:11:00         at org.apache.maven.surefire.junit4.JUnit4Provider.invoke(JUnit4Provider.java:128)
12-Sep-2019 06:11:00         at org.apache.maven.surefire.booter.ForkedBooter.invokeProviderInSameClassLoader(ForkedBooter.java:203)
12-Sep-2019 06:11:00         at org.apache.maven.surefire.booter.ForkedBooter.runSuitesInProcess(ForkedBooter.java:155)
12-Sep-2019 06:11:00         at org.apache.maven.surefire.booter.ForkedBooter.main(ForkedBooter.java:103)
12-Sep-2019 06:11:00
12-Sep-2019 06:11:00 initializationError(io.cdap.cdap.apps.fileset.PartitionedFileSetUpdateTest)  Time elapsed: 0 sec  <<< ERROR!
12-Sep-2019 06:11:00 java.lang.SecurityException: Invalid signature file digest for Manifest main attributes
12-Sep-2019 06:11:00         at sun.security.util.SignatureFileVerifier.processImpl(SignatureFileVerifier.java:284)
12-Sep-2019 06:11:00         at sun.security.util.SignatureFileVerifier.process(SignatureFileVerifier.java:238)
12-Sep-2019 06:11:00         at java.util.jar.JarVerifier.processEntry(JarVerifier.java:316)
12-Sep-2019 06:11:00         at java.util.jar.JarVerifier.update(JarVerifier.java:228)
12-Sep-2019 06:11:00         at java.util.jar.JarFile.initializeVerifier(JarFile.java:383)
12-Sep-2019 06:11:00         at java.util.jar.JarFile.getInputStream(JarFile.java:450)
12-Sep-2019 06:11:00         at sun.misc.URLClassPath$JarLoader$2.getInputStream(URLClassPath.java:940)
12-Sep-2019 06:11:00         at sun.misc.Resource.cachedInputStream(Resource.java:77)
12-Sep-2019 06:11:00         at sun.misc.Resource.getByteBuffer(Resource.java:160)
12-Sep-2019 06:11:00         at java.net.URLClassLoader.defineClass(URLClassLoader.java:454)
12-Sep-2019 06:11:00         at java.net.URLClassLoader.access$100(URLClassLoader.java:73)
12-Sep-2019 06:11:00         at java.net.URLClassLoader$1.run(URLClassLoader.java:368)
12-Sep-2019 06:11:00         at java.net.URLClassLoader$1.run(URLClassLoader.java:362)
12-Sep-2019 06:11:00         at java.security.AccessController.doPrivileged(Native Method)
12-Sep-2019 06:11:00         at java.net.URLClassLoader.findClass(URLClassLoader.java:361)
12-Sep-2019 06:11:00         at java.lang.ClassLoader.loadClass(ClassLoader.java:424)
12-Sep-2019 06:11:00         at sun.misc.Launcher$AppClassLoader.loadClass(Launcher.java:331)
12-Sep-2019 06:11:00         at java.lang.ClassLoader.loadClass(ClassLoader.java:357)
12-Sep-2019 06:11:00         at java.lang.Class.getDeclaredMethods0(Native Method)
12-Sep-2019 06:11:00         at java.lang.Class.privateGetDeclaredMethods(Class.java:2701)
12-Sep-2019 06:11:00         at java.lang.Class.privateGetMethodRecursive(Class.java:3048)
12-Sep-2019 06:11:00         at java.lang.Class.getMethod0(Class.java:3018)
12-Sep-2019 06:11:00         at java.lang.Class.getMethod(Class.java:1784)
12-Sep-2019 06:11:00         at org.junit.internal.builders.SuiteMethodBuilder.hasSuiteMethod(SuiteMethodBuilder.java:18)
12-Sep-2019 06:11:00         at org.junit.internal.builders.SuiteMethodBuilder.runnerForClass(SuiteMethodBuilder.java:10)
12-Sep-2019 06:11:00         at org.junit.runners.model.RunnerBuilder.safeRunnerForClass(RunnerBuilder.java:59)
12-Sep-2019 06:11:00         at org.junit.internal.builders.AllDefaultPossibilitiesBuilder.runnerForClass(AllDefaultPossibilitiesBuilder.java:26)
12-Sep-2019 06:11:00         at org.junit.runners.model.RunnerBuilder.safeRunnerForClass(RunnerBuilder.java:59)
12-Sep-2019 06:11:00         at org.junit.runners.model.RunnerBuilder.runners(RunnerBuilder.java:101)
12-Sep-2019 06:11:00         at org.junit.runners.model.RunnerBuilder.runners(RunnerBuilder.java:87)
12-Sep-2019 06:11:00         at org.junit.runners.Suite.<init>(Suite.java:102)
12-Sep-2019 06:11:00         at org.junit.runners.Suite.<init>(Suite.java:70)
12-Sep-2019 06:11:00         at sun.reflect.NativeConstructorAccessorImpl.newInstance0(Native Method)
12-Sep-2019 06:11:00         at sun.reflect.NativeConstructorAccessorImpl.newInstance(NativeConstructorAccessorImpl.java:62)
12-Sep-2019 06:11:00         at sun.reflect.DelegatingConstructorAccessorImpl.newInstance(DelegatingConstructorAccessorImpl.java:45)
12-Sep-2019 06:11:00         at java.lang.reflect.Constructor.newInstance(Constructor.java:423)
12-Sep-2019 06:11:00         at org.junit.internal.builders.AnnotatedBuilder.buildRunner(AnnotatedBuilder.java:107)
12-Sep-2019 06:11:00         at org.junit.internal.builders.AnnotatedBuilder.runnerForClass(AnnotatedBuilder.java:86)
12-Sep-2019 06:11:00         at org.junit.runners.model.RunnerBuilder.safeRunnerForClass(RunnerBuilder.java:59)
12-Sep-2019 06:11:00         at org.junit.internal.builders.AllDefaultPossibilitiesBuilder.runnerForClass(AllDefaultPossibilitiesBuilder.java:26)
12-Sep-2019 06:11:00         at org.junit.runners.model.RunnerBuilder.safeRunnerForClass(RunnerBuilder.java:59)
12-Sep-2019 06:11:00         at org.junit.internal.requests.ClassRequest.getRunner(ClassRequest.java:33)
12-Sep-2019 06:11:00         at org.apache.maven.surefire.junit4.JUnit4Provider.execute(JUnit4Provider.java:283)
12-Sep-2019 06:11:00         at org.apache.maven.surefire.junit4.JUnit4Provider.executeWithRerun(JUnit4Provider.java:173)
12-Sep-2019 06:11:00         at org.apache.maven.surefire.junit4.JUnit4Provider.executeTestSet(JUnit4Provider.java:153)
12-Sep-2019 06:11:00         at org.apache.maven.surefire.junit4.JUnit4Provider.invoke(JUnit4Provider.java:128)
12-Sep-2019 06:11:00         at org.apache.maven.surefire.booter.ForkedBooter.invokeProviderInSameClassLoader(ForkedBooter.java:203)
12-Sep-2019 06:11:00         at org.apache.maven.surefire.booter.ForkedBooter.runSuitesInProcess(ForkedBooter.java:155)
12-Sep-2019 06:11:00         at org.apache.maven.surefire.booter.ForkedBooter.main(ForkedBooter.java:103)
12-Sep-2019 06:11:00
12-Sep-2019 06:11:00 initializationError(io.cdap.cdap.app.fileset.PermissionTest)  Time elapsed: 0.001 sec  <<< ERROR!
12-Sep-2019 06:11:00 java.lang.SecurityException: Invalid signature file digest for Manifest main attributes
12-Sep-2019 06:11:00         at sun.security.util.SignatureFileVerifier.processImpl(SignatureFileVerifier.java:284)
12-Sep-2019 06:11:00         at sun.security.util.SignatureFileVerifier.process(SignatureFileVerifier.java:238)
12-Sep-2019 06:11:00         at java.util.jar.JarVerifier.processEntry(JarVerifier.java:316)
12-Sep-2019 06:11:00         at java.util.jar.JarVerifier.update(JarVerifier.java:228)
12-Sep-2019 06:11:00         at java.util.jar.JarFile.initializeVerifier(JarFile.java:383)
12-Sep-2019 06:11:00         at java.util.jar.JarFile.getInputStream(JarFile.java:450)
12-Sep-2019 06:11:00         at sun.misc.URLClassPath$JarLoader$2.getInputStream(URLClassPath.java:940)
12-Sep-2019 06:11:00         at sun.misc.Resource.cachedInputStream(Resource.java:77)
12-Sep-2019 06:11:00         at sun.misc.Resource.getByteBuffer(Resource.java:160)
12-Sep-2019 06:11:00         at java.net.URLClassLoader.defineClass(URLClassLoader.java:454)
12-Sep-2019 06:11:00         at java.net.URLClassLoader.access$100(URLClassLoader.java:73)
12-Sep-2019 06:11:00         at java.net.URLClassLoader$1.run(URLClassLoader.java:368)
12-Sep-2019 06:11:00         at java.net.URLClassLoader$1.run(URLClassLoader.java:362)
12-Sep-2019 06:11:00         at java.security.AccessController.doPrivileged(Native Method)
12-Sep-2019 06:11:00         at java.net.URLClassLoader.findClass(URLClassLoader.java:361)
12-Sep-2019 06:11:00         at java.lang.ClassLoader.loadClass(ClassLoader.java:424)
12-Sep-2019 06:11:00         at sun.misc.Launcher$AppClassLoader.loadClass(Launcher.java:331)
12-Sep-2019 06:11:00         at java.lang.ClassLoader.loadClass(ClassLoader.java:357)
12-Sep-2019 06:11:00         at java.lang.Class.getDeclaredMethods0(Native Method)
12-Sep-2019 06:11:00         at java.lang.Class.privateGetDeclaredMethods(Class.java:2701)
12-Sep-2019 06:11:00         at java.lang.Class.privateGetMethodRecursive(Class.java:3048)
12-Sep-2019 06:11:00         at java.lang.Class.getMethod0(Class.java:3018)
12-Sep-2019 06:11:00         at java.lang.Class.getMethod(Class.java:1784)
12-Sep-2019 06:11:00         at org.junit.internal.builders.SuiteMethodBuilder.hasSuiteMethod(SuiteMethodBuilder.java:18)
12-Sep-2019 06:11:00         at org.junit.internal.builders.SuiteMethodBuilder.runnerForClass(SuiteMethodBuilder.java:10)
12-Sep-2019 06:11:00         at org.junit.runners.model.RunnerBuilder.safeRunnerForClass(RunnerBuilder.java:59)
12-Sep-2019 06:11:00         at org.junit.internal.builders.AllDefaultPossibilitiesBuilder.runnerForClass(AllDefaultPossibilitiesBuilder.java:26)
12-Sep-2019 06:11:00         at org.junit.runners.model.RunnerBuilder.safeRunnerForClass(RunnerBuilder.java:59)
12-Sep-2019 06:11:00         at org.junit.runners.model.RunnerBuilder.runners(RunnerBuilder.java:101)
12-Sep-2019 06:11:00         at org.junit.runners.model.RunnerBuilder.runners(RunnerBuilder.java:87)
12-Sep-2019 06:11:00         at org.junit.runners.Suite.<init>(Suite.java:102)
12-Sep-2019 06:11:00         at org.junit.runners.Suite.<init>(Suite.java:70)
12-Sep-2019 06:11:00         at sun.reflect.NativeConstructorAccessorImpl.newInstance0(Native Method)
12-Sep-2019 06:11:00         at sun.reflect.NativeConstructorAccessorImpl.newInstance(NativeConstructorAccessorImpl.java:62)
12-Sep-2019 06:11:00         at sun.reflect.DelegatingConstructorAccessorImpl.newInstance(DelegatingConstructorAccessorImpl.java:45)
12-Sep-2019 06:11:00         at java.lang.reflect.Constructor.newInstance(Constructor.java:423)
12-Sep-2019 06:11:00         at org.junit.internal.builders.AnnotatedBuilder.buildRunner(AnnotatedBuilder.java:107)
12-Sep-2019 06:11:00         at org.junit.internal.builders.AnnotatedBuilder.runnerForClass(AnnotatedBuilder.java:86)
12-Sep-2019 06:11:00         at org.junit.runners.model.RunnerBuilder.safeRunnerForClass(RunnerBuilder.java:59)
12-Sep-2019 06:11:00         at org.junit.internal.builders.AllDefaultPossibilitiesBuilder.runnerForClass(AllDefaultPossibilitiesBuilder.java:26)
12-Sep-2019 06:11:00         at org.junit.runners.model.RunnerBuilder.safeRunnerForClass(RunnerBuilder.java:59)
12-Sep-2019 06:11:00         at org.junit.internal.requests.ClassRequest.getRunner(ClassRequest.java:33)
12-Sep-2019 06:11:00         at org.apache.maven.surefire.junit4.JUnit4Provider.execute(JUnit4Provider.java:283)
12-Sep-2019 06:11:00         at org.apache.maven.surefire.junit4.JUnit4Provider.executeWithRerun(JUnit4Provider.java:173)
12-Sep-2019 06:11:00         at org.apache.maven.surefire.junit4.JUnit4Provider.executeTestSet(JUnit4Provider.java:153)
12-Sep-2019 06:11:00         at org.apache.maven.surefire.junit4.JUnit4Provider.invoke(JUnit4Provider.java:128)
12-Sep-2019 06:11:00         at org.apache.maven.surefire.booter.ForkedBooter.invokeProviderInSameClassLoader(ForkedBooter.java:203)
12-Sep-2019 06:11:00         at org.apache.maven.surefire.booter.ForkedBooter.runSuitesInProcess(ForkedBooter.java:155)
12-Sep-2019 06:11:00         at org.apache.maven.surefire.booter.ForkedBooter.main(ForkedBooter.java:103)
12-Sep-2019 06:11:00
12-Sep-2019 06:11:00 initializationError(io.cdap.cdap.apps.metadata.ProgramMetadataTest)  Time elapsed: 0 sec  <<< ERROR!
12-Sep-2019 06:11:00 java.lang.SecurityException: Invalid signature file digest for Manifest main attributes
12-Sep-2019 06:11:00         at sun.security.util.SignatureFileVerifier.processImpl(SignatureFileVerifier.java:284)
12-Sep-2019 06:11:00         at sun.security.util.SignatureFileVerifier.process(SignatureFileVerifier.java:238)
12-Sep-2019 06:11:00         at java.util.jar.JarVerifier.processEntry(JarVerifier.java:316)
12-Sep-2019 06:11:00         at java.util.jar.JarVerifier.update(JarVerifier.java:228)
12-Sep-2019 06:11:00         at java.util.jar.JarFile.initializeVerifier(JarFile.java:383)
12-Sep-2019 06:11:00         at java.util.jar.JarFile.getInputStream(JarFile.java:450)
12-Sep-2019 06:11:00         at sun.misc.URLClassPath$JarLoader$2.getInputStream(URLClassPath.java:940)
12-Sep-2019 06:11:00         at sun.misc.Resource.cachedInputStream(Resource.java:77)
12-Sep-2019 06:11:00         at sun.misc.Resource.getByteBuffer(Resource.java:160)
12-Sep-2019 06:11:00         at java.net.URLClassLoader.defineClass(URLClassLoader.java:454)
12-Sep-2019 06:11:00         at java.net.URLClassLoader.access$100(URLClassLoader.java:73)
12-Sep-2019 06:11:00         at java.net.URLClassLoader$1.run(URLClassLoader.java:368)
12-Sep-2019 06:11:00         at java.net.URLClassLoader$1.run(URLClassLoader.java:362)
12-Sep-2019 06:11:00         at java.security.AccessController.doPrivileged(Native Method)
12-Sep-2019 06:11:00         at java.net.URLClassLoader.findClass(URLClassLoader.java:361)
12-Sep-2019 06:11:00         at java.lang.ClassLoader.loadClass(ClassLoader.java:424)
12-Sep-2019 06:11:00         at sun.misc.Launcher$AppClassLoader.loadClass(Launcher.java:331)
12-Sep-2019 06:11:00         at java.lang.ClassLoader.loadClass(ClassLoader.java:357)
12-Sep-2019 06:11:00         at java.lang.Class.getDeclaredMethods0(Native Method)
12-Sep-2019 06:11:00         at java.lang.Class.privateGetDeclaredMethods(Class.java:2701)
12-Sep-2019 06:11:00         at java.lang.Class.privateGetMethodRecursive(Class.java:3048)
12-Sep-2019 06:11:00         at java.lang.Class.getMethod0(Class.java:3018)
12-Sep-2019 06:11:00         at java.lang.Class.getMethod(Class.java:1784)
12-Sep-2019 06:11:00         at org.junit.internal.builders.SuiteMethodBuilder.hasSuiteMethod(SuiteMethodBuilder.java:18)
12-Sep-2019 06:11:00         at org.junit.internal.builders.SuiteMethodBuilder.runnerForClass(SuiteMethodBuilder.java:10)
12-Sep-2019 06:11:00         at org.junit.runners.model.RunnerBuilder.safeRunnerForClass(RunnerBuilder.java:59)
12-Sep-2019 06:11:00         at org.junit.internal.builders.AllDefaultPossibilitiesBuilder.runnerForClass(AllDefaultPossibilitiesBuilder.java:26)
12-Sep-2019 06:11:00         at org.junit.runners.model.RunnerBuilder.safeRunnerForClass(RunnerBuilder.java:59)
12-Sep-2019 06:11:00         at org.junit.runners.model.RunnerBuilder.runners(RunnerBuilder.java:101)
12-Sep-2019 06:11:00         at org.junit.runners.model.RunnerBuilder.runners(RunnerBuilder.java:87)
12-Sep-2019 06:11:00         at org.junit.runners.Suite.<init>(Suite.java:102)
12-Sep-2019 06:11:00         at org.junit.runners.Suite.<init>(Suite.java:70)
12-Sep-2019 06:11:00         at sun.reflect.NativeConstructorAccessorImpl.newInstance0(Native Method)
12-Sep-2019 06:11:00         at sun.reflect.NativeConstructorAccessorImpl.newInstance(NativeConstructorAccessorImpl.java:62)
12-Sep-2019 06:11:00         at sun.reflect.DelegatingConstructorAccessorImpl.newInstance(DelegatingConstructorAccessorImpl.java:45)
12-Sep-2019 06:11:00         at java.lang.reflect.Constructor.newInstance(Constructor.java:423)
12-Sep-2019 06:11:00         at org.junit.internal.builders.AnnotatedBuilder.buildRunner(AnnotatedBuilder.java:107)
12-Sep-2019 06:11:00         at org.junit.internal.builders.AnnotatedBuilder.runnerForClass(AnnotatedBuilder.java:86)
12-Sep-2019 06:11:00         at org.junit.runners.model.RunnerBuilder.safeRunnerForClass(RunnerBuilder.java:59)
12-Sep-2019 06:11:00         at org.junit.internal.builders.AllDefaultPossibilitiesBuilder.runnerForClass(AllDefaultPossibilitiesBuilder.java:26)
12-Sep-2019 06:11:00         at org.junit.runners.model.RunnerBuilder.safeRunnerForClass(RunnerBuilder.java:59)
12-Sep-2019 06:11:00         at org.junit.internal.requests.ClassRequest.getRunner(ClassRequest.java:33)
12-Sep-2019 06:11:00         at org.apache.maven.surefire.junit4.JUnit4Provider.execute(JUnit4Provider.java:283)
12-Sep-2019 06:11:00         at org.apache.maven.surefire.junit4.JUnit4Provider.executeWithRerun(JUnit4Provider.java:173)
12-Sep-2019 06:11:00         at org.apache.maven.surefire.junit4.JUnit4Provider.executeTestSet(JUnit4Provider.java:153)
12-Sep-2019 06:11:00         at org.apache.maven.surefire.junit4.JUnit4Provider.invoke(JUnit4Provider.java:128)
12-Sep-2019 06:11:00         at org.apache.maven.surefire.booter.ForkedBooter.invokeProviderInSameClassLoader(ForkedBooter.java:203)
12-Sep-2019 06:11:00         at org.apache.maven.surefire.booter.ForkedBooter.runSuitesInProcess(ForkedBooter.java:155)
12-Sep-2019 06:11:00         at org.apache.maven.surefire.booter.ForkedBooter.main(ForkedBooter.java:103)
12-Sep-2019 06:11:00
12-Sep-2019 06:11:00 initializationError(io.cdap.cdap.app.mapreduce.readless.ReadlessIncrementTest)  Time elapsed: 0 sec  <<< ERROR!
12-Sep-2019 06:11:00 java.lang.SecurityException: Invalid signature file digest for Manifest main attributes
12-Sep-2019 06:11:00         at sun.security.util.SignatureFileVerifier.processImpl(SignatureFileVerifier.java:284)
12-Sep-2019 06:11:00         at sun.security.util.SignatureFileVerifier.process(SignatureFileVerifier.java:238)
12-Sep-2019 06:11:00         at java.util.jar.JarVerifier.processEntry(JarVerifier.java:316)
12-Sep-2019 06:11:00         at java.util.jar.JarVerifier.update(JarVerifier.java:228)
12-Sep-2019 06:11:00         at java.util.jar.JarFile.initializeVerifier(JarFile.java:383)
12-Sep-2019 06:11:00         at java.util.jar.JarFile.getInputStream(JarFile.java:450)
12-Sep-2019 06:11:00         at sun.misc.URLClassPath$JarLoader$2.getInputStream(URLClassPath.java:940)
12-Sep-2019 06:11:00         at sun.misc.Resource.cachedInputStream(Resource.java:77)
12-Sep-2019 06:11:00         at sun.misc.Resource.getByteBuffer(Resource.java:160)
12-Sep-2019 06:11:00         at java.net.URLClassLoader.defineClass(URLClassLoader.java:454)
12-Sep-2019 06:11:00         at java.net.URLClassLoader.access$100(URLClassLoader.java:73)
12-Sep-2019 06:11:00         at java.net.URLClassLoader$1.run(URLClassLoader.java:368)
12-Sep-2019 06:11:00         at java.net.URLClassLoader$1.run(URLClassLoader.java:362)
12-Sep-2019 06:11:00         at java.security.AccessController.doPrivileged(Native Method)
12-Sep-2019 06:11:00         at java.net.URLClassLoader.findClass(URLClassLoader.java:361)
12-Sep-2019 06:11:00         at java.lang.ClassLoader.loadClass(ClassLoader.java:424)
12-Sep-2019 06:11:00         at sun.misc.Launcher$AppClassLoader.loadClass(Launcher.java:331)
12-Sep-2019 06:11:00         at java.lang.ClassLoader.loadClass(ClassLoader.java:357)
12-Sep-2019 06:11:00         at java.lang.Class.getDeclaredMethods0(Native Method)
12-Sep-2019 06:11:00         at java.lang.Class.privateGetDeclaredMethods(Class.java:2701)
12-Sep-2019 06:11:00         at java.lang.Class.privateGetMethodRecursive(Class.java:3048)
12-Sep-2019 06:11:00         at java.lang.Class.getMethod0(Class.java:3018)
12-Sep-2019 06:11:00         at java.lang.Class.getMethod(Class.java:1784)
12-Sep-2019 06:11:00         at org.junit.internal.builders.SuiteMethodBuilder.hasSuiteMethod(SuiteMethodBuilder.java:18)
12-Sep-2019 06:11:00         at org.junit.internal.builders.SuiteMethodBuilder.runnerForClass(SuiteMethodBuilder.java:10)
12-Sep-2019 06:11:00         at org.junit.runners.model.RunnerBuilder.safeRunnerForClass(RunnerBuilder.java:59)
12-Sep-2019 06:11:00         at org.junit.internal.builders.AllDefaultPossibilitiesBuilder.runnerForClass(AllDefaultPossibilitiesBuilder.java:26)
12-Sep-2019 06:11:00         at org.junit.runners.model.RunnerBuilder.safeRunnerForClass(RunnerBuilder.java:59)
12-Sep-2019 06:11:00         at org.junit.runners.model.RunnerBuilder.runners(RunnerBuilder.java:101)
12-Sep-2019 06:11:00         at org.junit.runners.model.RunnerBuilder.runners(RunnerBuilder.java:87)
12-Sep-2019 06:11:00         at org.junit.runners.Suite.<init>(Suite.java:102)
12-Sep-2019 06:11:00         at org.junit.runners.Suite.<init>(Suite.java:70)
12-Sep-2019 06:11:00         at sun.reflect.NativeConstructorAccessorImpl.newInstance0(Native Method)
12-Sep-2019 06:11:00         at sun.reflect.NativeConstructorAccessorImpl.newInstance(NativeConstructorAccessorImpl.java:62)
12-Sep-2019 06:11:00         at sun.reflect.DelegatingConstructorAccessorImpl.newInstance(DelegatingConstructorAccessorImpl.java:45)
12-Sep-2019 06:11:00         at java.lang.reflect.Constructor.newInstance(Constructor.java:423)
12-Sep-2019 06:11:00         at org.junit.internal.builders.AnnotatedBuilder.buildRunner(AnnotatedBuilder.java:107)
12-Sep-2019 06:11:00         at org.junit.internal.builders.AnnotatedBuilder.runnerForClass(AnnotatedBuilder.java:86)
12-Sep-2019 06:11:00         at org.junit.runners.model.RunnerBuilder.safeRunnerForClass(RunnerBuilder.java:59)
12-Sep-2019 06:11:00         at org.junit.internal.builders.AllDefaultPossibilitiesBuilder.runnerForClass(AllDefaultPossibilitiesBuilder.java:26)
12-Sep-2019 06:11:00         at org.junit.runners.model.RunnerBuilder.safeRunnerForClass(RunnerBuilder.java:59)
12-Sep-2019 06:11:00         at org.junit.internal.requests.ClassRequest.getRunner(ClassRequest.java:33)
12-Sep-2019 06:11:00         at org.apache.maven.surefire.junit4.JUnit4Provider.execute(JUnit4Provider.java:283)
12-Sep-2019 06:11:00         at org.apache.maven.surefire.junit4.JUnit4Provider.executeWithRerun(JUnit4Provider.java:173)
12-Sep-2019 06:11:00         at org.apache.maven.surefire.junit4.JUnit4Provider.executeTestSet(JUnit4Provider.java:153)
12-Sep-2019 06:11:00         at org.apache.maven.surefire.junit4.JUnit4Provider.invoke(JUnit4Provider.java:128)
12-Sep-2019 06:11:00         at org.apache.maven.surefire.booter.ForkedBooter.invokeProviderInSameClassLoader(ForkedBooter.java:203)
12-Sep-2019 06:11:00         at org.apache.maven.surefire.booter.ForkedBooter.runSuitesInProcess(ForkedBooter.java:155)
12-Sep-2019 06:11:00         at org.apache.maven.surefire.booter.ForkedBooter.main(ForkedBooter.java:103)
12-Sep-2019 06:11:00
12-Sep-2019 06:11:00 initializationError(io.cdap.cdap.remote.dataset.test.RemoteCubeTest)  Time elapsed: 0.001 sec  <<< ERROR!
12-Sep-2019 06:11:00 java.lang.SecurityException: Invalid signature file digest for Manifest main attributes
12-Sep-2019 06:11:00         at sun.security.util.SignatureFileVerifier.processImpl(SignatureFileVerifier.java:284)
12-Sep-2019 06:11:00         at sun.security.util.SignatureFileVerifier.process(SignatureFileVerifier.java:238)
12-Sep-2019 06:11:00         at java.util.jar.JarVerifier.processEntry(JarVerifier.java:316)
12-Sep-2019 06:11:00         at java.util.jar.JarVerifier.update(JarVerifier.java:228)
12-Sep-2019 06:11:00         at java.util.jar.JarFile.initializeVerifier(JarFile.java:383)
12-Sep-2019 06:11:00         at java.util.jar.JarFile.getInputStream(JarFile.java:450)
12-Sep-2019 06:11:00         at sun.misc.URLClassPath$JarLoader$2.getInputStream(URLClassPath.java:940)
12-Sep-2019 06:11:00         at sun.misc.Resource.cachedInputStream(Resource.java:77)
12-Sep-2019 06:11:00         at sun.misc.Resource.getByteBuffer(Resource.java:160)
12-Sep-2019 06:11:00         at java.net.URLClassLoader.defineClass(URLClassLoader.java:454)
12-Sep-2019 06:11:00         at java.net.URLClassLoader.access$100(URLClassLoader.java:73)
12-Sep-2019 06:11:00         at java.net.URLClassLoader$1.run(URLClassLoader.java:368)
12-Sep-2019 06:11:00         at java.net.URLClassLoader$1.run(URLClassLoader.java:362)
12-Sep-2019 06:11:00         at java.security.AccessController.doPrivileged(Native Method)
12-Sep-2019 06:11:00         at java.net.URLClassLoader.findClass(URLClassLoader.java:361)
12-Sep-2019 06:11:00         at java.lang.ClassLoader.loadClass(ClassLoader.java:424)
12-Sep-2019 06:11:00         at sun.misc.Launcher$AppClassLoader.loadClass(Launcher.java:331)
12-Sep-2019 06:11:00         at java.lang.ClassLoader.loadClass(ClassLoader.java:357)
12-Sep-2019 06:11:00         at java.lang.Class.getDeclaredMethods0(Native Method)
12-Sep-2019 06:11:00         at java.lang.Class.privateGetDeclaredMethods(Class.java:2701)
12-Sep-2019 06:11:00         at java.lang.Class.privateGetMethodRecursive(Class.java:3048)
12-Sep-2019 06:11:00         at java.lang.Class.getMethod0(Class.java:3018)
12-Sep-2019 06:11:00         at java.lang.Class.getMethod(Class.java:1784)
12-Sep-2019 06:11:00         at org.junit.internal.builders.SuiteMethodBuilder.hasSuiteMethod(SuiteMethodBuilder.java:18)
12-Sep-2019 06:11:00         at org.junit.internal.builders.SuiteMethodBuilder.runnerForClass(SuiteMethodBuilder.java:10)
12-Sep-2019 06:11:00         at org.junit.runners.model.RunnerBuilder.safeRunnerForClass(RunnerBuilder.java:59)
12-Sep-2019 06:11:00         at org.junit.internal.builders.AllDefaultPossibilitiesBuilder.runnerForClass(AllDefaultPossibilitiesBuilder.java:26)
12-Sep-2019 06:11:00         at org.junit.runners.model.RunnerBuilder.safeRunnerForClass(RunnerBuilder.java:59)
12-Sep-2019 06:11:00         at org.junit.runners.model.RunnerBuilder.runners(RunnerBuilder.java:101)
12-Sep-2019 06:11:00         at org.junit.runners.model.RunnerBuilder.runners(RunnerBuilder.java:87)
12-Sep-2019 06:11:00         at org.junit.runners.Suite.<init>(Suite.java:102)
12-Sep-2019 06:11:00         at org.junit.runners.Suite.<init>(Suite.java:70)
12-Sep-2019 06:11:00         at sun.reflect.NativeConstructorAccessorImpl.newInstance0(Native Method)
12-Sep-2019 06:11:00         at sun.reflect.NativeConstructorAccessorImpl.newInstance(NativeConstructorAccessorImpl.java:62)
12-Sep-2019 06:11:00         at sun.reflect.DelegatingConstructorAccessorImpl.newInstance(DelegatingConstructorAccessorImpl.java:45)
12-Sep-2019 06:11:00         at java.lang.reflect.Constructor.newInstance(Constructor.java:423)
12-Sep-2019 06:11:00         at org.junit.internal.builders.AnnotatedBuilder.buildRunner(AnnotatedBuilder.java:107)
12-Sep-2019 06:11:00         at org.junit.internal.builders.AnnotatedBuilder.runnerForClass(AnnotatedBuilder.java:86)
12-Sep-2019 06:11:00         at org.junit.runners.model.RunnerBuilder.safeRunnerForClass(RunnerBuilder.java:59)
12-Sep-2019 06:11:00         at org.junit.internal.builders.AllDefaultPossibilitiesBuilder.runnerForClass(AllDefaultPossibilitiesBuilder.java:26)
12-Sep-2019 06:11:00         at org.junit.runners.model.RunnerBuilder.safeRunnerForClass(RunnerBuilder.java:59)
12-Sep-2019 06:11:00         at org.junit.internal.requests.ClassRequest.getRunner(ClassRequest.java:33)
12-Sep-2019 06:11:00         at org.apache.maven.surefire.junit4.JUnit4Provider.execute(JUnit4Provider.java:283)
12-Sep-2019 06:11:00         at org.apache.maven.surefire.junit4.JUnit4Provider.executeWithRerun(JUnit4Provider.java:173)
12-Sep-2019 06:11:00         at org.apache.maven.surefire.junit4.JUnit4Provider.executeTestSet(JUnit4Provider.java:153)
12-Sep-2019 06:11:00         at org.apache.maven.surefire.junit4.JUnit4Provider.invoke(JUnit4Provider.java:128)
12-Sep-2019 06:11:00         at org.apache.maven.surefire.booter.ForkedBooter.invokeProviderInSameClassLoader(ForkedBooter.java:203)
12-Sep-2019 06:11:00         at org.apache.maven.surefire.booter.ForkedBooter.runSuitesInProcess(ForkedBooter.java:155)
12-Sep-2019 06:11:00         at org.apache.maven.surefire.booter.ForkedBooter.main(ForkedBooter.java:103)
12-Sep-2019 06:11:00
12-Sep-2019 06:11:00 initializationError(io.cdap.cdap.remote.dataset.test.RemoteKeyValueTest)  Time elapsed: 0.009 sec  <<< ERROR!
12-Sep-2019 06:11:00 java.lang.SecurityException: Invalid signature file digest for Manifest main attributes
12-Sep-2019 06:11:00         at sun.security.util.SignatureFileVerifier.processImpl(SignatureFileVerifier.java:284)
12-Sep-2019 06:11:00         at sun.security.util.SignatureFileVerifier.process(SignatureFileVerifier.java:238)
12-Sep-2019 06:11:00         at java.util.jar.JarVerifier.processEntry(JarVerifier.java:316)
12-Sep-2019 06:11:00         at java.util.jar.JarVerifier.update(JarVerifier.java:228)
12-Sep-2019 06:11:00         at java.util.jar.JarFile.initializeVerifier(JarFile.java:383)
12-Sep-2019 06:11:00         at java.util.jar.JarFile.getInputStream(JarFile.java:450)
12-Sep-2019 06:11:00         at sun.misc.URLClassPath$JarLoader$2.getInputStream(URLClassPath.java:940)
12-Sep-2019 06:11:00         at sun.misc.Resource.cachedInputStream(Resource.java:77)
12-Sep-2019 06:11:00         at sun.misc.Resource.getByteBuffer(Resource.java:160)
12-Sep-2019 06:11:00         at java.net.URLClassLoader.defineClass(URLClassLoader.java:454)
12-Sep-2019 06:11:00         at java.net.URLClassLoader.access$100(URLClassLoader.java:73)
12-Sep-2019 06:11:00         at java.net.URLClassLoader$1.run(URLClassLoader.java:368)
12-Sep-2019 06:11:00         at java.net.URLClassLoader$1.run(URLClassLoader.java:362)
12-Sep-2019 06:11:00         at java.security.AccessController.doPrivileged(Native Method)
12-Sep-2019 06:11:00         at java.net.URLClassLoader.findClass(URLClassLoader.java:361)
12-Sep-2019 06:11:00         at java.lang.ClassLoader.loadClass(ClassLoader.java:424)
12-Sep-2019 06:11:00         at sun.misc.Launcher$AppClassLoader.loadClass(Launcher.java:331)
12-Sep-2019 06:11:00         at java.lang.ClassLoader.loadClass(ClassLoader.java:357)
12-Sep-2019 06:11:00         at java.lang.Class.getDeclaredMethods0(Native Method)
12-Sep-2019 06:11:00         at java.lang.Class.privateGetDeclaredMethods(Class.java:2701)
12-Sep-2019 06:11:00         at java.lang.Class.privateGetMethodRecursive(Class.java:3048)
12-Sep-2019 06:11:00         at java.lang.Class.getMethod0(Class.java:3018)
12-Sep-2019 06:11:00         at java.lang.Class.getMethod(Class.java:1784)
12-Sep-2019 06:11:00         at org.junit.internal.builders.SuiteMethodBuilder.hasSuiteMethod(SuiteMethodBuilder.java:18)
12-Sep-2019 06:11:00         at org.junit.internal.builders.SuiteMethodBuilder.runnerForClass(SuiteMethodBuilder.java:10)
12-Sep-2019 06:11:00         at org.junit.runners.model.RunnerBuilder.safeRunnerForClass(RunnerBuilder.java:59)
12-Sep-2019 06:11:00         at org.junit.internal.builders.AllDefaultPossibilitiesBuilder.runnerForClass(AllDefaultPossibilitiesBuilder.java:26)
12-Sep-2019 06:11:00         at org.junit.runners.model.RunnerBuilder.safeRunnerForClass(RunnerBuilder.java:59)
12-Sep-2019 06:11:00         at org.junit.runners.model.RunnerBuilder.runners(RunnerBuilder.java:101)
12-Sep-2019 06:11:00         at org.junit.runners.model.RunnerBuilder.runners(RunnerBuilder.java:87)
12-Sep-2019 06:11:00         at org.junit.runners.Suite.<init>(Suite.java:102)
12-Sep-2019 06:11:00         at org.junit.runners.Suite.<init>(Suite.java:70)
12-Sep-2019 06:11:00         at sun.reflect.NativeConstructorAccessorImpl.newInstance0(Native Method)
12-Sep-2019 06:11:00         at sun.reflect.NativeConstructorAccessorImpl.newInstance(NativeConstructorAccessorImpl.java:62)
12-Sep-2019 06:11:00         at sun.reflect.DelegatingConstructorAccessorImpl.newInstance(DelegatingConstructorAccessorImpl.java:45)
12-Sep-2019 06:11:00         at java.lang.reflect.Constructor.newInstance(Constructor.java:423)
12-Sep-2019 06:11:00         at org.junit.internal.builders.AnnotatedBuilder.buildRunner(AnnotatedBuilder.java:107)
12-Sep-2019 06:11:00         at org.junit.internal.builders.AnnotatedBuilder.runnerForClass(AnnotatedBuilder.java:86)
12-Sep-2019 06:11:00         at org.junit.runners.model.RunnerBuilder.safeRunnerForClass(RunnerBuilder.java:59)
12-Sep-2019 06:11:00         at org.junit.internal.builders.AllDefaultPossibilitiesBuilder.runnerForClass(AllDefaultPossibilitiesBuilder.java:26)
12-Sep-2019 06:11:00         at org.junit.runners.model.RunnerBuilder.safeRunnerForClass(RunnerBuilder.java:59)
12-Sep-2019 06:11:00         at org.junit.internal.requests.ClassRequest.getRunner(ClassRequest.java:33)
12-Sep-2019 06:11:00         at org.apache.maven.surefire.junit4.JUnit4Provider.execute(JUnit4Provider.java:283)
12-Sep-2019 06:11:00         at org.apache.maven.surefire.junit4.JUnit4Provider.executeWithRerun(JUnit4Provider.java:173)
12-Sep-2019 06:11:00         at org.apache.maven.surefire.junit4.JUnit4Provider.executeTestSet(JUnit4Provider.java:153)
12-Sep-2019 06:11:00         at org.apache.maven.surefire.junit4.JUnit4Provider.invoke(JUnit4Provider.java:128)
12-Sep-2019 06:11:00         at org.apache.maven.surefire.booter.ForkedBooter.invokeProviderInSameClassLoader(ForkedBooter.java:203)
12-Sep-2019 06:11:00         at org.apache.maven.surefire.booter.ForkedBooter.runSuitesInProcess(ForkedBooter.java:155)
12-Sep-2019 06:11:00         at org.apache.maven.surefire.booter.ForkedBooter.main(ForkedBooter.java:103)
12-Sep-2019 06:11:00
12-Sep-2019 06:11:00 initializationError(io.cdap.cdap.remote.dataset.test.RemoteTableTest)  Time elapsed: 0.001 sec  <<< ERROR!
12-Sep-2019 06:11:00 java.lang.SecurityException: Invalid signature file digest for Manifest main attributes
12-Sep-2019 06:11:00         at sun.security.util.SignatureFileVerifier.processImpl(SignatureFileVerifier.java:284)
12-Sep-2019 06:11:00         at sun.security.util.SignatureFileVerifier.process(SignatureFileVerifier.java:238)
12-Sep-2019 06:11:00         at java.util.jar.JarVerifier.processEntry(JarVerifier.java:316)
12-Sep-2019 06:11:00         at java.util.jar.JarVerifier.update(JarVerifier.java:228)
12-Sep-2019 06:11:00         at java.util.jar.JarFile.initializeVerifier(JarFile.java:383)
12-Sep-2019 06:11:00         at java.util.jar.JarFile.getInputStream(JarFile.java:450)
12-Sep-2019 06:11:00         at sun.misc.URLClassPath$JarLoader$2.getInputStream(URLClassPath.java:940)
12-Sep-2019 06:11:00         at sun.misc.Resource.cachedInputStream(Resource.java:77)
12-Sep-2019 06:11:00         at sun.misc.Resource.getByteBuffer(Resource.java:160)
12-Sep-2019 06:11:00         at java.net.URLClassLoader.defineClass(URLClassLoader.java:454)
12-Sep-2019 06:11:00         at java.net.URLClassLoader.access$100(URLClassLoader.java:73)
12-Sep-2019 06:11:00         at java.net.URLClassLoader$1.run(URLClassLoader.java:368)
12-Sep-2019 06:11:00         at java.net.URLClassLoader$1.run(URLClassLoader.java:362)
12-Sep-2019 06:11:00         at java.security.AccessController.doPrivileged(Native Method)
12-Sep-2019 06:11:00         at java.net.URLClassLoader.findClass(URLClassLoader.java:361)
12-Sep-2019 06:11:00         at java.lang.ClassLoader.loadClass(ClassLoader.java:424)
12-Sep-2019 06:11:00         at sun.misc.Launcher$AppClassLoader.loadClass(Launcher.java:331)
12-Sep-2019 06:11:00         at java.lang.ClassLoader.loadClass(ClassLoader.java:357)
12-Sep-2019 06:11:00         at java.lang.Class.getDeclaredMethods0(Native Method)
12-Sep-2019 06:11:00         at java.lang.Class.privateGetDeclaredMethods(Class.java:2701)
12-Sep-2019 06:11:00         at java.lang.Class.privateGetMethodRecursive(Class.java:3048)
12-Sep-2019 06:11:00         at java.lang.Class.getMethod0(Class.java:3018)
12-Sep-2019 06:11:00         at java.lang.Class.getMethod(Class.java:1784)
12-Sep-2019 06:11:00         at org.junit.internal.builders.SuiteMethodBuilder.hasSuiteMethod(SuiteMethodBuilder.java:18)
12-Sep-2019 06:11:00         at org.junit.internal.builders.SuiteMethodBuilder.runnerForClass(SuiteMethodBuilder.java:10)
12-Sep-2019 06:11:00         at org.junit.runners.model.RunnerBuilder.safeRunnerForClass(RunnerBuilder.java:59)
12-Sep-2019 06:11:00         at org.junit.internal.builders.AllDefaultPossibilitiesBuilder.runnerForClass(AllDefaultPossibilitiesBuilder.java:26)
12-Sep-2019 06:11:00         at org.junit.runners.model.RunnerBuilder.safeRunnerForClass(RunnerBuilder.java:59)
12-Sep-2019 06:11:00         at org.junit.runners.model.RunnerBuilder.runners(RunnerBuilder.java:101)
12-Sep-2019 06:11:00         at org.junit.runners.model.RunnerBuilder.runners(RunnerBuilder.java:87)
12-Sep-2019 06:11:00         at org.junit.runners.Suite.<init>(Suite.java:102)
12-Sep-2019 06:11:00         at org.junit.runners.Suite.<init>(Suite.java:70)
12-Sep-2019 06:11:00         at sun.reflect.NativeConstructorAccessorImpl.newInstance0(Native Method)
12-Sep-2019 06:11:00         at sun.reflect.NativeConstructorAccessorImpl.newInstance(NativeConstructorAccessorImpl.java:62)
12-Sep-2019 06:11:00         at sun.reflect.DelegatingConstructorAccessorImpl.newInstance(DelegatingConstructorAccessorImpl.java:45)
12-Sep-2019 06:11:00         at java.lang.reflect.Constructor.newInstance(Constructor.java:423)
12-Sep-2019 06:11:00         at org.junit.internal.builders.AnnotatedBuilder.buildRunner(AnnotatedBuilder.java:107)
12-Sep-2019 06:11:00         at org.junit.internal.builders.AnnotatedBuilder.runnerForClass(AnnotatedBuilder.java:86)
12-Sep-2019 06:11:00         at org.junit.runners.model.RunnerBuilder.safeRunnerForClass(RunnerBuilder.java:59)
12-Sep-2019 06:11:00         at org.junit.internal.builders.AllDefaultPossibilitiesBuilder.runnerForClass(AllDefaultPossibilitiesBuilder.java:26)
12-Sep-2019 06:11:00         at org.junit.runners.model.RunnerBuilder.safeRunnerForClass(RunnerBuilder.java:59)
12-Sep-2019 06:11:00         at org.junit.internal.requests.ClassRequest.getRunner(ClassRequest.java:33)
12-Sep-2019 06:11:00         at org.apache.maven.surefire.junit4.JUnit4Provider.execute(JUnit4Provider.java:283)
12-Sep-2019 06:11:00         at org.apache.maven.surefire.junit4.JUnit4Provider.executeWithRerun(JUnit4Provider.java:173)
12-Sep-2019 06:11:00         at org.apache.maven.surefire.junit4.JUnit4Provider.executeTestSet(JUnit4Provider.java:153)
12-Sep-2019 06:11:00         at org.apache.maven.surefire.junit4.JUnit4Provider.invoke(JUnit4Provider.java:128)
12-Sep-2019 06:11:00         at org.apache.maven.surefire.booter.ForkedBooter.invokeProviderInSameClassLoader(ForkedBooter.java:203)
12-Sep-2019 06:11:00         at org.apache.maven.surefire.booter.ForkedBooter.runSuitesInProcess(ForkedBooter.java:155)
12-Sep-2019 06:11:00         at org.apache.maven.surefire.booter.ForkedBooter.main(ForkedBooter.java:103)
12-Sep-2019 06:11:00
12-Sep-2019 06:11:00 initializationError(io.cdap.cdap.app.etl.batch.RowDenormalizerTest)  Time elapsed: 0 sec  <<< ERROR!
12-Sep-2019 06:11:00 java.lang.SecurityException: Invalid signature file digest for Manifest main attributes
12-Sep-2019 06:11:00         at sun.security.util.SignatureFileVerifier.processImpl(SignatureFileVerifier.java:284)
12-Sep-2019 06:11:00         at sun.security.util.SignatureFileVerifier.process(SignatureFileVerifier.java:238)
12-Sep-2019 06:11:00         at java.util.jar.JarVerifier.processEntry(JarVerifier.java:316)
12-Sep-2019 06:11:00         at java.util.jar.JarVerifier.update(JarVerifier.java:228)
12-Sep-2019 06:11:00         at java.util.jar.JarFile.initializeVerifier(JarFile.java:383)
12-Sep-2019 06:11:00         at java.util.jar.JarFile.getInputStream(JarFile.java:450)
12-Sep-2019 06:11:00         at sun.misc.URLClassPath$JarLoader$2.getInputStream(URLClassPath.java:940)
12-Sep-2019 06:11:00         at sun.misc.Resource.cachedInputStream(Resource.java:77)
12-Sep-2019 06:11:00         at sun.misc.Resource.getByteBuffer(Resource.java:160)
12-Sep-2019 06:11:00         at java.net.URLClassLoader.defineClass(URLClassLoader.java:454)
12-Sep-2019 06:11:00         at java.net.URLClassLoader.access$100(URLClassLoader.java:73)
12-Sep-2019 06:11:00         at java.net.URLClassLoader$1.run(URLClassLoader.java:368)
12-Sep-2019 06:11:00         at java.net.URLClassLoader$1.run(URLClassLoader.java:362)
12-Sep-2019 06:11:00         at java.security.AccessController.doPrivileged(Native Method)
12-Sep-2019 06:11:00         at java.net.URLClassLoader.findClass(URLClassLoader.java:361)
12-Sep-2019 06:11:00         at java.lang.ClassLoader.loadClass(ClassLoader.java:424)
12-Sep-2019 06:11:00         at sun.misc.Launcher$AppClassLoader.loadClass(Launcher.java:331)
12-Sep-2019 06:11:00         at java.lang.ClassLoader.loadClass(ClassLoader.java:357)
12-Sep-2019 06:11:00         at java.lang.Class.getDeclaredMethods0(Native Method)
12-Sep-2019 06:11:00         at java.lang.Class.privateGetDeclaredMethods(Class.java:2701)
12-Sep-2019 06:11:00         at java.lang.Class.privateGetMethodRecursive(Class.java:3048)
12-Sep-2019 06:11:00         at java.lang.Class.getMethod0(Class.java:3018)
12-Sep-2019 06:11:00         at java.lang.Class.getMethod(Class.java:1784)
12-Sep-2019 06:11:00         at org.junit.internal.builders.SuiteMethodBuilder.hasSuiteMethod(SuiteMethodBuilder.java:18)
12-Sep-2019 06:11:00         at org.junit.internal.builders.SuiteMethodBuilder.runnerForClass(SuiteMethodBuilder.java:10)
12-Sep-2019 06:11:00         at org.junit.runners.model.RunnerBuilder.safeRunnerForClass(RunnerBuilder.java:59)
12-Sep-2019 06:11:00         at org.junit.internal.builders.AllDefaultPossibilitiesBuilder.runnerForClass(AllDefaultPossibilitiesBuilder.java:26)
12-Sep-2019 06:11:00         at org.junit.runners.model.RunnerBuilder.safeRunnerForClass(RunnerBuilder.java:59)
12-Sep-2019 06:11:00         at org.junit.runners.model.RunnerBuilder.runners(RunnerBuilder.java:101)
12-Sep-2019 06:11:00         at org.junit.runners.model.RunnerBuilder.runners(RunnerBuilder.java:87)
12-Sep-2019 06:11:00         at org.junit.runners.Suite.<init>(Suite.java:102)
12-Sep-2019 06:11:00         at org.junit.runners.Suite.<init>(Suite.java:70)
12-Sep-2019 06:11:00         at sun.reflect.NativeConstructorAccessorImpl.newInstance0(Native Method)
12-Sep-2019 06:11:00         at sun.reflect.NativeConstructorAccessorImpl.newInstance(NativeConstructorAccessorImpl.java:62)
12-Sep-2019 06:11:00         at sun.reflect.DelegatingConstructorAccessorImpl.newInstance(DelegatingConstructorAccessorImpl.java:45)
12-Sep-2019 06:11:00         at java.lang.reflect.Constructor.newInstance(Constructor.java:423)
12-Sep-2019 06:11:00         at org.junit.internal.builders.AnnotatedBuilder.buildRunner(AnnotatedBuilder.java:107)
12-Sep-2019 06:11:00         at org.junit.internal.builders.AnnotatedBuilder.runnerForClass(AnnotatedBuilder.java:86)
12-Sep-2019 06:11:00         at org.junit.runners.model.RunnerBuilder.safeRunnerForClass(RunnerBuilder.java:59)
12-Sep-2019 06:11:00         at org.junit.internal.builders.AllDefaultPossibilitiesBuilder.runnerForClass(AllDefaultPossibilitiesBuilder.java:26)
12-Sep-2019 06:11:00         at org.junit.runners.model.RunnerBuilder.safeRunnerForClass(RunnerBuilder.java:59)
12-Sep-2019 06:11:00         at org.junit.internal.requests.ClassRequest.getRunner(ClassRequest.java:33)
12-Sep-2019 06:11:00         at org.apache.maven.surefire.junit4.JUnit4Provider.execute(JUnit4Provider.java:283)
12-Sep-2019 06:11:00         at org.apache.maven.surefire.junit4.JUnit4Provider.executeWithRerun(JUnit4Provider.java:173)
12-Sep-2019 06:11:00         at org.apache.maven.surefire.junit4.JUnit4Provider.executeTestSet(JUnit4Provider.java:153)
12-Sep-2019 06:11:00         at org.apache.maven.surefire.junit4.JUnit4Provider.invoke(JUnit4Provider.java:128)
12-Sep-2019 06:11:00         at org.apache.maven.surefire.booter.ForkedBooter.invokeProviderInSameClassLoader(ForkedBooter.java:203)
12-Sep-2019 06:11:00         at org.apache.maven.surefire.booter.ForkedBooter.runSuitesInProcess(ForkedBooter.java:155)
12-Sep-2019 06:11:00         at org.apache.maven.surefire.booter.ForkedBooter.main(ForkedBooter.java:103)
12-Sep-2019 06:11:00
12-Sep-2019 06:11:00 initializationError(io.cdap.cdap.app.serviceworker.ServiceWorkerTest)  Time elapsed: 0.001 sec  <<< ERROR!
12-Sep-2019 06:11:00 java.lang.SecurityException: Invalid signature file digest for Manifest main attributes
12-Sep-2019 06:11:00         at sun.security.util.SignatureFileVerifier.processImpl(SignatureFileVerifier.java:284)
12-Sep-2019 06:11:00         at sun.security.util.SignatureFileVerifier.process(SignatureFileVerifier.java:238)
12-Sep-2019 06:11:00         at java.util.jar.JarVerifier.processEntry(JarVerifier.java:316)
12-Sep-2019 06:11:00         at java.util.jar.JarVerifier.update(JarVerifier.java:228)
12-Sep-2019 06:11:00         at java.util.jar.JarFile.initializeVerifier(JarFile.java:383)
12-Sep-2019 06:11:00         at java.util.jar.JarFile.getInputStream(JarFile.java:450)
12-Sep-2019 06:11:00         at sun.misc.URLClassPath$JarLoader$2.getInputStream(URLClassPath.java:940)
12-Sep-2019 06:11:00         at sun.misc.Resource.cachedInputStream(Resource.java:77)
12-Sep-2019 06:11:00         at sun.misc.Resource.getByteBuffer(Resource.java:160)
12-Sep-2019 06:11:00         at java.net.URLClassLoader.defineClass(URLClassLoader.java:454)
12-Sep-2019 06:11:00         at java.net.URLClassLoader.access$100(URLClassLoader.java:73)
12-Sep-2019 06:11:00         at java.net.URLClassLoader$1.run(URLClassLoader.java:368)
12-Sep-2019 06:11:00         at java.net.URLClassLoader$1.run(URLClassLoader.java:362)
12-Sep-2019 06:11:00         at java.security.AccessController.doPrivileged(Native Method)
12-Sep-2019 06:11:00         at java.net.URLClassLoader.findClass(URLClassLoader.java:361)
12-Sep-2019 06:11:00         at java.lang.ClassLoader.loadClass(ClassLoader.java:424)
12-Sep-2019 06:11:00         at sun.misc.Launcher$AppClassLoader.loadClass(Launcher.java:331)
12-Sep-2019 06:11:00         at java.lang.ClassLoader.loadClass(ClassLoader.java:357)
12-Sep-2019 06:11:00         at java.lang.Class.getDeclaredMethods0(Native Method)
12-Sep-2019 06:11:00         at java.lang.Class.privateGetDeclaredMethods(Class.java:2701)
12-Sep-2019 06:11:00         at java.lang.Class.privateGetMethodRecursive(Class.java:3048)
12-Sep-2019 06:11:00         at java.lang.Class.getMethod0(Class.java:3018)
12-Sep-2019 06:11:00         at java.lang.Class.getMethod(Class.java:1784)
12-Sep-2019 06:11:00         at org.junit.internal.builders.SuiteMethodBuilder.hasSuiteMethod(SuiteMethodBuilder.java:18)
12-Sep-2019 06:11:00         at org.junit.internal.builders.SuiteMethodBuilder.runnerForClass(SuiteMethodBuilder.java:10)
12-Sep-2019 06:11:00         at org.junit.runners.model.RunnerBuilder.safeRunnerForClass(RunnerBuilder.java:59)
12-Sep-2019 06:11:00         at org.junit.internal.builders.AllDefaultPossibilitiesBuilder.runnerForClass(AllDefaultPossibilitiesBuilder.java:26)
12-Sep-2019 06:11:00         at org.junit.runners.model.RunnerBuilder.safeRunnerForClass(RunnerBuilder.java:59)
12-Sep-2019 06:11:00         at org.junit.runners.model.RunnerBuilder.runners(RunnerBuilder.java:101)
12-Sep-2019 06:11:00         at org.junit.runners.model.RunnerBuilder.runners(RunnerBuilder.java:87)
12-Sep-2019 06:11:00         at org.junit.runners.Suite.<init>(Suite.java:102)
12-Sep-2019 06:11:00         at org.junit.runners.Suite.<init>(Suite.java:70)
12-Sep-2019 06:11:00         at sun.reflect.NativeConstructorAccessorImpl.newInstance0(Native Method)
12-Sep-2019 06:11:00         at sun.reflect.NativeConstructorAccessorImpl.newInstance(NativeConstructorAccessorImpl.java:62)
12-Sep-2019 06:11:00         at sun.reflect.DelegatingConstructorAccessorImpl.newInstance(DelegatingConstructorAccessorImpl.java:45)
12-Sep-2019 06:11:00         at java.lang.reflect.Constructor.newInstance(Constructor.java:423)
12-Sep-2019 06:11:00         at org.junit.internal.builders.AnnotatedBuilder.buildRunner(AnnotatedBuilder.java:107)
12-Sep-2019 06:11:00         at org.junit.internal.builders.AnnotatedBuilder.runnerForClass(AnnotatedBuilder.java:86)
12-Sep-2019 06:11:00         at org.junit.runners.model.RunnerBuilder.safeRunnerForClass(RunnerBuilder.java:59)
12-Sep-2019 06:11:00         at org.junit.internal.builders.AllDefaultPossibilitiesBuilder.runnerForClass(AllDefaultPossibilitiesBuilder.java:26)
12-Sep-2019 06:11:00         at org.junit.runners.model.RunnerBuilder.safeRunnerForClass(RunnerBuilder.java:59)
12-Sep-2019 06:11:00         at org.junit.internal.requests.ClassRequest.getRunner(ClassRequest.java:33)
12-Sep-2019 06:11:00         at org.apache.maven.surefire.junit4.JUnit4Provider.execute(JUnit4Provider.java:283)
12-Sep-2019 06:11:00         at org.apache.maven.surefire.junit4.JUnit4Provider.executeWithRerun(JUnit4Provider.java:173)
12-Sep-2019 06:11:00         at org.apache.maven.surefire.junit4.JUnit4Provider.executeTestSet(JUnit4Provider.java:153)
12-Sep-2019 06:11:00         at org.apache.maven.surefire.junit4.JUnit4Provider.invoke(JUnit4Provider.java:128)
12-Sep-2019 06:11:00         at org.apache.maven.surefire.booter.ForkedBooter.invokeProviderInSameClassLoader(ForkedBooter.java:203)
12-Sep-2019 06:11:00         at org.apache.maven.surefire.booter.ForkedBooter.runSuitesInProcess(ForkedBooter.java:155)
12-Sep-2019 06:11:00         at org.apache.maven.surefire.booter.ForkedBooter.main(ForkedBooter.java:103)
12-Sep-2019 06:11:00
12-Sep-2019 06:11:00 initializationError(io.cdap.cdap.app.etl.TPFSAvroSinkSourceTest)  Time elapsed: 0.001 sec  <<< ERROR!
12-Sep-2019 06:11:00 java.lang.SecurityException: Invalid signature file digest for Manifest main attributes
12-Sep-2019 06:11:00         at sun.security.util.SignatureFileVerifier.processImpl(SignatureFileVerifier.java:284)
12-Sep-2019 06:11:00         at sun.security.util.SignatureFileVerifier.process(SignatureFileVerifier.java:238)
12-Sep-2019 06:11:00         at java.util.jar.JarVerifier.processEntry(JarVerifier.java:316)
12-Sep-2019 06:11:00         at java.util.jar.JarVerifier.update(JarVerifier.java:228)
12-Sep-2019 06:11:00         at java.util.jar.JarFile.initializeVerifier(JarFile.java:383)
12-Sep-2019 06:11:00         at java.util.jar.JarFile.getInputStream(JarFile.java:450)
12-Sep-2019 06:11:00         at sun.misc.URLClassPath$JarLoader$2.getInputStream(URLClassPath.java:940)
12-Sep-2019 06:11:00         at sun.misc.Resource.cachedInputStream(Resource.java:77)
12-Sep-2019 06:11:00         at sun.misc.Resource.getByteBuffer(Resource.java:160)
12-Sep-2019 06:11:00         at java.net.URLClassLoader.defineClass(URLClassLoader.java:454)
12-Sep-2019 06:11:00         at java.net.URLClassLoader.access$100(URLClassLoader.java:73)
12-Sep-2019 06:11:00         at java.net.URLClassLoader$1.run(URLClassLoader.java:368)
12-Sep-2019 06:11:00         at java.net.URLClassLoader$1.run(URLClassLoader.java:362)
12-Sep-2019 06:11:00         at java.security.AccessController.doPrivileged(Native Method)
12-Sep-2019 06:11:00         at java.net.URLClassLoader.findClass(URLClassLoader.java:361)
12-Sep-2019 06:11:00         at java.lang.ClassLoader.loadClass(ClassLoader.java:424)
12-Sep-2019 06:11:00         at sun.misc.Launcher$AppClassLoader.loadClass(Launcher.java:331)
12-Sep-2019 06:11:00         at java.lang.ClassLoader.loadClass(ClassLoader.java:357)
12-Sep-2019 06:11:00         at java.lang.Class.getDeclaredMethods0(Native Method)
12-Sep-2019 06:11:00         at java.lang.Class.privateGetDeclaredMethods(Class.java:2701)
12-Sep-2019 06:11:00         at java.lang.Class.privateGetMethodRecursive(Class.java:3048)
12-Sep-2019 06:11:00         at java.lang.Class.getMethod0(Class.java:3018)
12-Sep-2019 06:11:00         at java.lang.Class.getMethod(Class.java:1784)
12-Sep-2019 06:11:00         at org.junit.internal.builders.SuiteMethodBuilder.hasSuiteMethod(SuiteMethodBuilder.java:18)
12-Sep-2019 06:11:00         at org.junit.internal.builders.SuiteMethodBuilder.runnerForClass(SuiteMethodBuilder.java:10)
12-Sep-2019 06:11:00         at org.junit.runners.model.RunnerBuilder.safeRunnerForClass(RunnerBuilder.java:59)
12-Sep-2019 06:11:00         at org.junit.internal.builders.AllDefaultPossibilitiesBuilder.runnerForClass(AllDefaultPossibilitiesBuilder.java:26)
12-Sep-2019 06:11:00         at org.junit.runners.model.RunnerBuilder.safeRunnerForClass(RunnerBuilder.java:59)
12-Sep-2019 06:11:00         at org.junit.runners.model.RunnerBuilder.runners(RunnerBuilder.java:101)
12-Sep-2019 06:11:00         at org.junit.runners.model.RunnerBuilder.runners(RunnerBuilder.java:87)
12-Sep-2019 06:11:00         at org.junit.runners.Suite.<init>(Suite.java:102)
12-Sep-2019 06:11:00         at org.junit.runners.Suite.<init>(Suite.java:70)
12-Sep-2019 06:11:00         at sun.reflect.NativeConstructorAccessorImpl.newInstance0(Native Method)
12-Sep-2019 06:11:00         at sun.reflect.NativeConstructorAccessorImpl.newInstance(NativeConstructorAccessorImpl.java:62)
12-Sep-2019 06:11:00         at sun.reflect.DelegatingConstructorAccessorImpl.newInstance(DelegatingConstructorAccessorImpl.java:45)
12-Sep-2019 06:11:00         at java.lang.reflect.Constructor.newInstance(Constructor.java:423)
12-Sep-2019 06:11:00         at org.junit.internal.builders.AnnotatedBuilder.buildRunner(AnnotatedBuilder.java:107)
12-Sep-2019 06:11:00         at org.junit.internal.builders.AnnotatedBuilder.runnerForClass(AnnotatedBuilder.java:86)
12-Sep-2019 06:11:00         at org.junit.runners.model.RunnerBuilder.safeRunnerForClass(RunnerBuilder.java:59)
12-Sep-2019 06:11:00         at org.junit.internal.builders.AllDefaultPossibilitiesBuilder.runnerForClass(AllDefaultPossibilitiesBuilder.java:26)
12-Sep-2019 06:11:00         at org.junit.runners.model.RunnerBuilder.safeRunnerForClass(RunnerBuilder.java:59)
12-Sep-2019 06:11:00         at org.junit.internal.requests.ClassRequest.getRunner(ClassRequest.java:33)
12-Sep-2019 06:11:00         at org.apache.maven.surefire.junit4.JUnit4Provider.execute(JUnit4Provider.java:283)
12-Sep-2019 06:11:00         at org.apache.maven.surefire.junit4.JUnit4Provider.executeWithRerun(JUnit4Provider.java:173)
12-Sep-2019 06:11:00         at org.apache.maven.surefire.junit4.JUnit4Provider.executeTestSet(JUnit4Provider.java:153)
12-Sep-2019 06:11:00         at org.apache.maven.surefire.junit4.JUnit4Provider.invoke(JUnit4Provider.java:128)
12-Sep-2019 06:11:00         at org.apache.maven.surefire.booter.ForkedBooter.invokeProviderInSameClassLoader(ForkedBooter.java:203)
12-Sep-2019 06:11:00         at org.apache.maven.surefire.booter.ForkedBooter.runSuitesInProcess(ForkedBooter.java:155)
12-Sep-2019 06:11:00         at org.apache.maven.surefire.booter.ForkedBooter.main(ForkedBooter.java:103)
12-Sep-2019 06:11:00
12-Sep-2019 06:11:00 initializationError(io.cdap.cdap.app.etl.batch.TPFSParquetSinkSourceTest)  Time elapsed: 0.001 sec  <<< ERROR!
12-Sep-2019 06:11:00 java.lang.SecurityException: Invalid signature file digest for Manifest main attributes
12-Sep-2019 06:11:00         at sun.security.util.SignatureFileVerifier.processImpl(SignatureFileVerifier.java:284)
12-Sep-2019 06:11:00         at sun.security.util.SignatureFileVerifier.process(SignatureFileVerifier.java:238)
12-Sep-2019 06:11:00         at java.util.jar.JarVerifier.processEntry(JarVerifier.java:316)
12-Sep-2019 06:11:00         at java.util.jar.JarVerifier.update(JarVerifier.java:228)
12-Sep-2019 06:11:00         at java.util.jar.JarFile.initializeVerifier(JarFile.java:383)
12-Sep-2019 06:11:00         at java.util.jar.JarFile.getInputStream(JarFile.java:450)
12-Sep-2019 06:11:00         at sun.misc.URLClassPath$JarLoader$2.getInputStream(URLClassPath.java:940)
12-Sep-2019 06:11:00         at sun.misc.Resource.cachedInputStream(Resource.java:77)
12-Sep-2019 06:11:00         at sun.misc.Resource.getByteBuffer(Resource.java:160)
12-Sep-2019 06:11:00         at java.net.URLClassLoader.defineClass(URLClassLoader.java:454)
12-Sep-2019 06:11:00         at java.net.URLClassLoader.access$100(URLClassLoader.java:73)
12-Sep-2019 06:11:00         at java.net.URLClassLoader$1.run(URLClassLoader.java:368)
12-Sep-2019 06:11:00         at java.net.URLClassLoader$1.run(URLClassLoader.java:362)
12-Sep-2019 06:11:00         at java.security.AccessController.doPrivileged(Native Method)
12-Sep-2019 06:11:00         at java.net.URLClassLoader.findClass(URLClassLoader.java:361)
12-Sep-2019 06:11:00         at java.lang.ClassLoader.loadClass(ClassLoader.java:424)
12-Sep-2019 06:11:00         at sun.misc.Launcher$AppClassLoader.loadClass(Launcher.java:331)
12-Sep-2019 06:11:00         at java.lang.ClassLoader.loadClass(ClassLoader.java:357)
12-Sep-2019 06:11:00         at java.lang.Class.getDeclaredMethods0(Native Method)
12-Sep-2019 06:11:00         at java.lang.Class.privateGetDeclaredMethods(Class.java:2701)
12-Sep-2019 06:11:00         at java.lang.Class.privateGetMethodRecursive(Class.java:3048)
12-Sep-2019 06:11:00         at java.lang.Class.getMethod0(Class.java:3018)
12-Sep-2019 06:11:00         at java.lang.Class.getMethod(Class.java:1784)
12-Sep-2019 06:11:00         at org.junit.internal.builders.SuiteMethodBuilder.hasSuiteMethod(SuiteMethodBuilder.java:18)
12-Sep-2019 06:11:00         at org.junit.internal.builders.SuiteMethodBuilder.runnerForClass(SuiteMethodBuilder.java:10)
12-Sep-2019 06:11:00         at org.junit.runners.model.RunnerBuilder.safeRunnerForClass(RunnerBuilder.java:59)
12-Sep-2019 06:11:00         at org.junit.internal.builders.AllDefaultPossibilitiesBuilder.runnerForClass(AllDefaultPossibilitiesBuilder.java:26)
12-Sep-2019 06:11:00         at org.junit.runners.model.RunnerBuilder.safeRunnerForClass(RunnerBuilder.java:59)
12-Sep-2019 06:11:00         at org.junit.runners.model.RunnerBuilder.runners(RunnerBuilder.java:101)
12-Sep-2019 06:11:00         at org.junit.runners.model.RunnerBuilder.runners(RunnerBuilder.java:87)
12-Sep-2019 06:11:00         at org.junit.runners.Suite.<init>(Suite.java:102)
12-Sep-2019 06:11:00         at org.junit.runners.Suite.<init>(Suite.java:70)
12-Sep-2019 06:11:00         at sun.reflect.NativeConstructorAccessorImpl.newInstance0(Native Method)
12-Sep-2019 06:11:00         at sun.reflect.NativeConstructorAccessorImpl.newInstance(NativeConstructorAccessorImpl.java:62)
12-Sep-2019 06:11:00         at sun.reflect.DelegatingConstructorAccessorImpl.newInstance(DelegatingConstructorAccessorImpl.java:45)
12-Sep-2019 06:11:00         at java.lang.reflect.Constructor.newInstance(Constructor.java:423)
12-Sep-2019 06:11:00         at org.junit.internal.builders.AnnotatedBuilder.buildRunner(AnnotatedBuilder.java:107)
12-Sep-2019 06:11:00         at org.junit.internal.builders.AnnotatedBuilder.runnerForClass(AnnotatedBuilder.java:86)
12-Sep-2019 06:11:00         at org.junit.runners.model.RunnerBuilder.safeRunnerForClass(RunnerBuilder.java:59)
12-Sep-2019 06:11:00         at org.junit.internal.builders.AllDefaultPossibilitiesBuilder.runnerForClass(AllDefaultPossibilitiesBuilder.java:26)
12-Sep-2019 06:11:00         at org.junit.runners.model.RunnerBuilder.safeRunnerForClass(RunnerBuilder.java:59)
12-Sep-2019 06:11:00         at org.junit.internal.requests.ClassRequest.getRunner(ClassRequest.java:33)
12-Sep-2019 06:11:00         at org.apache.maven.surefire.junit4.JUnit4Provider.execute(JUnit4Provider.java:283)
12-Sep-2019 06:11:00         at org.apache.maven.surefire.junit4.JUnit4Provider.executeWithRerun(JUnit4Provider.java:173)
12-Sep-2019 06:11:00         at org.apache.maven.surefire.junit4.JUnit4Provider.executeTestSet(JUnit4Provider.java:153)
12-Sep-2019 06:11:00         at org.apache.maven.surefire.junit4.JUnit4Provider.invoke(JUnit4Provider.java:128)
12-Sep-2019 06:11:00         at org.apache.maven.surefire.booter.ForkedBooter.invokeProviderInSameClassLoader(ForkedBooter.java:203)
12-Sep-2019 06:11:00         at org.apache.maven.surefire.booter.ForkedBooter.runSuitesInProcess(ForkedBooter.java:155)
12-Sep-2019 06:11:00         at org.apache.maven.surefire.booter.ForkedBooter.main(ForkedBooter.java:103)
12-Sep-2019 06:11:00
12-Sep-2019 06:11:00 initializationError(io.cdap.cdap.app.etl.batch.ValueMapperTest)  Time elapsed: 0.002 sec  <<< ERROR!
12-Sep-2019 06:11:00 java.lang.SecurityException: Invalid signature file digest for Manifest main attributes
12-Sep-2019 06:11:00         at sun.security.util.SignatureFileVerifier.processImpl(SignatureFileVerifier.java:284)
12-Sep-2019 06:11:00         at sun.security.util.SignatureFileVerifier.process(SignatureFileVerifier.java:238)
12-Sep-2019 06:11:00         at java.util.jar.JarVerifier.processEntry(JarVerifier.java:316)
12-Sep-2019 06:11:00         at java.util.jar.JarVerifier.update(JarVerifier.java:228)
12-Sep-2019 06:11:00         at java.util.jar.JarFile.initializeVerifier(JarFile.java:383)
12-Sep-2019 06:11:00         at java.util.jar.JarFile.getInputStream(JarFile.java:450)
12-Sep-2019 06:11:00         at sun.misc.URLClassPath$JarLoader$2.getInputStream(URLClassPath.java:940)
12-Sep-2019 06:11:00         at sun.misc.Resource.cachedInputStream(Resource.java:77)
12-Sep-2019 06:11:00         at sun.misc.Resource.getByteBuffer(Resource.java:160)
12-Sep-2019 06:11:00         at java.net.URLClassLoader.defineClass(URLClassLoader.java:454)
12-Sep-2019 06:11:00         at java.net.URLClassLoader.access$100(URLClassLoader.java:73)
12-Sep-2019 06:11:00         at java.net.URLClassLoader$1.run(URLClassLoader.java:368)
12-Sep-2019 06:11:00         at java.net.URLClassLoader$1.run(URLClassLoader.java:362)
12-Sep-2019 06:11:00         at java.security.AccessController.doPrivileged(Native Method)
12-Sep-2019 06:11:00         at java.net.URLClassLoader.findClass(URLClassLoader.java:361)
12-Sep-2019 06:11:00         at java.lang.ClassLoader.loadClass(ClassLoader.java:424)
12-Sep-2019 06:11:00         at sun.misc.Launcher$AppClassLoader.loadClass(Launcher.java:331)
12-Sep-2019 06:11:00         at java.lang.ClassLoader.loadClass(ClassLoader.java:357)
12-Sep-2019 06:11:00         at java.lang.Class.getDeclaredMethods0(Native Method)
12-Sep-2019 06:11:00         at java.lang.Class.privateGetDeclaredMethods(Class.java:2701)
12-Sep-2019 06:11:00         at java.lang.Class.privateGetMethodRecursive(Class.java:3048)
12-Sep-2019 06:11:00         at java.lang.Class.getMethod0(Class.java:3018)
12-Sep-2019 06:11:00         at java.lang.Class.getMethod(Class.java:1784)
12-Sep-2019 06:11:00         at org.junit.internal.builders.SuiteMethodBuilder.hasSuiteMethod(SuiteMethodBuilder.java:18)
12-Sep-2019 06:11:00         at org.junit.internal.builders.SuiteMethodBuilder.runnerForClass(SuiteMethodBuilder.java:10)
12-Sep-2019 06:11:00         at org.junit.runners.model.RunnerBuilder.safeRunnerForClass(RunnerBuilder.java:59)
12-Sep-2019 06:11:00         at org.junit.internal.builders.AllDefaultPossibilitiesBuilder.runnerForClass(AllDefaultPossibilitiesBuilder.java:26)
12-Sep-2019 06:11:00         at org.junit.runners.model.RunnerBuilder.safeRunnerForClass(RunnerBuilder.java:59)
12-Sep-2019 06:11:00         at org.junit.runners.model.RunnerBuilder.runners(RunnerBuilder.java:101)
12-Sep-2019 06:11:00         at org.junit.runners.model.RunnerBuilder.runners(RunnerBuilder.java:87)
12-Sep-2019 06:11:00         at org.junit.runners.Suite.<init>(Suite.java:102)
12-Sep-2019 06:11:00         at org.junit.runners.Suite.<init>(Suite.java:70)
12-Sep-2019 06:11:00         at sun.reflect.NativeConstructorAccessorImpl.newInstance0(Native Method)
12-Sep-2019 06:11:00         at sun.reflect.NativeConstructorAccessorImpl.newInstance(NativeConstructorAccessorImpl.java:62)
12-Sep-2019 06:11:00         at sun.reflect.DelegatingConstructorAccessorImpl.newInstance(DelegatingConstructorAccessorImpl.java:45)
12-Sep-2019 06:11:00         at java.lang.reflect.Constructor.newInstance(Constructor.java:423)
12-Sep-2019 06:11:00         at org.junit.internal.builders.AnnotatedBuilder.buildRunner(AnnotatedBuilder.java:107)
12-Sep-2019 06:11:00         at org.junit.internal.builders.AnnotatedBuilder.runnerForClass(AnnotatedBuilder.java:86)
12-Sep-2019 06:11:00         at org.junit.runners.model.RunnerBuilder.safeRunnerForClass(RunnerBuilder.java:59)
12-Sep-2019 06:11:00         at org.junit.internal.builders.AllDefaultPossibilitiesBuilder.runnerForClass(AllDefaultPossibilitiesBuilder.java:26)
12-Sep-2019 06:11:00         at org.junit.runners.model.RunnerBuilder.safeRunnerForClass(RunnerBuilder.java:59)
12-Sep-2019 06:11:00         at org.junit.internal.requests.ClassRequest.getRunner(ClassRequest.java:33)
12-Sep-2019 06:11:00         at org.apache.maven.surefire.junit4.JUnit4Provider.execute(JUnit4Provider.java:283)
12-Sep-2019 06:11:00         at org.apache.maven.surefire.junit4.JUnit4Provider.executeWithRerun(JUnit4Provider.java:173)
12-Sep-2019 06:11:00         at org.apache.maven.surefire.junit4.JUnit4Provider.executeTestSet(JUnit4Provider.java:153)
12-Sep-2019 06:11:00         at org.apache.maven.surefire.junit4.JUnit4Provider.invoke(JUnit4Provider.java:128)
12-Sep-2019 06:11:00         at org.apache.maven.surefire.booter.ForkedBooter.invokeProviderInSameClassLoader(ForkedBooter.java:203)
12-Sep-2019 06:11:00         at org.apache.maven.surefire.booter.ForkedBooter.runSuitesInProcess(ForkedBooter.java:155)
12-Sep-2019 06:11:00         at org.apache.maven.surefire.booter.ForkedBooter.main(ForkedBooter.java:103)
12-Sep-2019 06:11:00
12-Sep-2019 06:11:00 initializationError(io.cdap.cdap.apps.workflow.WorkflowTest)  Time elapsed: 0 sec  <<< ERROR!
12-Sep-2019 06:11:00 java.lang.SecurityException: Invalid signature file digest for Manifest main attributes
12-Sep-2019 06:11:00         at sun.security.util.SignatureFileVerifier.processImpl(SignatureFileVerifier.java:284)
12-Sep-2019 06:11:00         at sun.security.util.SignatureFileVerifier.process(SignatureFileVerifier.java:238)
12-Sep-2019 06:11:00         at java.util.jar.JarVerifier.processEntry(JarVerifier.java:316)
12-Sep-2019 06:11:00         at java.util.jar.JarVerifier.update(JarVerifier.java:228)
12-Sep-2019 06:11:00         at java.util.jar.JarFile.initializeVerifier(JarFile.java:383)
12-Sep-2019 06:11:00         at java.util.jar.JarFile.getInputStream(JarFile.java:450)
12-Sep-2019 06:11:00         at sun.misc.URLClassPath$JarLoader$2.getInputStream(URLClassPath.java:940)
12-Sep-2019 06:11:00         at sun.misc.Resource.cachedInputStream(Resource.java:77)
12-Sep-2019 06:11:00         at sun.misc.Resource.getByteBuffer(Resource.java:160)
12-Sep-2019 06:11:00         at java.net.URLClassLoader.defineClass(URLClassLoader.java:454)
12-Sep-2019 06:11:00         at java.net.URLClassLoader.access$100(URLClassLoader.java:73)
12-Sep-2019 06:11:00         at java.net.URLClassLoader$1.run(URLClassLoader.java:368)
12-Sep-2019 06:11:00         at java.net.URLClassLoader$1.run(URLClassLoader.java:362)
12-Sep-2019 06:11:00         at java.security.AccessController.doPrivileged(Native Method)
12-Sep-2019 06:11:00         at java.net.URLClassLoader.findClass(URLClassLoader.java:361)
12-Sep-2019 06:11:00         at java.lang.ClassLoader.loadClass(ClassLoader.java:424)
12-Sep-2019 06:11:00         at sun.misc.Launcher$AppClassLoader.loadClass(Launcher.java:331)
12-Sep-2019 06:11:00         at java.lang.ClassLoader.loadClass(ClassLoader.java:357)
12-Sep-2019 06:11:00         at java.lang.Class.getDeclaredMethods0(Native Method)
12-Sep-2019 06:11:00         at java.lang.Class.privateGetDeclaredMethods(Class.java:2701)
12-Sep-2019 06:11:00         at java.lang.Class.privateGetMethodRecursive(Class.java:3048)
12-Sep-2019 06:11:00         at java.lang.Class.getMethod0(Class.java:3018)
12-Sep-2019 06:11:00         at java.lang.Class.getMethod(Class.java:1784)
12-Sep-2019 06:11:00         at org.junit.internal.builders.SuiteMethodBuilder.hasSuiteMethod(SuiteMethodBuilder.java:18)
12-Sep-2019 06:11:00         at org.junit.internal.builders.SuiteMethodBuilder.runnerForClass(SuiteMethodBuilder.java:10)
12-Sep-2019 06:11:00         at org.junit.runners.model.RunnerBuilder.safeRunnerForClass(RunnerBuilder.java:59)
12-Sep-2019 06:11:00         at org.junit.internal.builders.AllDefaultPossibilitiesBuilder.runnerForClass(AllDefaultPossibilitiesBuilder.java:26)
12-Sep-2019 06:11:00         at org.junit.runners.model.RunnerBuilder.safeRunnerForClass(RunnerBuilder.java:59)
12-Sep-2019 06:11:00         at org.junit.runners.model.RunnerBuilder.runners(RunnerBuilder.java:101)
12-Sep-2019 06:11:00         at org.junit.runners.model.RunnerBuilder.runners(RunnerBuilder.java:87)
12-Sep-2019 06:11:00         at org.junit.runners.Suite.<init>(Suite.java:102)
12-Sep-2019 06:11:00         at org.junit.runners.Suite.<init>(Suite.java:70)
12-Sep-2019 06:11:00         at sun.reflect.NativeConstructorAccessorImpl.newInstance0(Native Method)
12-Sep-2019 06:11:00         at sun.reflect.NativeConstructorAccessorImpl.newInstance(NativeConstructorAccessorImpl.java:62)
12-Sep-2019 06:11:00         at sun.reflect.DelegatingConstructorAccessorImpl.newInstance(DelegatingConstructorAccessorImpl.java:45)
12-Sep-2019 06:11:00         at java.lang.reflect.Constructor.newInstance(Constructor.java:423)
12-Sep-2019 06:11:00         at org.junit.internal.builders.AnnotatedBuilder.buildRunner(AnnotatedBuilder.java:107)
12-Sep-2019 06:11:00         at org.junit.internal.builders.AnnotatedBuilder.runnerForClass(AnnotatedBuilder.java:86)
12-Sep-2019 06:11:00         at org.junit.runners.model.RunnerBuilder.safeRunnerForClass(RunnerBuilder.java:59)
12-Sep-2019 06:11:00         at org.junit.internal.builders.AllDefaultPossibilitiesBuilder.runnerForClass(AllDefaultPossibilitiesBuilder.java:26)
12-Sep-2019 06:11:00         at org.junit.runners.model.RunnerBuilder.safeRunnerForClass(RunnerBuilder.java:59)
12-Sep-2019 06:11:00         at org.junit.internal.requests.ClassRequest.getRunner(ClassRequest.java:33)
12-Sep-2019 06:11:00         at org.apache.maven.surefire.junit4.JUnit4Provider.execute(JUnit4Provider.java:283)
12-Sep-2019 06:11:00         at org.apache.maven.surefire.junit4.JUnit4Provider.executeWithRerun(JUnit4Provider.java:173)
12-Sep-2019 06:11:00         at org.apache.maven.surefire.junit4.JUnit4Provider.executeTestSet(JUnit4Provider.java:153)
12-Sep-2019 06:11:00         at org.apache.maven.surefire.junit4.JUnit4Provider.invoke(JUnit4Provider.java:128)
12-Sep-2019 06:11:00         at org.apache.maven.surefire.booter.ForkedBooter.invokeProviderInSameClassLoader(ForkedBooter.java:203)
12-Sep-2019 06:11:00         at org.apache.maven.surefire.booter.ForkedBooter.runSuitesInProcess(ForkedBooter.java:155)
12-Sep-2019 06:11:00         at org.apache.maven.surefire.booter.ForkedBooter.main(ForkedBooter.java:103)
12-Sep-2019 06:11:00
12-Sep-2019 06:11:00 initializationError(io.cdap.cdap.app.etl.wrangler.WranglerServiceTest)  Time elapsed: 0.001 sec  <<< ERROR!
12-Sep-2019 06:11:00 java.lang.SecurityException: Invalid signature file digest for Manifest main attributes
12-Sep-2019 06:11:00         at sun.security.util.SignatureFileVerifier.processImpl(SignatureFileVerifier.java:284)
12-Sep-2019 06:11:00         at sun.security.util.SignatureFileVerifier.process(SignatureFileVerifier.java:238)
12-Sep-2019 06:11:00         at java.util.jar.JarVerifier.processEntry(JarVerifier.java:316)
12-Sep-2019 06:11:00         at java.util.jar.JarVerifier.update(JarVerifier.java:228)
12-Sep-2019 06:11:00         at java.util.jar.JarFile.initializeVerifier(JarFile.java:383)
12-Sep-2019 06:11:00         at java.util.jar.JarFile.getInputStream(JarFile.java:450)
12-Sep-2019 06:11:00         at sun.misc.URLClassPath$JarLoader$2.getInputStream(URLClassPath.java:940)
12-Sep-2019 06:11:00         at sun.misc.Resource.cachedInputStream(Resource.java:77)
12-Sep-2019 06:11:00         at sun.misc.Resource.getByteBuffer(Resource.java:160)
12-Sep-2019 06:11:00         at java.net.URLClassLoader.defineClass(URLClassLoader.java:454)
12-Sep-2019 06:11:00         at java.net.URLClassLoader.access$100(URLClassLoader.java:73)
12-Sep-2019 06:11:00         at java.net.URLClassLoader$1.run(URLClassLoader.java:368)
12-Sep-2019 06:11:00         at java.net.URLClassLoader$1.run(URLClassLoader.java:362)
12-Sep-2019 06:11:00         at java.security.AccessController.doPrivileged(Native Method)
12-Sep-2019 06:11:00         at java.net.URLClassLoader.findClass(URLClassLoader.java:361)
12-Sep-2019 06:11:00         at java.lang.ClassLoader.loadClass(ClassLoader.java:424)
12-Sep-2019 06:11:00         at sun.misc.Launcher$AppClassLoader.loadClass(Launcher.java:331)
12-Sep-2019 06:11:00         at java.lang.ClassLoader.loadClass(ClassLoader.java:357)
12-Sep-2019 06:11:00         at java.lang.Class.getDeclaredMethods0(Native Method)
12-Sep-2019 06:11:00         at java.lang.Class.privateGetDeclaredMethods(Class.java:2701)
12-Sep-2019 06:11:00         at java.lang.Class.privateGetMethodRecursive(Class.java:3048)
12-Sep-2019 06:11:00         at java.lang.Class.getMethod0(Class.java:3018)
12-Sep-2019 06:11:00         at java.lang.Class.getMethod(Class.java:1784)
12-Sep-2019 06:11:00         at org.junit.internal.builders.SuiteMethodBuilder.hasSuiteMethod(SuiteMethodBuilder.java:18)
12-Sep-2019 06:11:00         at org.junit.internal.builders.SuiteMethodBuilder.runnerForClass(SuiteMethodBuilder.java:10)
12-Sep-2019 06:11:00         at org.junit.runners.model.RunnerBuilder.safeRunnerForClass(RunnerBuilder.java:59)
12-Sep-2019 06:11:00         at org.junit.internal.builders.AllDefaultPossibilitiesBuilder.runnerForClass(AllDefaultPossibilitiesBuilder.java:26)
12-Sep-2019 06:11:00         at org.junit.runners.model.RunnerBuilder.safeRunnerForClass(RunnerBuilder.java:59)
12-Sep-2019 06:11:00         at org.junit.runners.model.RunnerBuilder.runners(RunnerBuilder.java:101)
12-Sep-2019 06:11:00         at org.junit.runners.model.RunnerBuilder.runners(RunnerBuilder.java:87)
12-Sep-2019 06:11:00         at org.junit.runners.Suite.<init>(Suite.java:102)
12-Sep-2019 06:11:00         at org.junit.runners.Suite.<init>(Suite.java:70)
12-Sep-2019 06:11:00         at sun.reflect.NativeConstructorAccessorImpl.newInstance0(Native Method)
12-Sep-2019 06:11:00         at sun.reflect.NativeConstructorAccessorImpl.newInstance(NativeConstructorAccessorImpl.java:62)
12-Sep-2019 06:11:00         at sun.reflect.DelegatingConstructorAccessorImpl.newInstance(DelegatingConstructorAccessorImpl.java:45)
12-Sep-2019 06:11:00         at java.lang.reflect.Constructor.newInstance(Constructor.java:423)
12-Sep-2019 06:11:00         at org.junit.internal.builders.AnnotatedBuilder.buildRunner(AnnotatedBuilder.java:107)
12-Sep-2019 06:11:00         at org.junit.internal.builders.AnnotatedBuilder.runnerForClass(AnnotatedBuilder.java:86)
12-Sep-2019 06:11:00         at org.junit.runners.model.RunnerBuilder.safeRunnerForClass(RunnerBuilder.java:59)
12-Sep-2019 06:11:00         at org.junit.internal.builders.AllDefaultPossibilitiesBuilder.runnerForClass(AllDefaultPossibilitiesBuilder.java:26)
12-Sep-2019 06:11:00         at org.junit.runners.model.RunnerBuilder.safeRunnerForClass(RunnerBuilder.java:59)
12-Sep-2019 06:11:00         at org.junit.internal.requests.ClassRequest.getRunner(ClassRequest.java:33)
12-Sep-2019 06:11:00         at org.apache.maven.surefire.junit4.JUnit4Provider.execute(JUnit4Provider.java:283)
12-Sep-2019 06:11:00         at org.apache.maven.surefire.junit4.JUnit4Provider.executeWithRerun(JUnit4Provider.java:173)
12-Sep-2019 06:11:00         at org.apache.maven.surefire.junit4.JUnit4Provider.executeTestSet(JUnit4Provider.java:153)
12-Sep-2019 06:11:00         at org.apache.maven.surefire.junit4.JUnit4Provider.invoke(JUnit4Provider.java:128)
12-Sep-2019 06:11:00         at org.apache.maven.surefire.booter.ForkedBooter.invokeProviderInSameClassLoader(ForkedBooter.java:203)
12-Sep-2019 06:11:00         at org.apache.maven.surefire.booter.ForkedBooter.runSuitesInProcess(ForkedBooter.java:155)
12-Sep-2019 06:11:00         at org.apache.maven.surefire.booter.ForkedBooter.main(ForkedBooter.java:103)
12-Sep-2019 06:11:00
12-Sep-2019 06:11:00 initializationError(io.cdap.cdap.app.etl.wrangler.WranglerTest)  Time elapsed: 0 sec  <<< ERROR!
12-Sep-2019 06:11:00 java.lang.SecurityException: Invalid signature file digest for Manifest main attributes
12-Sep-2019 06:11:00         at sun.security.util.SignatureFileVerifier.processImpl(SignatureFileVerifier.java:284)
12-Sep-2019 06:11:00         at sun.security.util.SignatureFileVerifier.process(SignatureFileVerifier.java:238)
12-Sep-2019 06:11:00         at java.util.jar.JarVerifier.processEntry(JarVerifier.java:316)
12-Sep-2019 06:11:00         at java.util.jar.JarVerifier.update(JarVerifier.java:228)
12-Sep-2019 06:11:00         at java.util.jar.JarFile.initializeVerifier(JarFile.java:383)
12-Sep-2019 06:11:00         at java.util.jar.JarFile.getInputStream(JarFile.java:450)
12-Sep-2019 06:11:00         at sun.misc.URLClassPath$JarLoader$2.getInputStream(URLClassPath.java:940)
12-Sep-2019 06:11:00         at sun.misc.Resource.cachedInputStream(Resource.java:77)
12-Sep-2019 06:11:00         at sun.misc.Resource.getByteBuffer(Resource.java:160)
12-Sep-2019 06:11:00         at java.net.URLClassLoader.defineClass(URLClassLoader.java:454)
12-Sep-2019 06:11:00         at java.net.URLClassLoader.access$100(URLClassLoader.java:73)
12-Sep-2019 06:11:00         at java.net.URLClassLoader$1.run(URLClassLoader.java:368)
12-Sep-2019 06:11:00         at java.net.URLClassLoader$1.run(URLClassLoader.java:362)
12-Sep-2019 06:11:00         at java.security.AccessController.doPrivileged(Native Method)
12-Sep-2019 06:11:00         at java.net.URLClassLoader.findClass(URLClassLoader.java:361)
12-Sep-2019 06:11:00         at java.lang.ClassLoader.loadClass(ClassLoader.java:424)
12-Sep-2019 06:11:00         at sun.misc.Launcher$AppClassLoader.loadClass(Launcher.java:331)
12-Sep-2019 06:11:00         at java.lang.ClassLoader.loadClass(ClassLoader.java:357)
12-Sep-2019 06:11:00         at java.lang.Class.getDeclaredMethods0(Native Method)
12-Sep-2019 06:11:00         at java.lang.Class.privateGetDeclaredMethods(Class.java:2701)
12-Sep-2019 06:11:00         at java.lang.Class.privateGetMethodRecursive(Class.java:3048)
12-Sep-2019 06:11:00         at java.lang.Class.getMethod0(Class.java:3018)
12-Sep-2019 06:11:00         at java.lang.Class.getMethod(Class.java:1784)
12-Sep-2019 06:11:00         at org.junit.internal.builders.SuiteMethodBuilder.hasSuiteMethod(SuiteMethodBuilder.java:18)
12-Sep-2019 06:11:00         at org.junit.internal.builders.SuiteMethodBuilder.runnerForClass(SuiteMethodBuilder.java:10)
12-Sep-2019 06:11:00         at org.junit.runners.model.RunnerBuilder.safeRunnerForClass(RunnerBuilder.java:59)
12-Sep-2019 06:11:00         at org.junit.internal.builders.AllDefaultPossibilitiesBuilder.runnerForClass(AllDefaultPossibilitiesBuilder.java:26)
12-Sep-2019 06:11:00         at org.junit.runners.model.RunnerBuilder.safeRunnerForClass(RunnerBuilder.java:59)
12-Sep-2019 06:11:00         at org.junit.runners.model.RunnerBuilder.runners(RunnerBuilder.java:101)
12-Sep-2019 06:11:00         at org.junit.runners.model.RunnerBuilder.runners(RunnerBuilder.java:87)
12-Sep-2019 06:11:00         at org.junit.runners.Suite.<init>(Suite.java:102)
12-Sep-2019 06:11:00         at org.junit.runners.Suite.<init>(Suite.java:70)
12-Sep-2019 06:11:00         at sun.reflect.NativeConstructorAccessorImpl.newInstance0(Native Method)
12-Sep-2019 06:11:00         at sun.reflect.NativeConstructorAccessorImpl.newInstance(NativeConstructorAccessorImpl.java:62)
12-Sep-2019 06:11:00         at sun.reflect.DelegatingConstructorAccessorImpl.newInstance(DelegatingConstructorAccessorImpl.java:45)
12-Sep-2019 06:11:00         at java.lang.reflect.Constructor.newInstance(Constructor.java:423)
12-Sep-2019 06:11:00         at org.junit.internal.builders.AnnotatedBuilder.buildRunner(AnnotatedBuilder.java:107)
12-Sep-2019 06:11:00         at org.junit.internal.builders.AnnotatedBuilder.runnerForClass(AnnotatedBuilder.java:86)
12-Sep-2019 06:11:00         at org.junit.runners.model.RunnerBuilder.safeRunnerForClass(RunnerBuilder.java:59)
12-Sep-2019 06:11:00         at org.junit.internal.builders.AllDefaultPossibilitiesBuilder.runnerForClass(AllDefaultPossibilitiesBuilder.java:26)
12-Sep-2019 06:11:00         at org.junit.runners.model.RunnerBuilder.safeRunnerForClass(RunnerBuilder.java:59)
12-Sep-2019 06:11:00         at org.junit.internal.requests.ClassRequest.getRunner(ClassRequest.java:33)
12-Sep-2019 06:11:00         at org.apache.maven.surefire.junit4.JUnit4Provider.execute(JUnit4Provider.java:283)
12-Sep-2019 06:11:00         at org.apache.maven.surefire.junit4.JUnit4Provider.executeWithRerun(JUnit4Provider.java:173)
12-Sep-2019 06:11:00         at org.apache.maven.surefire.junit4.JUnit4Provider.executeTestSet(JUnit4Provider.java:153)
12-Sep-2019 06:11:00         at org.apache.maven.surefire.junit4.JUnit4Provider.invoke(JUnit4Provider.java:128)
12-Sep-2019 06:11:00         at org.apache.maven.surefire.booter.ForkedBooter.invokeProviderInSameClassLoader(ForkedBooter.java:203)
12-Sep-2019 06:11:00         at org.apache.maven.surefire.booter.ForkedBooter.runSuitesInProcess(ForkedBooter.java:155)
12-Sep-2019 06:11:00         at org.apache.maven.surefire.booter.ForkedBooter.main(ForkedBooter.java:103)
12-Sep-2019 06:11:00
12-Sep-2019 06:11:00 initializationError(io.cdap.cdap.app.etl.batch.XMLReaderTest)  Time elapsed: 0.008 sec  <<< ERROR!
12-Sep-2019 06:11:00 java.lang.SecurityException: Invalid signature file digest for Manifest main attributes
12-Sep-2019 06:11:00         at sun.security.util.SignatureFileVerifier.processImpl(SignatureFileVerifier.java:284)
12-Sep-2019 06:11:00         at sun.security.util.SignatureFileVerifier.process(SignatureFileVerifier.java:238)
12-Sep-2019 06:11:00         at java.util.jar.JarVerifier.processEntry(JarVerifier.java:316)
12-Sep-2019 06:11:00         at java.util.jar.JarVerifier.update(JarVerifier.java:228)
12-Sep-2019 06:11:00         at java.util.jar.JarFile.initializeVerifier(JarFile.java:383)
12-Sep-2019 06:11:00         at java.util.jar.JarFile.getInputStream(JarFile.java:450)
12-Sep-2019 06:11:00         at sun.misc.URLClassPath$JarLoader$2.getInputStream(URLClassPath.java:940)
12-Sep-2019 06:11:00         at sun.misc.Resource.cachedInputStream(Resource.java:77)
12-Sep-2019 06:11:00         at sun.misc.Resource.getByteBuffer(Resource.java:160)
12-Sep-2019 06:11:00         at java.net.URLClassLoader.defineClass(URLClassLoader.java:454)
12-Sep-2019 06:11:00         at java.net.URLClassLoader.access$100(URLClassLoader.java:73)
12-Sep-2019 06:11:00         at java.net.URLClassLoader$1.run(URLClassLoader.java:368)
12-Sep-2019 06:11:00         at java.net.URLClassLoader$1.run(URLClassLoader.java:362)
12-Sep-2019 06:11:00         at java.security.AccessController.doPrivileged(Native Method)
12-Sep-2019 06:11:00         at java.net.URLClassLoader.findClass(URLClassLoader.java:361)
12-Sep-2019 06:11:00         at java.lang.ClassLoader.loadClass(ClassLoader.java:424)
12-Sep-2019 06:11:00         at sun.misc.Launcher$AppClassLoader.loadClass(Launcher.java:331)
12-Sep-2019 06:11:00         at java.lang.ClassLoader.loadClass(ClassLoader.java:357)
12-Sep-2019 06:11:00         at java.lang.Class.getDeclaredMethods0(Native Method)
12-Sep-2019 06:11:00         at java.lang.Class.privateGetDeclaredMethods(Class.java:2701)
12-Sep-2019 06:11:00         at java.lang.Class.privateGetMethodRecursive(Class.java:3048)
12-Sep-2019 06:11:00         at java.lang.Class.getMethod0(Class.java:3018)
12-Sep-2019 06:11:00         at java.lang.Class.getMethod(Class.java:1784)
12-Sep-2019 06:11:00         at org.junit.internal.builders.SuiteMethodBuilder.hasSuiteMethod(SuiteMethodBuilder.java:18)
12-Sep-2019 06:11:00         at org.junit.internal.builders.SuiteMethodBuilder.runnerForClass(SuiteMethodBuilder.java:10)
12-Sep-2019 06:11:00         at org.junit.runners.model.RunnerBuilder.safeRunnerForClass(RunnerBuilder.java:59)
12-Sep-2019 06:11:00         at org.junit.internal.builders.AllDefaultPossibilitiesBuilder.runnerForClass(AllDefaultPossibilitiesBuilder.java:26)
12-Sep-2019 06:11:00         at org.junit.runners.model.RunnerBuilder.safeRunnerForClass(RunnerBuilder.java:59)
12-Sep-2019 06:11:00         at org.junit.runners.model.RunnerBuilder.runners(RunnerBuilder.java:101)
12-Sep-2019 06:11:00         at org.junit.runners.model.RunnerBuilder.runners(RunnerBuilder.java:87)
12-Sep-2019 06:11:00         at org.junit.runners.Suite.<init>(Suite.java:102)
12-Sep-2019 06:11:00         at org.junit.runners.Suite.<init>(Suite.java:70)
12-Sep-2019 06:11:00         at sun.reflect.NativeConstructorAccessorImpl.newInstance0(Native Method)
12-Sep-2019 06:11:00         at sun.reflect.NativeConstructorAccessorImpl.newInstance(NativeConstructorAccessorImpl.java:62)
12-Sep-2019 06:11:00         at sun.reflect.DelegatingConstructorAccessorImpl.newInstance(DelegatingConstructorAccessorImpl.java:45)
12-Sep-2019 06:11:00         at java.lang.reflect.Constructor.newInstance(Constructor.java:423)
12-Sep-2019 06:11:00         at org.junit.internal.builders.AnnotatedBuilder.buildRunner(AnnotatedBuilder.java:107)
12-Sep-2019 06:11:00         at org.junit.internal.builders.AnnotatedBuilder.runnerForClass(AnnotatedBuilder.java:86)
12-Sep-2019 06:11:00         at org.junit.runners.model.RunnerBuilder.safeRunnerForClass(RunnerBuilder.java:59)
12-Sep-2019 06:11:00         at org.junit.internal.builders.AllDefaultPossibilitiesBuilder.runnerForClass(AllDefaultPossibilitiesBuilder.java:26)
12-Sep-2019 06:11:00         at org.junit.runners.model.RunnerBuilder.safeRunnerForClass(RunnerBuilder.java:59)
12-Sep-2019 06:11:00         at org.junit.internal.requests.ClassRequest.getRunner(ClassRequest.java:33)
12-Sep-2019 06:11:00         at org.apache.maven.surefire.junit4.JUnit4Provider.execute(JUnit4Provider.java:283)
12-Sep-2019 06:11:00         at org.apache.maven.surefire.junit4.JUnit4Provider.executeWithRerun(JUnit4Provider.java:173)
12-Sep-2019 06:11:00         at org.apache.maven.surefire.junit4.JUnit4Provider.executeTestSet(JUnit4Provider.java:153)
12-Sep-2019 06:11:00         at org.apache.maven.surefire.junit4.JUnit4Provider.invoke(JUnit4Provider.java:128)
12-Sep-2019 06:11:00         at org.apache.maven.surefire.booter.ForkedBooter.invokeProviderInSameClassLoader(ForkedBooter.java:203)
12-Sep-2019 06:11:00         at org.apache.maven.surefire.booter.ForkedBooter.runSuitesInProcess(ForkedBooter.java:155)
12-Sep-2019 06:11:00         at org.apache.maven.surefire.booter.ForkedBooter.main(ForkedBooter.java:103)
12-Sep-2019 06:11:00
12-Sep-2019 06:11:00
12-Sep-2019 06:11:00 Results :
12-Sep-2019 06:11:00
12-Sep-2019 06:11:00 Tests in error:
12-Sep-2019 06:11:00   KVTableWithProjectionTest.initializationError » Security Invalid signature fil...
12-Sep-2019 06:11:00   TPFSAvroSinkSourceTest.initializationError » Security Invalid signature file d...
12-Sep-2019 06:11:00   BatchAggregatorTest.initializationError » Security Invalid signature file dige...
12-Sep-2019 06:11:00   BatchCubeSinkTest.initializationError » Security Invalid signature file digest...
12-Sep-2019 06:11:00   BatchJoinerTest.initializationError » Security Invalid signature file digest f...
12-Sep-2019 06:11:00   ETLMapReduceTest.initializationError » Security Invalid signature file digest ...
12-Sep-2019 06:11:00   ExcelInputReaderTest.initializationError » Security Invalid signature file dig...
12-Sep-2019 06:11:00   HivePluginTest.initializationError » Security Invalid signature file digest fo...
12-Sep-2019 06:11:00   NormalizeTest.initializationError » Security Invalid signature file digest for...
12-Sep-2019 06:11:00   RowDenormalizerTest.initializationError » Security Invalid signature file dige...
12-Sep-2019 06:11:00   TPFSParquetSinkSourceTest.initializationError » Security Invalid signature fil...
12-Sep-2019 06:11:00   ValueMapperTest.initializationError » Security Invalid signature file digest f...
12-Sep-2019 06:11:00   XMLReaderTest.initializationError » Security Invalid signature file digest for...
12-Sep-2019 06:11:00   DataStreamsTest.initializationError » Security Invalid signature file digest f...
12-Sep-2019 06:11:00   WranglerServiceTest.initializationError » Security Invalid signature file dige...
12-Sep-2019 06:11:00   WranglerTest.initializationError » Security Invalid signature file digest for ...
12-Sep-2019 06:11:00   PermissionTest.initializationError » Security Invalid signature file digest fo...
12-Sep-2019 06:11:00   ReadlessIncrementTest.initializationError » Security Invalid signature file di...
12-Sep-2019 06:11:00   HangingWorkerTest.initializationError » Security Invalid signature file digest...
12-Sep-2019 06:11:00   ServiceWorkerTest.initializationError » Security Invalid signature file digest...
12-Sep-2019 06:11:00   ApplicationTest.initializationError » Security Invalid signature file digest f...
12-Sep-2019 06:11:00   NamespaceTest.initializationError » Security Invalid signature file digest for...
12-Sep-2019 06:11:00   DatasetTest.initializationError » Security Invalid signature file digest for M...
12-Sep-2019 06:11:00   FileSetTest.initializationError » Security Invalid signature file digest for M...
12-Sep-2019 06:11:00   PartitionCorrectorTest.initializationError » Security Invalid signature file d...
12-Sep-2019 06:11:00   PartitionedFileSetUpdateTest.initializationError » Security Invalid signature ...
12-Sep-2019 06:11:00   ProgramMetadataTest.initializationError » Security Invalid signature file dige...
12-Sep-2019 06:11:00   WorkflowTest.initializationError » Security Invalid signature file digest for ...
12-Sep-2019 06:11:00   OperationalStatsTest.initializationError » Security Invalid signature file dig...
12-Sep-2019 06:11:00   RemoteCubeTest.initializationError » Security Invalid signature file digest fo...
12-Sep-2019 06:11:00   RemoteKeyValueTest.initializationError » Security Invalid signature file diges...
12-Sep-2019 06:11:00   RemoteTableTest.initializationError » Security Invalid signature file digest f...
12-Sep-2019 06:11:00
12-Sep-2019 06:11:00 Tests run: 32, Failures: 0, Errors: 32, Skipped: 0
12-Sep-2019 06:11:00
12-Sep-2019 06:11:00 [INFO] ------------------------------------------------------------------------
12-Sep-2019 06:11:00 [INFO] Reactor Summary:
12-Sep-2019 06:11:00 [INFO]
12-Sep-2019 06:11:00 [INFO] integration-test .................................. SUCCESS [50.466s]
12-Sep-2019 06:11:00 [INFO] integration-test-core ............................. SUCCESS [4.831s]
12-Sep-2019 06:11:00 [INFO] integration-test-remote ........................... FAILURE [21.187s]
12-Sep-2019 06:11:00 [INFO] integration-test-standalone ....................... SKIPPED
12-Sep-2019 06:11:00 [INFO] upgrade-test ...................................... SKIPPED
12-Sep-2019 06:11:00 [INFO] long-running-test ................................. SKIPPED
12-Sep-2019 06:11:00 [INFO] perf-test ......................................... SKIPPED
12-Sep-2019 06:11:00 [INFO] ------------------------------------------------------------------------
12-Sep-2019 06:11:00 [INFO] BUILD FAILURE
12-Sep-2019 06:11:00 [INFO] ------------------------------------------------------------------------
12-Sep-2019 06:11:00 [INFO] Total time: 1:16.899s
12-Sep-2019 06:11:00 [INFO] Finished at: Thu Sep 12 06:11:00 UTC 2019
12-Sep-2019 06:11:01 [INFO] Final Memory: 125M/850M
12-Sep-2019 06:11:01 [INFO] ------------------------------------------------------------------------
12-Sep-2019 06:11:01 [ERROR] Failed to execute goal org.apache.maven.plugins:maven-surefire-plugin:2.18.1:test (default-test) on project integration-test-remote: There are test failures.
12-Sep-2019 06:11:01 [ERROR]
12-Sep-2019 06:11:01 [ERROR] Please refer to /var/bamboo/xml-data/build-dir/IT-ITN-DSTH26/cdap-integration-tests/integration-test-remote/target/surefire-reports for the individual test results.
12-Sep-2019 06:11:01 [ERROR] -> [Help 1]
12-Sep-2019 06:11:01 [ERROR]
12-Sep-2019 06:11:01 [ERROR] To see the full stack trace of the errors, re-run Maven with the -e switch.
12-Sep-2019 06:11:01 [ERROR] Re-run Maven using the -X switch to enable full debug logging.
12-Sep-2019 06:11:01 [ERROR]
12-Sep-2019 06:11:01 [ERROR] For more information about the errors and possible solutions, please read the following articles:
12-Sep-2019 06:11:01 [ERROR] [Help 1] http://cwiki.apache.org/confluence/display/MAVEN/MojoFailureException
12-Sep-2019 06:11:01 [ERROR]
12-Sep-2019 06:11:01 [ERROR] After correcting the problems, you can resume the build with the command
12-Sep-2019 06:11:01 [ERROR]   mvn <goals> -rf :integration-test-remote
12-Sep-2019 06:11:01 Failing task since return code of [/opt/maven/bin/mvn --batch-mode -Djava.io.tmpdir=/tmp/IT-ITN-DSTH26 clean test -U -Dtest=AllTests -DfailIfNoTests=false -Dcdap.username=******** -Dcdap.password=******** -DinstanceUri=http://10.210.0.68] was 1 while expected 0
12-Sep-2019 06:11:01 Parsing test results under /var/bamboo/xml-data/build-dir/IT-ITN-DSTH26...
12-Sep-2019 06:11:01 Finished task 'Integration test - cluster' with result: Failed
12-Sep-2019 06:11:01 Running post build plugin 'Docker Container Cleanup'
12-Sep-2019 06:11:01 Running post build plugin 'NCover Results Collector'
12-Sep-2019 06:11:01 Running post build plugin 'Clover Results Collector'
12-Sep-2019 06:11:01 Running post build plugin 'npm Cache Cleanup'
12-Sep-2019 06:11:01 Running post build plugin 'Artifact Copier'
12-Sep-2019 06:11:01 Finalising the build...
12-Sep-2019 06:11:01 Stopping timer.
12-Sep-2019 06:11:01 Build IT-ITN-DSTH26-316 completed.
12-Sep-2019 06:11:01 Running on server: post build plugin 'NCover Results Collector'
12-Sep-2019 06:11:01 Running on server: post build plugin 'Build Hanging Detection Configuration'
12-Sep-2019 06:11:01 Running on server: post build plugin 'Clover Delta Calculator'
12-Sep-2019 06:11:01 Running on server: post build plugin 'Maven Dependencies Postprocessor'
12-Sep-2019 06:11:01 All post build plugins have finished
12-Sep-2019 06:11:01 Generating build results summary...
12-Sep-2019 06:11:01 Saving build results to disk...
12-Sep-2019 06:11:01 Logging substituted variables...
12-Sep-2019 06:11:01 Indexing build results...
12-Sep-2019 06:11:01 Finished building IT-ITN-DSTH26-316.