Build #632

Build: #632 failed

Job: Distro Tests - HDP 2.4 failed

Job result summary

Completed
Duration
671 minutes
Agent
bamboo-agent14
Revision
8ef64e0c750a11ea74fd7d1f497f96224041c494 8ef64e0c750a11ea74fd7d1f497f96224041c494
Total tests
45
Fixed in
#633 (Scheduled)

Tests

  • 45 tests in total
  • 35 tests failed
  • 35 failures are new
  • 484 minutes taken in total.
New test failures 35
Status Test Duration
Collapse Failed KVTableWithProjectionTest testKVTableWithProjection History
12 mins
java.util.concurrent.TimeoutException: CDAP Services are not available. Retried for 600 seconds.
	at io.cdap.cdap.test.IntegrationTestBase.checkServicesWithRetry(IntegrationTestBase.java:265)
	at io.cdap.cdap.test.IntegrationTestBase.checkSystemServices(IntegrationTestBase.java:200)
	at io.cdap.cdap.test.IntegrationTestBase.setUp(IntegrationTestBase.java:97)
	at sun.reflect.GeneratedMethodAccessor2.invoke(Unknown Source)
	at sun.reflect.DelegatingMethodAccessorImpl.invoke(DelegatingMethodAccessorImpl.java:43)
	at java.lang.reflect.Method.invoke(Method.java:498)
	at org.junit.runners.model.FrameworkMethod$1.runReflectiveCall(FrameworkMethod.java:50)
(30 more lines...)
Collapse Failed TPFSAvroSinkSourceTest testTPFSWithProjection History
12 mins
java.util.concurrent.TimeoutException: CDAP Services are not available. Retried for 600 seconds.
	at io.cdap.cdap.test.IntegrationTestBase.checkServicesWithRetry(IntegrationTestBase.java:265)
	at io.cdap.cdap.test.IntegrationTestBase.checkSystemServices(IntegrationTestBase.java:200)
	at io.cdap.cdap.test.IntegrationTestBase.setUp(IntegrationTestBase.java:97)
	at sun.reflect.GeneratedMethodAccessor2.invoke(Unknown Source)
	at sun.reflect.DelegatingMethodAccessorImpl.invoke(DelegatingMethodAccessorImpl.java:43)
	at java.lang.reflect.Method.invoke(Method.java:498)
	at org.junit.runners.model.FrameworkMethod$1.runReflectiveCall(FrameworkMethod.java:50)
(30 more lines...)
Collapse Failed ETLMapReduceTest testKVToKV History
4 mins
java.lang.RuntimeException: java.io.IOException: Connection refused: it-itn-dsth24-632-65717-1000.coopr.sh/10.210.0.48:39376
	at io.cdap.cdap.client.util.RESTClient.upload(RESTClient.java:160)
	at io.cdap.cdap.client.ApplicationClient.deployApp(ApplicationClient.java:494)
	at io.cdap.cdap.client.ApplicationClient.deploy(ApplicationClient.java:422)
	at io.cdap.cdap.client.ApplicationClient.deploy(ApplicationClient.java:398)
	at io.cdap.cdap.test.IntegrationTestManager.deployApplication(IntegrationTestManager.java:180)
	at io.cdap.cdap.test.AudiTestBase.deployServiceForDataset(AudiTestBase.java:293)
	at io.cdap.cdap.test.AudiTestBase.deployServiceForDataset(AudiTestBase.java:285)
(2 more lines...)
Collapse Failed ExcelInputReaderTest testExcelReader History
12 mins
java.util.concurrent.TimeoutException: CDAP Services are not available. Retried for 600 seconds.
	at io.cdap.cdap.test.IntegrationTestBase.checkServicesWithRetry(IntegrationTestBase.java:265)
	at io.cdap.cdap.test.IntegrationTestBase.checkSystemServices(IntegrationTestBase.java:200)
	at io.cdap.cdap.test.IntegrationTestBase.setUp(IntegrationTestBase.java:97)
	at sun.reflect.NativeMethodAccessorImpl.invoke0(Native Method)
	at sun.reflect.NativeMethodAccessorImpl.invoke(NativeMethodAccessorImpl.java:62)
	at sun.reflect.DelegatingMethodAccessorImpl.invoke(DelegatingMethodAccessorImpl.java:43)
	at java.lang.reflect.Method.invoke(Method.java:498)
(31 more lines...)
Collapse Failed ExcelInputReaderTest testExcelReaderReprocessFalse History
12 mins
java.util.concurrent.TimeoutException: CDAP Services are not available. Retried for 600 seconds.
	at io.cdap.cdap.test.IntegrationTestBase.checkServicesWithRetry(IntegrationTestBase.java:265)
	at io.cdap.cdap.test.IntegrationTestBase.checkSystemServices(IntegrationTestBase.java:200)
	at io.cdap.cdap.test.IntegrationTestBase.setUp(IntegrationTestBase.java:97)
	at sun.reflect.NativeMethodAccessorImpl.invoke0(Native Method)
	at sun.reflect.NativeMethodAccessorImpl.invoke(NativeMethodAccessorImpl.java:62)
	at sun.reflect.DelegatingMethodAccessorImpl.invoke(DelegatingMethodAccessorImpl.java:43)
	at java.lang.reflect.Method.invoke(Method.java:498)
(31 more lines...)
Collapse Failed HivePluginTest testHivePlugins History
12 mins
java.util.concurrent.TimeoutException: CDAP Services are not available. Retried for 600 seconds.
	at io.cdap.cdap.test.IntegrationTestBase.checkServicesWithRetry(IntegrationTestBase.java:265)
	at io.cdap.cdap.test.IntegrationTestBase.checkSystemServices(IntegrationTestBase.java:200)
	at io.cdap.cdap.test.IntegrationTestBase.setUp(IntegrationTestBase.java:97)
	at sun.reflect.NativeMethodAccessorImpl.invoke0(Native Method)
	at sun.reflect.NativeMethodAccessorImpl.invoke(NativeMethodAccessorImpl.java:62)
	at sun.reflect.DelegatingMethodAccessorImpl.invoke(DelegatingMethodAccessorImpl.java:43)
	at java.lang.reflect.Method.invoke(Method.java:498)
(31 more lines...)
Collapse Failed NormalizeTest testNormalize History
12 mins
java.util.concurrent.TimeoutException: CDAP Services are not available. Retried for 600 seconds.
	at io.cdap.cdap.test.IntegrationTestBase.checkServicesWithRetry(IntegrationTestBase.java:265)
	at io.cdap.cdap.test.IntegrationTestBase.checkSystemServices(IntegrationTestBase.java:200)
	at io.cdap.cdap.test.IntegrationTestBase.setUp(IntegrationTestBase.java:97)
	at sun.reflect.GeneratedMethodAccessor2.invoke(Unknown Source)
	at sun.reflect.DelegatingMethodAccessorImpl.invoke(DelegatingMethodAccessorImpl.java:43)
	at java.lang.reflect.Method.invoke(Method.java:498)
	at org.junit.runners.model.FrameworkMethod$1.runReflectiveCall(FrameworkMethod.java:50)
(31 more lines...)
Collapse Failed NormalizeTest testNormalizeWithEmptyAttributeValue History
12 mins
java.util.concurrent.TimeoutException: CDAP Services are not available. Retried for 600 seconds.
	at io.cdap.cdap.test.IntegrationTestBase.checkServicesWithRetry(IntegrationTestBase.java:265)
	at io.cdap.cdap.test.IntegrationTestBase.checkSystemServices(IntegrationTestBase.java:200)
	at io.cdap.cdap.test.IntegrationTestBase.setUp(IntegrationTestBase.java:97)
	at sun.reflect.GeneratedMethodAccessor2.invoke(Unknown Source)
	at sun.reflect.DelegatingMethodAccessorImpl.invoke(DelegatingMethodAccessorImpl.java:43)
	at java.lang.reflect.Method.invoke(Method.java:498)
	at org.junit.runners.model.FrameworkMethod$1.runReflectiveCall(FrameworkMethod.java:50)
(31 more lines...)
Collapse Failed RowDenormalizerTest test History
12 mins
java.util.concurrent.TimeoutException: CDAP Services are not available. Retried for 600 seconds.
	at io.cdap.cdap.test.IntegrationTestBase.checkServicesWithRetry(IntegrationTestBase.java:265)
	at io.cdap.cdap.test.IntegrationTestBase.checkSystemServices(IntegrationTestBase.java:200)
	at io.cdap.cdap.test.IntegrationTestBase.setUp(IntegrationTestBase.java:97)
	at sun.reflect.GeneratedMethodAccessor2.invoke(Unknown Source)
	at sun.reflect.DelegatingMethodAccessorImpl.invoke(DelegatingMethodAccessorImpl.java:43)
	at java.lang.reflect.Method.invoke(Method.java:498)
	at org.junit.runners.model.FrameworkMethod$1.runReflectiveCall(FrameworkMethod.java:50)
(30 more lines...)
Collapse Failed TPFSParquetSinkSourceTest testMR History
12 mins
java.util.concurrent.TimeoutException: CDAP Services are not available. Retried for 600 seconds.
	at io.cdap.cdap.test.IntegrationTestBase.checkServicesWithRetry(IntegrationTestBase.java:265)
	at io.cdap.cdap.test.IntegrationTestBase.checkSystemServices(IntegrationTestBase.java:200)
	at io.cdap.cdap.test.IntegrationTestBase.setUp(IntegrationTestBase.java:97)
	at sun.reflect.GeneratedMethodAccessor2.invoke(Unknown Source)
	at sun.reflect.DelegatingMethodAccessorImpl.invoke(DelegatingMethodAccessorImpl.java:43)
	at java.lang.reflect.Method.invoke(Method.java:498)
	at org.junit.runners.model.FrameworkMethod$1.runReflectiveCall(FrameworkMethod.java:50)
(30 more lines...)
Collapse Failed TPFSParquetSinkSourceTest testSpark History
12 mins
java.util.concurrent.TimeoutException: CDAP Services are not available. Retried for 600 seconds.
	at io.cdap.cdap.test.IntegrationTestBase.checkServicesWithRetry(IntegrationTestBase.java:265)
	at io.cdap.cdap.test.IntegrationTestBase.checkSystemServices(IntegrationTestBase.java:200)
	at io.cdap.cdap.test.IntegrationTestBase.setUp(IntegrationTestBase.java:97)
	at sun.reflect.GeneratedMethodAccessor2.invoke(Unknown Source)
	at sun.reflect.DelegatingMethodAccessorImpl.invoke(DelegatingMethodAccessorImpl.java:43)
	at java.lang.reflect.Method.invoke(Method.java:498)
	at org.junit.runners.model.FrameworkMethod$1.runReflectiveCall(FrameworkMethod.java:50)
(30 more lines...)
Collapse Failed ValueMapperTest test History
12 mins
java.util.concurrent.TimeoutException: CDAP Services are not available. Retried for 600 seconds.
	at io.cdap.cdap.test.IntegrationTestBase.checkServicesWithRetry(IntegrationTestBase.java:265)
	at io.cdap.cdap.test.IntegrationTestBase.checkSystemServices(IntegrationTestBase.java:200)
	at io.cdap.cdap.test.IntegrationTestBase.setUp(IntegrationTestBase.java:97)
	at sun.reflect.GeneratedMethodAccessor2.invoke(Unknown Source)
	at sun.reflect.DelegatingMethodAccessorImpl.invoke(DelegatingMethodAccessorImpl.java:43)
	at java.lang.reflect.Method.invoke(Method.java:498)
	at org.junit.runners.model.FrameworkMethod$1.runReflectiveCall(FrameworkMethod.java:50)
(30 more lines...)
Collapse Failed XMLReaderTest testInvalidNodePathWithMoveAction History
12 mins
java.util.concurrent.TimeoutException: CDAP Services are not available. Retried for 600 seconds.
	at io.cdap.cdap.test.IntegrationTestBase.checkServicesWithRetry(IntegrationTestBase.java:265)
	at io.cdap.cdap.test.IntegrationTestBase.checkSystemServices(IntegrationTestBase.java:200)
	at io.cdap.cdap.test.IntegrationTestBase.setUp(IntegrationTestBase.java:97)
	at sun.reflect.GeneratedMethodAccessor2.invoke(Unknown Source)
	at sun.reflect.DelegatingMethodAccessorImpl.invoke(DelegatingMethodAccessorImpl.java:43)
	at java.lang.reflect.Method.invoke(Method.java:498)
	at org.junit.runners.model.FrameworkMethod$1.runReflectiveCall(FrameworkMethod.java:50)
(30 more lines...)
Collapse Failed XMLReaderTest testInvalidPatternWithDeleteAction History
12 mins
java.util.concurrent.TimeoutException: CDAP Services are not available. Retried for 600 seconds.
	at io.cdap.cdap.test.IntegrationTestBase.checkServicesWithRetry(IntegrationTestBase.java:265)
	at io.cdap.cdap.test.IntegrationTestBase.checkSystemServices(IntegrationTestBase.java:200)
	at io.cdap.cdap.test.IntegrationTestBase.setUp(IntegrationTestBase.java:97)
	at sun.reflect.GeneratedMethodAccessor2.invoke(Unknown Source)
	at sun.reflect.DelegatingMethodAccessorImpl.invoke(DelegatingMethodAccessorImpl.java:43)
	at java.lang.reflect.Method.invoke(Method.java:498)
	at org.junit.runners.model.FrameworkMethod$1.runReflectiveCall(FrameworkMethod.java:50)
(30 more lines...)
Collapse Failed XMLReaderTest testPatternWithDeleteAction History
12 mins
java.util.concurrent.TimeoutException: CDAP Services are not available. Retried for 600 seconds.
	at io.cdap.cdap.test.IntegrationTestBase.checkServicesWithRetry(IntegrationTestBase.java:265)
	at io.cdap.cdap.test.IntegrationTestBase.checkSystemServices(IntegrationTestBase.java:200)
	at io.cdap.cdap.test.IntegrationTestBase.setUp(IntegrationTestBase.java:97)
	at sun.reflect.GeneratedMethodAccessor2.invoke(Unknown Source)
	at sun.reflect.DelegatingMethodAccessorImpl.invoke(DelegatingMethodAccessorImpl.java:43)
	at java.lang.reflect.Method.invoke(Method.java:498)
	at org.junit.runners.model.FrameworkMethod$1.runReflectiveCall(FrameworkMethod.java:50)
(30 more lines...)
Collapse Failed XMLReaderTest testPreProcessingNotRequired History
12 mins
java.util.concurrent.TimeoutException: CDAP Services are not available. Retried for 600 seconds.
	at io.cdap.cdap.test.IntegrationTestBase.checkServicesWithRetry(IntegrationTestBase.java:265)
	at io.cdap.cdap.test.IntegrationTestBase.checkSystemServices(IntegrationTestBase.java:200)
	at io.cdap.cdap.test.IntegrationTestBase.setUp(IntegrationTestBase.java:97)
	at sun.reflect.GeneratedMethodAccessor2.invoke(Unknown Source)
	at sun.reflect.DelegatingMethodAccessorImpl.invoke(DelegatingMethodAccessorImpl.java:43)
	at java.lang.reflect.Method.invoke(Method.java:498)
	at org.junit.runners.model.FrameworkMethod$1.runReflectiveCall(FrameworkMethod.java:50)
(30 more lines...)
Collapse Failed XMLReaderTest testPreProcessingRequired History
12 mins
java.util.concurrent.TimeoutException: CDAP Services are not available. Retried for 600 seconds.
	at io.cdap.cdap.test.IntegrationTestBase.checkServicesWithRetry(IntegrationTestBase.java:265)
	at io.cdap.cdap.test.IntegrationTestBase.checkSystemServices(IntegrationTestBase.java:200)
	at io.cdap.cdap.test.IntegrationTestBase.setUp(IntegrationTestBase.java:97)
	at sun.reflect.GeneratedMethodAccessor2.invoke(Unknown Source)
	at sun.reflect.DelegatingMethodAccessorImpl.invoke(DelegatingMethodAccessorImpl.java:43)
	at java.lang.reflect.Method.invoke(Method.java:498)
	at org.junit.runners.model.FrameworkMethod$1.runReflectiveCall(FrameworkMethod.java:50)
(30 more lines...)
Collapse Failed WranglerServiceTest test History
12 mins
java.util.concurrent.TimeoutException: CDAP Services are not available. Retried for 600 seconds.
	at io.cdap.cdap.test.IntegrationTestBase.checkServicesWithRetry(IntegrationTestBase.java:265)
	at io.cdap.cdap.test.IntegrationTestBase.checkSystemServices(IntegrationTestBase.java:200)
	at io.cdap.cdap.test.IntegrationTestBase.setUp(IntegrationTestBase.java:97)
	at sun.reflect.GeneratedMethodAccessor2.invoke(Unknown Source)
	at sun.reflect.DelegatingMethodAccessorImpl.invoke(DelegatingMethodAccessorImpl.java:43)
	at java.lang.reflect.Method.invoke(Method.java:498)
	at org.junit.runners.model.FrameworkMethod$1.runReflectiveCall(FrameworkMethod.java:50)
(30 more lines...)
Collapse Failed WranglerTest testWranglerMR History
12 mins
java.util.concurrent.TimeoutException: CDAP Services are not available. Retried for 600 seconds.
	at io.cdap.cdap.test.IntegrationTestBase.checkServicesWithRetry(IntegrationTestBase.java:265)
	at io.cdap.cdap.test.IntegrationTestBase.checkSystemServices(IntegrationTestBase.java:200)
	at io.cdap.cdap.test.IntegrationTestBase.setUp(IntegrationTestBase.java:97)
	at sun.reflect.GeneratedMethodAccessor2.invoke(Unknown Source)
	at sun.reflect.DelegatingMethodAccessorImpl.invoke(DelegatingMethodAccessorImpl.java:43)
	at java.lang.reflect.Method.invoke(Method.java:498)
	at org.junit.runners.model.FrameworkMethod$1.runReflectiveCall(FrameworkMethod.java:50)
(30 more lines...)
Collapse Failed WranglerTest testWranglerSpark History
12 mins
java.util.concurrent.TimeoutException: CDAP Services are not available. Retried for 600 seconds.
	at io.cdap.cdap.test.IntegrationTestBase.checkServicesWithRetry(IntegrationTestBase.java:265)
	at io.cdap.cdap.test.IntegrationTestBase.checkSystemServices(IntegrationTestBase.java:200)
	at io.cdap.cdap.test.IntegrationTestBase.setUp(IntegrationTestBase.java:97)
	at sun.reflect.GeneratedMethodAccessor2.invoke(Unknown Source)
	at sun.reflect.DelegatingMethodAccessorImpl.invoke(DelegatingMethodAccessorImpl.java:43)
	at java.lang.reflect.Method.invoke(Method.java:498)
	at org.junit.runners.model.FrameworkMethod$1.runReflectiveCall(FrameworkMethod.java:50)
(30 more lines...)
Collapse Failed PermissionTest test History
12 mins
java.util.concurrent.TimeoutException: CDAP Services are not available. Retried for 600 seconds.
	at io.cdap.cdap.test.IntegrationTestBase.checkServicesWithRetry(IntegrationTestBase.java:265)
	at io.cdap.cdap.test.IntegrationTestBase.checkSystemServices(IntegrationTestBase.java:200)
	at io.cdap.cdap.test.IntegrationTestBase.setUp(IntegrationTestBase.java:97)
	at sun.reflect.GeneratedMethodAccessor2.invoke(Unknown Source)
	at sun.reflect.DelegatingMethodAccessorImpl.invoke(DelegatingMethodAccessorImpl.java:43)
	at java.lang.reflect.Method.invoke(Method.java:498)
	at org.junit.runners.model.FrameworkMethod$1.runReflectiveCall(FrameworkMethod.java:50)
(30 more lines...)
Collapse Failed ReadlessIncrementTest testReadlessIncrementsInMapReduce History
12 mins
java.util.concurrent.TimeoutException: CDAP Services are not available. Retried for 600 seconds.
	at io.cdap.cdap.test.IntegrationTestBase.checkServicesWithRetry(IntegrationTestBase.java:265)
	at io.cdap.cdap.test.IntegrationTestBase.checkSystemServices(IntegrationTestBase.java:200)
	at io.cdap.cdap.test.IntegrationTestBase.setUp(IntegrationTestBase.java:97)
	at sun.reflect.GeneratedMethodAccessor2.invoke(Unknown Source)
	at sun.reflect.DelegatingMethodAccessorImpl.invoke(DelegatingMethodAccessorImpl.java:43)
	at java.lang.reflect.Method.invoke(Method.java:498)
	at org.junit.runners.model.FrameworkMethod$1.runReflectiveCall(FrameworkMethod.java:50)
(30 more lines...)
Collapse Failed HangingWorkerTest testRestart History
12 mins
java.util.concurrent.TimeoutException: CDAP Services are not available. Retried for 600 seconds.
	at io.cdap.cdap.test.IntegrationTestBase.checkServicesWithRetry(IntegrationTestBase.java:265)
	at io.cdap.cdap.test.IntegrationTestBase.checkSystemServices(IntegrationTestBase.java:200)
	at io.cdap.cdap.test.IntegrationTestBase.setUp(IntegrationTestBase.java:97)
	at sun.reflect.NativeMethodAccessorImpl.invoke0(Native Method)
	at sun.reflect.NativeMethodAccessorImpl.invoke(NativeMethodAccessorImpl.java:62)
	at sun.reflect.DelegatingMethodAccessorImpl.invoke(DelegatingMethodAccessorImpl.java:43)
	at java.lang.reflect.Method.invoke(Method.java:498)
(31 more lines...)
Collapse Failed ServiceWorkerTest test History
12 mins
java.util.concurrent.TimeoutException: CDAP Services are not available. Retried for 600 seconds.
	at io.cdap.cdap.test.IntegrationTestBase.checkServicesWithRetry(IntegrationTestBase.java:265)
	at io.cdap.cdap.test.IntegrationTestBase.checkSystemServices(IntegrationTestBase.java:200)
	at io.cdap.cdap.test.IntegrationTestBase.setUp(IntegrationTestBase.java:97)
	at sun.reflect.GeneratedMethodAccessor2.invoke(Unknown Source)
	at sun.reflect.DelegatingMethodAccessorImpl.invoke(DelegatingMethodAccessorImpl.java:43)
	at java.lang.reflect.Method.invoke(Method.java:498)
	at org.junit.runners.model.FrameworkMethod$1.runReflectiveCall(FrameworkMethod.java:50)
(30 more lines...)
Collapse Failed NamespaceTest testNamespaces History
12 mins
java.util.concurrent.TimeoutException: CDAP Services are not available. Retried for 600 seconds.
	at io.cdap.cdap.test.IntegrationTestBase.checkServicesWithRetry(IntegrationTestBase.java:265)
	at io.cdap.cdap.test.IntegrationTestBase.checkSystemServices(IntegrationTestBase.java:200)
	at io.cdap.cdap.test.IntegrationTestBase.setUp(IntegrationTestBase.java:97)
	at sun.reflect.GeneratedMethodAccessor2.invoke(Unknown Source)
	at sun.reflect.DelegatingMethodAccessorImpl.invoke(DelegatingMethodAccessorImpl.java:43)
	at java.lang.reflect.Method.invoke(Method.java:498)
	at org.junit.runners.model.FrameworkMethod$1.runReflectiveCall(FrameworkMethod.java:50)
(30 more lines...)
Collapse Failed FileSetTest test History
12 mins
java.util.concurrent.TimeoutException: CDAP Services are not available. Retried for 600 seconds.
	at io.cdap.cdap.test.IntegrationTestBase.checkServicesWithRetry(IntegrationTestBase.java:265)
	at io.cdap.cdap.test.IntegrationTestBase.checkSystemServices(IntegrationTestBase.java:200)
	at io.cdap.cdap.test.IntegrationTestBase.setUp(IntegrationTestBase.java:97)
	at sun.reflect.NativeMethodAccessorImpl.invoke0(Native Method)
	at sun.reflect.NativeMethodAccessorImpl.invoke(NativeMethodAccessorImpl.java:62)
	at sun.reflect.DelegatingMethodAccessorImpl.invoke(DelegatingMethodAccessorImpl.java:43)
	at java.lang.reflect.Method.invoke(Method.java:498)
(31 more lines...)
Collapse Failed PartitionCorrectorTest test History
12 mins
java.util.concurrent.TimeoutException: CDAP Services are not available. Retried for 600 seconds.
	at io.cdap.cdap.test.IntegrationTestBase.checkServicesWithRetry(IntegrationTestBase.java:265)
	at io.cdap.cdap.test.IntegrationTestBase.checkSystemServices(IntegrationTestBase.java:200)
	at io.cdap.cdap.test.IntegrationTestBase.setUp(IntegrationTestBase.java:97)
	at sun.reflect.GeneratedMethodAccessor2.invoke(Unknown Source)
	at sun.reflect.DelegatingMethodAccessorImpl.invoke(DelegatingMethodAccessorImpl.java:43)
	at java.lang.reflect.Method.invoke(Method.java:498)
	at org.junit.runners.model.FrameworkMethod$1.runReflectiveCall(FrameworkMethod.java:50)
(30 more lines...)
Collapse Failed PartitionedFileSetUpdateTest test History
12 mins
java.util.concurrent.TimeoutException: CDAP Services are not available. Retried for 600 seconds.
	at io.cdap.cdap.test.IntegrationTestBase.checkServicesWithRetry(IntegrationTestBase.java:265)
	at io.cdap.cdap.test.IntegrationTestBase.checkSystemServices(IntegrationTestBase.java:200)
	at io.cdap.cdap.test.IntegrationTestBase.setUp(IntegrationTestBase.java:97)
	at sun.reflect.GeneratedMethodAccessor2.invoke(Unknown Source)
	at sun.reflect.DelegatingMethodAccessorImpl.invoke(DelegatingMethodAccessorImpl.java:43)
	at java.lang.reflect.Method.invoke(Method.java:498)
	at org.junit.runners.model.FrameworkMethod$1.runReflectiveCall(FrameworkMethod.java:50)
(30 more lines...)
Collapse Failed ProgramMetadataTest testSearchUsingSystemMetadata History
12 mins
java.util.concurrent.TimeoutException: CDAP Services are not available. Retried for 600 seconds.
	at io.cdap.cdap.test.IntegrationTestBase.checkServicesWithRetry(IntegrationTestBase.java:265)
	at io.cdap.cdap.test.IntegrationTestBase.checkSystemServices(IntegrationTestBase.java:200)
	at io.cdap.cdap.test.IntegrationTestBase.setUp(IntegrationTestBase.java:97)
	at sun.reflect.GeneratedMethodAccessor2.invoke(Unknown Source)
	at sun.reflect.DelegatingMethodAccessorImpl.invoke(DelegatingMethodAccessorImpl.java:43)
	at java.lang.reflect.Method.invoke(Method.java:498)
	at org.junit.runners.model.FrameworkMethod$1.runReflectiveCall(FrameworkMethod.java:50)
(30 more lines...)
Collapse Failed ProgramMetadataTest testWithLineage History
12 mins
java.util.concurrent.TimeoutException: CDAP Services are not available. Retried for 600 seconds.
	at io.cdap.cdap.test.IntegrationTestBase.checkServicesWithRetry(IntegrationTestBase.java:265)
	at io.cdap.cdap.test.IntegrationTestBase.checkSystemServices(IntegrationTestBase.java:200)
	at io.cdap.cdap.test.IntegrationTestBase.setUp(IntegrationTestBase.java:97)
	at sun.reflect.GeneratedMethodAccessor2.invoke(Unknown Source)
	at sun.reflect.DelegatingMethodAccessorImpl.invoke(DelegatingMethodAccessorImpl.java:43)
	at java.lang.reflect.Method.invoke(Method.java:498)
	at org.junit.runners.model.FrameworkMethod$1.runReflectiveCall(FrameworkMethod.java:50)
(30 more lines...)
Collapse Failed WorkflowTest test History
12 mins
java.util.concurrent.TimeoutException: CDAP Services are not available. Retried for 600 seconds.
	at io.cdap.cdap.test.IntegrationTestBase.checkServicesWithRetry(IntegrationTestBase.java:265)
	at io.cdap.cdap.test.IntegrationTestBase.checkSystemServices(IntegrationTestBase.java:200)
	at io.cdap.cdap.test.IntegrationTestBase.setUp(IntegrationTestBase.java:97)
	at sun.reflect.GeneratedMethodAccessor2.invoke(Unknown Source)
	at sun.reflect.DelegatingMethodAccessorImpl.invoke(DelegatingMethodAccessorImpl.java:43)
	at java.lang.reflect.Method.invoke(Method.java:498)
	at org.junit.runners.model.FrameworkMethod$1.runReflectiveCall(FrameworkMethod.java:50)
(30 more lines...)
Collapse Failed OperationalStatsTest testCDAPStats History
12 mins
java.util.concurrent.TimeoutException: CDAP Services are not available. Retried for 600 seconds.
	at io.cdap.cdap.test.IntegrationTestBase.checkServicesWithRetry(IntegrationTestBase.java:265)
	at io.cdap.cdap.test.IntegrationTestBase.checkSystemServices(IntegrationTestBase.java:200)
	at io.cdap.cdap.test.IntegrationTestBase.setUp(IntegrationTestBase.java:97)
	at sun.reflect.GeneratedMethodAccessor2.invoke(Unknown Source)
	at sun.reflect.DelegatingMethodAccessorImpl.invoke(DelegatingMethodAccessorImpl.java:43)
	at java.lang.reflect.Method.invoke(Method.java:498)
	at org.junit.runners.model.FrameworkMethod$1.runReflectiveCall(FrameworkMethod.java:50)
(30 more lines...)
Collapse Failed RemoteCubeTest test History
12 mins
java.util.concurrent.TimeoutException: CDAP Services are not available. Retried for 600 seconds.
	at io.cdap.cdap.test.IntegrationTestBase.checkServicesWithRetry(IntegrationTestBase.java:265)
	at io.cdap.cdap.test.IntegrationTestBase.checkSystemServices(IntegrationTestBase.java:200)
	at io.cdap.cdap.test.IntegrationTestBase.setUp(IntegrationTestBase.java:97)
	at sun.reflect.GeneratedMethodAccessor2.invoke(Unknown Source)
	at sun.reflect.DelegatingMethodAccessorImpl.invoke(DelegatingMethodAccessorImpl.java:43)
	at java.lang.reflect.Method.invoke(Method.java:498)
	at org.junit.runners.model.FrameworkMethod$1.runReflectiveCall(FrameworkMethod.java:50)
(30 more lines...)
Collapse Failed RemoteKeyValueTest test History
12 mins
java.util.concurrent.TimeoutException: CDAP Services are not available. Retried for 600 seconds.
	at io.cdap.cdap.test.IntegrationTestBase.checkServicesWithRetry(IntegrationTestBase.java:265)
	at io.cdap.cdap.test.IntegrationTestBase.checkSystemServices(IntegrationTestBase.java:200)
	at io.cdap.cdap.test.IntegrationTestBase.setUp(IntegrationTestBase.java:97)
	at sun.reflect.GeneratedMethodAccessor2.invoke(Unknown Source)
	at sun.reflect.DelegatingMethodAccessorImpl.invoke(DelegatingMethodAccessorImpl.java:43)
	at java.lang.reflect.Method.invoke(Method.java:498)
	at org.junit.runners.model.FrameworkMethod$1.runReflectiveCall(FrameworkMethod.java:50)
(30 more lines...)
Collapse Failed RemoteTableTest test History
12 mins
java.util.concurrent.TimeoutException: CDAP Services are not available. Retried for 600 seconds.
	at io.cdap.cdap.test.IntegrationTestBase.checkServicesWithRetry(IntegrationTestBase.java:265)
	at io.cdap.cdap.test.IntegrationTestBase.checkSystemServices(IntegrationTestBase.java:200)
	at io.cdap.cdap.test.IntegrationTestBase.setUp(IntegrationTestBase.java:97)
	at sun.reflect.GeneratedMethodAccessor2.invoke(Unknown Source)
	at sun.reflect.DelegatingMethodAccessorImpl.invoke(DelegatingMethodAccessorImpl.java:43)
	at java.lang.reflect.Method.invoke(Method.java:498)
	at org.junit.runners.model.FrameworkMethod$1.runReflectiveCall(FrameworkMethod.java:50)
(30 more lines...)

Error summary

The build generated some errors. See the full build log for more details.

Java HotSpot(TM) 64-Bit Server VM warning: ignoring option MaxPermSize=128m; support was removed in 8.0
Warning:  org.apache.xerces.jaxp.SAXParserImpl$JAXPSAXParser: Property 'http://www.oracle.com/xml/jaxp/properties/entityExpansionLimit' is not recognized.
Compiler warnings:
  WARNING:  'org.apache.xerces.jaxp.SAXParserImpl: Property 'http://javax.xml.XMLConstants/property/accessExternalDTD' is not recognized.'
Warning:  org.apache.xerces.parsers.SAXParser: Feature 'http://javax.xml.XMLConstants/feature/secure-processing' is not recognized.
Warning:  org.apache.xerces.parsers.SAXParser: Property 'http://javax.xml.XMLConstants/property/accessExternalDTD' is not recognized.
Warning:  org.apache.xerces.parsers.SAXParser: Property 'http://www.oracle.com/xml/jaxp/properties/entityExpansionLimit' is not recognized.
Warning:  org.apache.xerces.jaxp.SAXParserImpl$JAXPSAXParser: Property 'http://www.oracle.com/xml/jaxp/properties/entityExpansionLimit' is not recognized.
Compiler warnings:
  WARNING:  'org.apache.xerces.jaxp.SAXParserImpl: Property 'http://javax.xml.XMLConstants/property/accessExternalDTD' is not recognized.'
Warning:  org.apache.xerces.parsers.SAXParser: Feature 'http://javax.xml.XMLConstants/feature/secure-processing' is not recognized.
Warning:  org.apache.xerces.parsers.SAXParser: Property 'http://javax.xml.XMLConstants/property/accessExternalDTD' is not recognized.
Warning:  org.apache.xerces.parsers.SAXParser: Property 'http://www.oracle.com/xml/jaxp/properties/entityExpansionLimit' is not recognized.
Warning:  org.apache.xerces.jaxp.SAXParserImpl$JAXPSAXParser: Property 'http://www.oracle.com/xml/jaxp/properties/entityExpansionLimit' is not recognized.
Compiler warnings:
  WARNING:  'org.apache.xerces.jaxp.SAXParserImpl: Property 'http://javax.xml.XMLConstants/property/accessExternalDTD' is not recognized.'
Warning:  org.apache.xerces.parsers.SAXParser: Feature 'http://javax.xml.XMLConstants/feature/secure-processing' is not recognized.
Warning:  org.apache.xerces.parsers.SAXParser: Property 'http://javax.xml.XMLConstants/property/accessExternalDTD' is not recognized.
Warning:  org.apache.xerces.parsers.SAXParser: Property 'http://www.oracle.com/xml/jaxp/properties/entityExpansionLimit' is not recognized.
SLF4J: Class path contains multiple SLF4J bindings.
SLF4J: Found binding in [jar:file:/home/bamboo/.m2/repository/io/cdap/cdap/cdap-cli/6.4.0-SNAPSHOT/cdap-cli-6.4.0-SNAPSHOT.jar!/org/slf4j/impl/StaticLoggerBinder.class]
SLF4J: Found binding in [jar:file:/home/bamboo/.m2/repository/io/cdap/cdap/cdap-explore-jdbc/6.4.0-SNAPSHOT/cdap-explore-jdbc-6.4.0-SNAPSHOT.jar!/org/slf4j/impl/StaticLoggerBinder.class]
SLF4J: Found binding in [jar:file:/home/bamboo/.m2/repository/ch/qos/logback/logback-classic/1.0.9/logback-classic-1.0.9.jar!/org/slf4j/impl/StaticLoggerBinder.class]
SLF4J: See http://www.slf4j.org/codes.html#multiple_bindings for an explanation.
SLF4J: Actual binding is of type [ch.qos.logback.classic.util.ContextSelectorStaticBinder]