Build #425

Build: #425 failed

Job: Distro Tests - CDH 5.4 failed

Test results

  • 44 tests in total
  • 2 tests failed
  • 1 failure is new
  • 1 test was fixed
  • 206 minutes taken in total.

Build 425 has the following 2 errors: 1 new failure(s) occurred since the previous build.

New test failures 1
Status Test Duration
Collapse Failed XMLReaderTest testPatternWithDeleteAction History
7 mins
java.lang.RuntimeException: java.util.concurrent.ExecutionException: java.net.SocketTimeoutException: Read timed out
	at java.net.SocketInputStream.socketRead0(Native Method)
	at java.net.SocketInputStream.socketRead(SocketInputStream.java:116)
	at java.net.SocketInputStream.read(SocketInputStream.java:170)
	at java.net.SocketInputStream.read(SocketInputStream.java:141)
	at java.io.BufferedInputStream.fill(BufferedInputStream.java:246)
	at java.io.BufferedInputStream.read1(BufferedInputStream.java:286)
	at java.io.BufferedInputStream.read(BufferedInputStream.java:345)
(19 more lines...)
Existing test failures 1
Status Test Failing since Duration
java.util.concurrent.TimeoutException: Timeout occurred. Expected true but found false.
	at io.cdap.cdap.common.utils.Tasks.waitFor(Tasks.java:70)
	at io.cdap.cdap.common.utils.Tasks.waitFor(Tasks.java:91)
	at io.cdap.cdap.test.AbstractProgramManager.waitForRuns(AbstractProgramManager.java:109)
	at io.cdap.cdap.test.AbstractProgramManager.startAndWaitForRun(AbstractProgramManager.java:80)
	at io.cdap.cdap.test.AudiTestBase.startAndWaitForRun(AudiTestBase.java:277)
	at io.cdap.cdap.test.AudiTestBase.startAndWaitForRun(AudiTestBase.java:271)
	at io.cdap.cdap.app.etl.batch.BatchJoinerTest.testJoiner(BatchJoinerTest.java:215)
(1 more lines...)