Build #424

Build: #424 failed

Job: Distro Tests - CDH 5.4 failed

Test results

  • 44 tests in total
  • 2 tests failed
  • 1 failure is new
  • 205 minutes taken in total.

Build 424 has the following 2 errors: 1 new failure(s) occurred since the previous build.

New test failures 1
Status Test Duration
Collapse Failed RowDenormalizerTest test History
5 mins
java.lang.RuntimeException: java.io.IOException: Failed to publish profile metadata request for entity id application:default.denormalizerSink.-SNAPSHOT
	at io.cdap.cdap.client.util.RESTClient.upload(RESTClient.java:160)
	at io.cdap.cdap.client.ApplicationClient.deployApp(ApplicationClient.java:449)
	at io.cdap.cdap.client.ApplicationClient.deploy(ApplicationClient.java:377)
	at io.cdap.cdap.client.ApplicationClient.deploy(ApplicationClient.java:353)
	at io.cdap.cdap.test.IntegrationTestManager.deployApplication(IntegrationTestManager.java:180)
	at io.cdap.cdap.test.AudiTestBase.deployServiceForDataset(AudiTestBase.java:293)
	at io.cdap.cdap.test.AudiTestBase.getTableDataset(AudiTestBase.java:235)
(3 more lines...)
Existing test failures 1
Status Test Failing since Duration
java.util.concurrent.TimeoutException: Timeout occurred. Expected true but found false.
	at io.cdap.cdap.common.utils.Tasks.waitFor(Tasks.java:70)
	at io.cdap.cdap.common.utils.Tasks.waitFor(Tasks.java:91)
	at io.cdap.cdap.test.AbstractProgramManager.waitForRuns(AbstractProgramManager.java:109)
	at io.cdap.cdap.test.AbstractProgramManager.startAndWaitForRun(AbstractProgramManager.java:80)
	at io.cdap.cdap.test.AudiTestBase.startAndWaitForRun(AudiTestBase.java:277)
	at io.cdap.cdap.test.AudiTestBase.startAndWaitForRun(AudiTestBase.java:271)
	at io.cdap.cdap.app.etl.batch.BatchJoinerTest.testJoiner(BatchJoinerTest.java:215)
(1 more lines...)