Build #322

Build: #322 failed

Job: Distro Tests - CDH 5.4 failed

Test results

  • 45 tests in total
  • 1 test failed
  • 1 failure is new
  • 1 test was fixed
  • 248 minutes taken in total.

Build 322 has the following 1 errors: 1 new failure(s) occurred since the previous build.

New test failures 1
Status Test Duration
Collapse Failed TPFSAvroSinkSourceTest testTPFSWithProjection History
3 mins
java.lang.RuntimeException: java.util.concurrent.ExecutionException: java.io.IOException: 500: Connection refused (Connection refused)
	at io.cdap.cdap.client.util.RESTClient.execute(RESTClient.java:132)
	at io.cdap.cdap.client.util.RESTClient.execute(RESTClient.java:74)
	at io.cdap.cdap.client.ServiceClient.checkAvailability(ServiceClient.java:129)
	at io.cdap.cdap.test.remote.RemoteServiceManager$1.call(RemoteServiceManager.java:90)
	at io.cdap.cdap.test.remote.RemoteServiceManager$1.call(RemoteServiceManager.java:86)
	at io.cdap.cdap.common.utils.Tasks.waitFor(Tasks.java:58)
	at io.cdap.cdap.common.utils.Tasks.waitFor(Tasks.java:91)
(8 more lines...)