Build #316

Build: #316 failed

Job: Distro Tests - CDH 5.4 failed

Test results

  • 32 tests in total
  • 32 tests failed
  • 32 failures are new
  • < 1 second taken in total.

Build 316 has the following 32 errors: 32 new failure(s) occurred since the previous build.

New test failures 32
Status Test Duration
Collapse Failed KVTableWithProjectionTest initializationError History
< 1 sec
java.lang.SecurityException: Invalid signature file digest for Manifest main attributes
	at sun.security.util.SignatureFileVerifier.processImpl(SignatureFileVerifier.java:284)
	at sun.security.util.SignatureFileVerifier.process(SignatureFileVerifier.java:238)
	at java.util.jar.JarVerifier.processEntry(JarVerifier.java:316)
	at java.util.jar.JarVerifier.update(JarVerifier.java:228)
	at java.util.jar.JarFile.initializeVerifier(JarFile.java:383)
	at java.util.jar.JarFile.getInputStream(JarFile.java:450)
	at sun.misc.URLClassPath$JarLoader$2.getInputStream(URLClassPath.java:940)
(56 more lines...)
Collapse Failed TPFSAvroSinkSourceTest initializationError History
< 1 sec
java.lang.SecurityException: Invalid signature file digest for Manifest main attributes
	at sun.security.util.SignatureFileVerifier.processImpl(SignatureFileVerifier.java:284)
	at sun.security.util.SignatureFileVerifier.process(SignatureFileVerifier.java:238)
	at java.util.jar.JarVerifier.processEntry(JarVerifier.java:316)
	at java.util.jar.JarVerifier.update(JarVerifier.java:228)
	at java.util.jar.JarFile.initializeVerifier(JarFile.java:383)
	at java.util.jar.JarFile.getInputStream(JarFile.java:450)
	at sun.misc.URLClassPath$JarLoader$2.getInputStream(URLClassPath.java:940)
(56 more lines...)
Collapse Failed BatchAggregatorTest initializationError History
< 1 sec
java.lang.SecurityException: Invalid signature file digest for Manifest main attributes
	at sun.security.util.SignatureFileVerifier.processImpl(SignatureFileVerifier.java:284)
	at sun.security.util.SignatureFileVerifier.process(SignatureFileVerifier.java:238)
	at java.util.jar.JarVerifier.processEntry(JarVerifier.java:316)
	at java.util.jar.JarVerifier.update(JarVerifier.java:228)
	at java.util.jar.JarFile.initializeVerifier(JarFile.java:383)
	at java.util.jar.JarFile.getInputStream(JarFile.java:450)
	at sun.misc.URLClassPath$JarLoader$2.getInputStream(URLClassPath.java:940)
(56 more lines...)
Collapse Failed BatchCubeSinkTest initializationError History
< 1 sec
java.lang.SecurityException: Invalid signature file digest for Manifest main attributes
	at sun.security.util.SignatureFileVerifier.processImpl(SignatureFileVerifier.java:284)
	at sun.security.util.SignatureFileVerifier.process(SignatureFileVerifier.java:238)
	at java.util.jar.JarVerifier.processEntry(JarVerifier.java:316)
	at java.util.jar.JarVerifier.update(JarVerifier.java:228)
	at java.util.jar.JarFile.initializeVerifier(JarFile.java:383)
	at java.util.jar.JarFile.getInputStream(JarFile.java:450)
	at sun.misc.URLClassPath$JarLoader$2.getInputStream(URLClassPath.java:940)
(56 more lines...)
Collapse Failed BatchJoinerTest initializationError History
< 1 sec
java.lang.SecurityException: Invalid signature file digest for Manifest main attributes
	at sun.security.util.SignatureFileVerifier.processImpl(SignatureFileVerifier.java:284)
	at sun.security.util.SignatureFileVerifier.process(SignatureFileVerifier.java:238)
	at java.util.jar.JarVerifier.processEntry(JarVerifier.java:316)
	at java.util.jar.JarVerifier.update(JarVerifier.java:228)
	at java.util.jar.JarFile.initializeVerifier(JarFile.java:383)
	at java.util.jar.JarFile.getInputStream(JarFile.java:450)
	at sun.misc.URLClassPath$JarLoader$2.getInputStream(URLClassPath.java:940)
(56 more lines...)
Collapse Failed ETLMapReduceTest initializationError History
< 1 sec
java.lang.SecurityException: Invalid signature file digest for Manifest main attributes
	at sun.security.util.SignatureFileVerifier.processImpl(SignatureFileVerifier.java:284)
	at sun.security.util.SignatureFileVerifier.process(SignatureFileVerifier.java:238)
	at java.util.jar.JarVerifier.processEntry(JarVerifier.java:316)
	at java.util.jar.JarVerifier.update(JarVerifier.java:228)
	at java.util.jar.JarFile.initializeVerifier(JarFile.java:383)
	at java.util.jar.JarFile.getInputStream(JarFile.java:450)
	at sun.misc.URLClassPath$JarLoader$2.getInputStream(URLClassPath.java:940)
(56 more lines...)
Collapse Failed ExcelInputReaderTest initializationError History
< 1 sec
java.lang.SecurityException: Invalid signature file digest for Manifest main attributes
	at sun.security.util.SignatureFileVerifier.processImpl(SignatureFileVerifier.java:284)
	at sun.security.util.SignatureFileVerifier.process(SignatureFileVerifier.java:238)
	at java.util.jar.JarVerifier.processEntry(JarVerifier.java:316)
	at java.util.jar.JarVerifier.update(JarVerifier.java:228)
	at java.util.jar.JarFile.initializeVerifier(JarFile.java:383)
	at java.util.jar.JarFile.getInputStream(JarFile.java:450)
	at sun.misc.URLClassPath$JarLoader$2.getInputStream(URLClassPath.java:940)
(56 more lines...)
Collapse Failed HivePluginTest initializationError History
< 1 sec
java.lang.SecurityException: Invalid signature file digest for Manifest main attributes
	at sun.security.util.SignatureFileVerifier.processImpl(SignatureFileVerifier.java:284)
	at sun.security.util.SignatureFileVerifier.process(SignatureFileVerifier.java:238)
	at java.util.jar.JarVerifier.processEntry(JarVerifier.java:316)
	at java.util.jar.JarVerifier.update(JarVerifier.java:228)
	at java.util.jar.JarFile.initializeVerifier(JarFile.java:383)
	at java.util.jar.JarFile.getInputStream(JarFile.java:450)
	at sun.misc.URLClassPath$JarLoader$2.getInputStream(URLClassPath.java:940)
(56 more lines...)
Collapse Failed NormalizeTest initializationError History
< 1 sec
java.lang.SecurityException: Invalid signature file digest for Manifest main attributes
	at sun.security.util.SignatureFileVerifier.processImpl(SignatureFileVerifier.java:284)
	at sun.security.util.SignatureFileVerifier.process(SignatureFileVerifier.java:238)
	at java.util.jar.JarVerifier.processEntry(JarVerifier.java:316)
	at java.util.jar.JarVerifier.update(JarVerifier.java:228)
	at java.util.jar.JarFile.initializeVerifier(JarFile.java:383)
	at java.util.jar.JarFile.getInputStream(JarFile.java:450)
	at sun.misc.URLClassPath$JarLoader$2.getInputStream(URLClassPath.java:940)
(56 more lines...)
Collapse Failed RowDenormalizerTest initializationError History
< 1 sec
java.lang.SecurityException: Invalid signature file digest for Manifest main attributes
	at sun.security.util.SignatureFileVerifier.processImpl(SignatureFileVerifier.java:284)
	at sun.security.util.SignatureFileVerifier.process(SignatureFileVerifier.java:238)
	at java.util.jar.JarVerifier.processEntry(JarVerifier.java:316)
	at java.util.jar.JarVerifier.update(JarVerifier.java:228)
	at java.util.jar.JarFile.initializeVerifier(JarFile.java:383)
	at java.util.jar.JarFile.getInputStream(JarFile.java:450)
	at sun.misc.URLClassPath$JarLoader$2.getInputStream(URLClassPath.java:940)
(56 more lines...)
Collapse Failed TPFSParquetSinkSourceTest initializationError History
< 1 sec
java.lang.SecurityException: Invalid signature file digest for Manifest main attributes
	at sun.security.util.SignatureFileVerifier.processImpl(SignatureFileVerifier.java:284)
	at sun.security.util.SignatureFileVerifier.process(SignatureFileVerifier.java:238)
	at java.util.jar.JarVerifier.processEntry(JarVerifier.java:316)
	at java.util.jar.JarVerifier.update(JarVerifier.java:228)
	at java.util.jar.JarFile.initializeVerifier(JarFile.java:383)
	at java.util.jar.JarFile.getInputStream(JarFile.java:450)
	at sun.misc.URLClassPath$JarLoader$2.getInputStream(URLClassPath.java:940)
(56 more lines...)
Collapse Failed ValueMapperTest initializationError History
< 1 sec
java.lang.SecurityException: Invalid signature file digest for Manifest main attributes
	at sun.security.util.SignatureFileVerifier.processImpl(SignatureFileVerifier.java:284)
	at sun.security.util.SignatureFileVerifier.process(SignatureFileVerifier.java:238)
	at java.util.jar.JarVerifier.processEntry(JarVerifier.java:316)
	at java.util.jar.JarVerifier.update(JarVerifier.java:228)
	at java.util.jar.JarFile.initializeVerifier(JarFile.java:383)
	at java.util.jar.JarFile.getInputStream(JarFile.java:450)
	at sun.misc.URLClassPath$JarLoader$2.getInputStream(URLClassPath.java:940)
(56 more lines...)
Collapse Failed XMLReaderTest initializationError History
< 1 sec
java.lang.SecurityException: Invalid signature file digest for Manifest main attributes
	at sun.security.util.SignatureFileVerifier.processImpl(SignatureFileVerifier.java:284)
	at sun.security.util.SignatureFileVerifier.process(SignatureFileVerifier.java:238)
	at java.util.jar.JarVerifier.processEntry(JarVerifier.java:316)
	at java.util.jar.JarVerifier.update(JarVerifier.java:228)
	at java.util.jar.JarFile.initializeVerifier(JarFile.java:383)
	at java.util.jar.JarFile.getInputStream(JarFile.java:450)
	at sun.misc.URLClassPath$JarLoader$2.getInputStream(URLClassPath.java:940)
(56 more lines...)
Collapse Failed DataStreamsTest initializationError History
< 1 sec
java.lang.SecurityException: Invalid signature file digest for Manifest main attributes
	at sun.security.util.SignatureFileVerifier.processImpl(SignatureFileVerifier.java:284)
	at sun.security.util.SignatureFileVerifier.process(SignatureFileVerifier.java:238)
	at java.util.jar.JarVerifier.processEntry(JarVerifier.java:316)
	at java.util.jar.JarVerifier.update(JarVerifier.java:228)
	at java.util.jar.JarFile.initializeVerifier(JarFile.java:383)
	at java.util.jar.JarFile.getInputStream(JarFile.java:450)
	at sun.misc.URLClassPath$JarLoader$2.getInputStream(URLClassPath.java:940)
(56 more lines...)
Collapse Failed WranglerServiceTest initializationError History
< 1 sec
java.lang.SecurityException: Invalid signature file digest for Manifest main attributes
	at sun.security.util.SignatureFileVerifier.processImpl(SignatureFileVerifier.java:284)
	at sun.security.util.SignatureFileVerifier.process(SignatureFileVerifier.java:238)
	at java.util.jar.JarVerifier.processEntry(JarVerifier.java:316)
	at java.util.jar.JarVerifier.update(JarVerifier.java:228)
	at java.util.jar.JarFile.initializeVerifier(JarFile.java:383)
	at java.util.jar.JarFile.getInputStream(JarFile.java:450)
	at sun.misc.URLClassPath$JarLoader$2.getInputStream(URLClassPath.java:940)
(56 more lines...)
Collapse Failed WranglerTest initializationError History
< 1 sec
java.lang.SecurityException: Invalid signature file digest for Manifest main attributes
	at sun.security.util.SignatureFileVerifier.processImpl(SignatureFileVerifier.java:284)
	at sun.security.util.SignatureFileVerifier.process(SignatureFileVerifier.java:238)
	at java.util.jar.JarVerifier.processEntry(JarVerifier.java:316)
	at java.util.jar.JarVerifier.update(JarVerifier.java:228)
	at java.util.jar.JarFile.initializeVerifier(JarFile.java:383)
	at java.util.jar.JarFile.getInputStream(JarFile.java:450)
	at sun.misc.URLClassPath$JarLoader$2.getInputStream(URLClassPath.java:940)
(56 more lines...)
Collapse Failed PermissionTest initializationError History
< 1 sec
java.lang.SecurityException: Invalid signature file digest for Manifest main attributes
	at sun.security.util.SignatureFileVerifier.processImpl(SignatureFileVerifier.java:284)
	at sun.security.util.SignatureFileVerifier.process(SignatureFileVerifier.java:238)
	at java.util.jar.JarVerifier.processEntry(JarVerifier.java:316)
	at java.util.jar.JarVerifier.update(JarVerifier.java:228)
	at java.util.jar.JarFile.initializeVerifier(JarFile.java:383)
	at java.util.jar.JarFile.getInputStream(JarFile.java:450)
	at sun.misc.URLClassPath$JarLoader$2.getInputStream(URLClassPath.java:940)
(56 more lines...)
Collapse Failed ReadlessIncrementTest initializationError History
< 1 sec
java.lang.SecurityException: Invalid signature file digest for Manifest main attributes
	at sun.security.util.SignatureFileVerifier.processImpl(SignatureFileVerifier.java:284)
	at sun.security.util.SignatureFileVerifier.process(SignatureFileVerifier.java:238)
	at java.util.jar.JarVerifier.processEntry(JarVerifier.java:316)
	at java.util.jar.JarVerifier.update(JarVerifier.java:228)
	at java.util.jar.JarFile.initializeVerifier(JarFile.java:383)
	at java.util.jar.JarFile.getInputStream(JarFile.java:450)
	at sun.misc.URLClassPath$JarLoader$2.getInputStream(URLClassPath.java:940)
(56 more lines...)
Collapse Failed HangingWorkerTest initializationError History
< 1 sec
java.lang.SecurityException: Invalid signature file digest for Manifest main attributes
	at sun.security.util.SignatureFileVerifier.processImpl(SignatureFileVerifier.java:284)
	at sun.security.util.SignatureFileVerifier.process(SignatureFileVerifier.java:238)
	at java.util.jar.JarVerifier.processEntry(JarVerifier.java:316)
	at java.util.jar.JarVerifier.update(JarVerifier.java:228)
	at java.util.jar.JarFile.initializeVerifier(JarFile.java:383)
	at java.util.jar.JarFile.getInputStream(JarFile.java:450)
	at sun.misc.URLClassPath$JarLoader$2.getInputStream(URLClassPath.java:940)
(56 more lines...)
Collapse Failed ServiceWorkerTest initializationError History
< 1 sec
java.lang.SecurityException: Invalid signature file digest for Manifest main attributes
	at sun.security.util.SignatureFileVerifier.processImpl(SignatureFileVerifier.java:284)
	at sun.security.util.SignatureFileVerifier.process(SignatureFileVerifier.java:238)
	at java.util.jar.JarVerifier.processEntry(JarVerifier.java:316)
	at java.util.jar.JarVerifier.update(JarVerifier.java:228)
	at java.util.jar.JarFile.initializeVerifier(JarFile.java:383)
	at java.util.jar.JarFile.getInputStream(JarFile.java:450)
	at sun.misc.URLClassPath$JarLoader$2.getInputStream(URLClassPath.java:940)
(56 more lines...)
Collapse Failed ApplicationTest initializationError History
< 1 sec
java.lang.SecurityException: Invalid signature file digest for Manifest main attributes
	at sun.security.util.SignatureFileVerifier.processImpl(SignatureFileVerifier.java:284)
	at sun.security.util.SignatureFileVerifier.process(SignatureFileVerifier.java:238)
	at java.util.jar.JarVerifier.processEntry(JarVerifier.java:316)
	at java.util.jar.JarVerifier.update(JarVerifier.java:228)
	at java.util.jar.JarFile.initializeVerifier(JarFile.java:383)
	at java.util.jar.JarFile.getInputStream(JarFile.java:450)
	at sun.misc.URLClassPath$JarLoader$2.getInputStream(URLClassPath.java:940)
(56 more lines...)
Collapse Failed NamespaceTest initializationError History
< 1 sec
java.lang.SecurityException: Invalid signature file digest for Manifest main attributes
	at sun.security.util.SignatureFileVerifier.processImpl(SignatureFileVerifier.java:284)
	at sun.security.util.SignatureFileVerifier.process(SignatureFileVerifier.java:238)
	at java.util.jar.JarVerifier.processEntry(JarVerifier.java:316)
	at java.util.jar.JarVerifier.update(JarVerifier.java:228)
	at java.util.jar.JarFile.initializeVerifier(JarFile.java:383)
	at java.util.jar.JarFile.getInputStream(JarFile.java:450)
	at sun.misc.URLClassPath$JarLoader$2.getInputStream(URLClassPath.java:940)
(56 more lines...)
Collapse Failed DatasetTest initializationError History
< 1 sec
java.lang.SecurityException: Invalid signature file digest for Manifest main attributes
	at sun.security.util.SignatureFileVerifier.processImpl(SignatureFileVerifier.java:284)
	at sun.security.util.SignatureFileVerifier.process(SignatureFileVerifier.java:238)
	at java.util.jar.JarVerifier.processEntry(JarVerifier.java:316)
	at java.util.jar.JarVerifier.update(JarVerifier.java:228)
	at java.util.jar.JarFile.initializeVerifier(JarFile.java:383)
	at java.util.jar.JarFile.getInputStream(JarFile.java:450)
	at sun.misc.URLClassPath$JarLoader$2.getInputStream(URLClassPath.java:940)
(56 more lines...)
Collapse Failed FileSetTest initializationError History
< 1 sec
java.lang.SecurityException: Invalid signature file digest for Manifest main attributes
	at sun.security.util.SignatureFileVerifier.processImpl(SignatureFileVerifier.java:284)
	at sun.security.util.SignatureFileVerifier.process(SignatureFileVerifier.java:238)
	at java.util.jar.JarVerifier.processEntry(JarVerifier.java:316)
	at java.util.jar.JarVerifier.update(JarVerifier.java:228)
	at java.util.jar.JarFile.initializeVerifier(JarFile.java:383)
	at java.util.jar.JarFile.getInputStream(JarFile.java:450)
	at sun.misc.URLClassPath$JarLoader$2.getInputStream(URLClassPath.java:940)
(56 more lines...)
Collapse Failed PartitionCorrectorTest initializationError History
< 1 sec
java.lang.SecurityException: Invalid signature file digest for Manifest main attributes
	at sun.security.util.SignatureFileVerifier.processImpl(SignatureFileVerifier.java:284)
	at sun.security.util.SignatureFileVerifier.process(SignatureFileVerifier.java:238)
	at java.util.jar.JarVerifier.processEntry(JarVerifier.java:316)
	at java.util.jar.JarVerifier.update(JarVerifier.java:228)
	at java.util.jar.JarFile.initializeVerifier(JarFile.java:383)
	at java.util.jar.JarFile.getInputStream(JarFile.java:450)
	at sun.misc.URLClassPath$JarLoader$2.getInputStream(URLClassPath.java:940)
(56 more lines...)
Collapse Failed PartitionedFileSetUpdateTest initializationError History
< 1 sec
java.lang.SecurityException: Invalid signature file digest for Manifest main attributes
	at sun.security.util.SignatureFileVerifier.processImpl(SignatureFileVerifier.java:284)
	at sun.security.util.SignatureFileVerifier.process(SignatureFileVerifier.java:238)
	at java.util.jar.JarVerifier.processEntry(JarVerifier.java:316)
	at java.util.jar.JarVerifier.update(JarVerifier.java:228)
	at java.util.jar.JarFile.initializeVerifier(JarFile.java:383)
	at java.util.jar.JarFile.getInputStream(JarFile.java:450)
	at sun.misc.URLClassPath$JarLoader$2.getInputStream(URLClassPath.java:940)
(56 more lines...)
Collapse Failed ProgramMetadataTest initializationError History
< 1 sec
java.lang.SecurityException: Invalid signature file digest for Manifest main attributes
	at sun.security.util.SignatureFileVerifier.processImpl(SignatureFileVerifier.java:284)
	at sun.security.util.SignatureFileVerifier.process(SignatureFileVerifier.java:238)
	at java.util.jar.JarVerifier.processEntry(JarVerifier.java:316)
	at java.util.jar.JarVerifier.update(JarVerifier.java:228)
	at java.util.jar.JarFile.initializeVerifier(JarFile.java:383)
	at java.util.jar.JarFile.getInputStream(JarFile.java:450)
	at sun.misc.URLClassPath$JarLoader$2.getInputStream(URLClassPath.java:940)
(56 more lines...)
Collapse Failed WorkflowTest initializationError History
< 1 sec
java.lang.SecurityException: Invalid signature file digest for Manifest main attributes
	at sun.security.util.SignatureFileVerifier.processImpl(SignatureFileVerifier.java:284)
	at sun.security.util.SignatureFileVerifier.process(SignatureFileVerifier.java:238)
	at java.util.jar.JarVerifier.processEntry(JarVerifier.java:316)
	at java.util.jar.JarVerifier.update(JarVerifier.java:228)
	at java.util.jar.JarFile.initializeVerifier(JarFile.java:383)
	at java.util.jar.JarFile.getInputStream(JarFile.java:450)
	at sun.misc.URLClassPath$JarLoader$2.getInputStream(URLClassPath.java:940)
(56 more lines...)
Collapse Failed OperationalStatsTest initializationError History
< 1 sec
java.lang.SecurityException: Invalid signature file digest for Manifest main attributes
	at sun.security.util.SignatureFileVerifier.processImpl(SignatureFileVerifier.java:284)
	at sun.security.util.SignatureFileVerifier.process(SignatureFileVerifier.java:238)
	at java.util.jar.JarVerifier.processEntry(JarVerifier.java:316)
	at java.util.jar.JarVerifier.update(JarVerifier.java:228)
	at java.util.jar.JarFile.initializeVerifier(JarFile.java:383)
	at java.util.jar.JarFile.getInputStream(JarFile.java:450)
	at sun.misc.URLClassPath$JarLoader$2.getInputStream(URLClassPath.java:940)
(56 more lines...)
Collapse Failed RemoteCubeTest initializationError History
< 1 sec
java.lang.SecurityException: Invalid signature file digest for Manifest main attributes
	at sun.security.util.SignatureFileVerifier.processImpl(SignatureFileVerifier.java:284)
	at sun.security.util.SignatureFileVerifier.process(SignatureFileVerifier.java:238)
	at java.util.jar.JarVerifier.processEntry(JarVerifier.java:316)
	at java.util.jar.JarVerifier.update(JarVerifier.java:228)
	at java.util.jar.JarFile.initializeVerifier(JarFile.java:383)
	at java.util.jar.JarFile.getInputStream(JarFile.java:450)
	at sun.misc.URLClassPath$JarLoader$2.getInputStream(URLClassPath.java:940)
(56 more lines...)
Collapse Failed RemoteKeyValueTest initializationError History
< 1 sec
java.lang.SecurityException: Invalid signature file digest for Manifest main attributes
	at sun.security.util.SignatureFileVerifier.processImpl(SignatureFileVerifier.java:284)
	at sun.security.util.SignatureFileVerifier.process(SignatureFileVerifier.java:238)
	at java.util.jar.JarVerifier.processEntry(JarVerifier.java:316)
	at java.util.jar.JarVerifier.update(JarVerifier.java:228)
	at java.util.jar.JarFile.initializeVerifier(JarFile.java:383)
	at java.util.jar.JarFile.getInputStream(JarFile.java:450)
	at sun.misc.URLClassPath$JarLoader$2.getInputStream(URLClassPath.java:940)
(56 more lines...)
Collapse Failed RemoteTableTest initializationError History
< 1 sec
java.lang.SecurityException: Invalid signature file digest for Manifest main attributes
	at sun.security.util.SignatureFileVerifier.processImpl(SignatureFileVerifier.java:284)
	at sun.security.util.SignatureFileVerifier.process(SignatureFileVerifier.java:238)
	at java.util.jar.JarVerifier.processEntry(JarVerifier.java:316)
	at java.util.jar.JarVerifier.update(JarVerifier.java:228)
	at java.util.jar.JarFile.initializeVerifier(JarFile.java:383)
	at java.util.jar.JarFile.getInputStream(JarFile.java:450)
	at sun.misc.URLClassPath$JarLoader$2.getInputStream(URLClassPath.java:940)
(56 more lines...)