Build #315

Build: #315 failed

Job: Distro Tests - CDH 5.4 failed

Job result summary

Completed
Duration
524 minutes
Agent
bamboo-agent18
Revision
0ff7d962a4c4f954a2f17dbc4feb2a2277d137d1 0ff7d962a4c4f954a2f17dbc4feb2a2277d137d1
Total tests
45
Failing since
#314 (Scheduled – )
Fixed in
#319 (Manual run by Terence Yim)

Tests

  • 45 tests in total
  • 45 tests failed
  • 451 minutes taken in total.
Existing test failures 45
Status Test Failing since Duration
java.util.concurrent.TimeoutException: Unable to connect to Authentication service to obtain access token, Connection info : CLIConnectionConfig{hostname=10.210.0.27, port=11015, sslEnabled=false}
	at io.cdap.cdap.test.IntegrationTestBase.checkServicesWithRetry(IntegrationTestBase.java:265)
	at io.cdap.cdap.test.IntegrationTestBase.fetchAccessToken(IntegrationTestBase.java:233)
	at io.cdap.cdap.test.IntegrationTestBase.fetchAccessToken(IntegrationTestBase.java:218)
	at io.cdap.cdap.test.IntegrationTestBase.checkSystemServices(IntegrationTestBase.java:196)
	at io.cdap.cdap.test.IntegrationTestBase.setUp(IntegrationTestBase.java:97)
	at sun.reflect.GeneratedMethodAccessor1.invoke(Unknown Source)
	at sun.reflect.DelegatingMethodAccessorImpl.invoke(DelegatingMethodAccessorImpl.java:43)
(40 more lines...)
java.util.concurrent.TimeoutException: Unable to connect to Authentication service to obtain access token, Connection info : CLIConnectionConfig{hostname=10.210.0.27, port=11015, sslEnabled=false}
	at io.cdap.cdap.test.IntegrationTestBase.checkServicesWithRetry(IntegrationTestBase.java:265)
	at io.cdap.cdap.test.IntegrationTestBase.fetchAccessToken(IntegrationTestBase.java:233)
	at io.cdap.cdap.test.IntegrationTestBase.fetchAccessToken(IntegrationTestBase.java:218)
	at io.cdap.cdap.test.IntegrationTestBase.checkSystemServices(IntegrationTestBase.java:196)
	at io.cdap.cdap.test.IntegrationTestBase.setUp(IntegrationTestBase.java:97)
	at sun.reflect.GeneratedMethodAccessor1.invoke(Unknown Source)
	at sun.reflect.DelegatingMethodAccessorImpl.invoke(DelegatingMethodAccessorImpl.java:43)
(40 more lines...)
java.util.concurrent.TimeoutException: Unable to connect to Authentication service to obtain access token, Connection info : CLIConnectionConfig{hostname=10.210.0.27, port=11015, sslEnabled=false}
	at io.cdap.cdap.test.IntegrationTestBase.checkServicesWithRetry(IntegrationTestBase.java:265)
	at io.cdap.cdap.test.IntegrationTestBase.fetchAccessToken(IntegrationTestBase.java:233)
	at io.cdap.cdap.test.IntegrationTestBase.fetchAccessToken(IntegrationTestBase.java:218)
	at io.cdap.cdap.test.IntegrationTestBase.checkSystemServices(IntegrationTestBase.java:196)
	at io.cdap.cdap.test.IntegrationTestBase.setUp(IntegrationTestBase.java:97)
	at sun.reflect.NativeMethodAccessorImpl.invoke0(Native Method)
	at sun.reflect.NativeMethodAccessorImpl.invoke(NativeMethodAccessorImpl.java:62)
(41 more lines...)
java.util.concurrent.TimeoutException: Unable to connect to Authentication service to obtain access token, Connection info : CLIConnectionConfig{hostname=10.210.0.27, port=11015, sslEnabled=false}
	at io.cdap.cdap.test.IntegrationTestBase.checkServicesWithRetry(IntegrationTestBase.java:265)
	at io.cdap.cdap.test.IntegrationTestBase.fetchAccessToken(IntegrationTestBase.java:233)
	at io.cdap.cdap.test.IntegrationTestBase.fetchAccessToken(IntegrationTestBase.java:218)
	at io.cdap.cdap.test.IntegrationTestBase.checkSystemServices(IntegrationTestBase.java:196)
	at io.cdap.cdap.test.IntegrationTestBase.setUp(IntegrationTestBase.java:97)
	at sun.reflect.NativeMethodAccessorImpl.invoke0(Native Method)
	at sun.reflect.NativeMethodAccessorImpl.invoke(NativeMethodAccessorImpl.java:62)
(41 more lines...)
java.util.concurrent.TimeoutException: Unable to connect to Authentication service to obtain access token, Connection info : CLIConnectionConfig{hostname=10.210.0.27, port=11015, sslEnabled=false}
	at io.cdap.cdap.test.IntegrationTestBase.checkServicesWithRetry(IntegrationTestBase.java:265)
	at io.cdap.cdap.test.IntegrationTestBase.fetchAccessToken(IntegrationTestBase.java:233)
	at io.cdap.cdap.test.IntegrationTestBase.fetchAccessToken(IntegrationTestBase.java:218)
	at io.cdap.cdap.test.IntegrationTestBase.checkSystemServices(IntegrationTestBase.java:196)
	at io.cdap.cdap.test.IntegrationTestBase.setUp(IntegrationTestBase.java:97)
	at sun.reflect.NativeMethodAccessorImpl.invoke0(Native Method)
	at sun.reflect.NativeMethodAccessorImpl.invoke(NativeMethodAccessorImpl.java:62)
(41 more lines...)
java.util.concurrent.TimeoutException: Unable to connect to Authentication service to obtain access token, Connection info : CLIConnectionConfig{hostname=10.210.0.27, port=11015, sslEnabled=false}
	at io.cdap.cdap.test.IntegrationTestBase.checkServicesWithRetry(IntegrationTestBase.java:265)
	at io.cdap.cdap.test.IntegrationTestBase.fetchAccessToken(IntegrationTestBase.java:233)
	at io.cdap.cdap.test.IntegrationTestBase.fetchAccessToken(IntegrationTestBase.java:218)
	at io.cdap.cdap.test.IntegrationTestBase.checkSystemServices(IntegrationTestBase.java:196)
	at io.cdap.cdap.test.IntegrationTestBase.setUp(IntegrationTestBase.java:97)
	at sun.reflect.NativeMethodAccessorImpl.invoke0(Native Method)
	at sun.reflect.NativeMethodAccessorImpl.invoke(NativeMethodAccessorImpl.java:62)
(41 more lines...)
java.util.concurrent.TimeoutException: Unable to connect to Authentication service to obtain access token, Connection info : CLIConnectionConfig{hostname=10.210.0.27, port=11015, sslEnabled=false}
	at io.cdap.cdap.test.IntegrationTestBase.checkServicesWithRetry(IntegrationTestBase.java:265)
	at io.cdap.cdap.test.IntegrationTestBase.fetchAccessToken(IntegrationTestBase.java:233)
	at io.cdap.cdap.test.IntegrationTestBase.fetchAccessToken(IntegrationTestBase.java:218)
	at io.cdap.cdap.test.IntegrationTestBase.checkSystemServices(IntegrationTestBase.java:196)
	at io.cdap.cdap.test.IntegrationTestBase.setUp(IntegrationTestBase.java:97)
	at sun.reflect.NativeMethodAccessorImpl.invoke0(Native Method)
	at sun.reflect.NativeMethodAccessorImpl.invoke(NativeMethodAccessorImpl.java:62)
(41 more lines...)
java.util.concurrent.TimeoutException: Unable to connect to Authentication service to obtain access token, Connection info : CLIConnectionConfig{hostname=10.210.0.27, port=11015, sslEnabled=false}
	at io.cdap.cdap.test.IntegrationTestBase.checkServicesWithRetry(IntegrationTestBase.java:265)
	at io.cdap.cdap.test.IntegrationTestBase.fetchAccessToken(IntegrationTestBase.java:233)
	at io.cdap.cdap.test.IntegrationTestBase.fetchAccessToken(IntegrationTestBase.java:218)
	at io.cdap.cdap.test.IntegrationTestBase.checkSystemServices(IntegrationTestBase.java:196)
	at io.cdap.cdap.test.IntegrationTestBase.setUp(IntegrationTestBase.java:97)
	at sun.reflect.NativeMethodAccessorImpl.invoke0(Native Method)
	at sun.reflect.NativeMethodAccessorImpl.invoke(NativeMethodAccessorImpl.java:62)
(41 more lines...)
java.util.concurrent.TimeoutException: Unable to connect to Authentication service to obtain access token, Connection info : CLIConnectionConfig{hostname=10.210.0.27, port=11015, sslEnabled=false}
	at io.cdap.cdap.test.IntegrationTestBase.checkServicesWithRetry(IntegrationTestBase.java:265)
	at io.cdap.cdap.test.IntegrationTestBase.fetchAccessToken(IntegrationTestBase.java:233)
	at io.cdap.cdap.test.IntegrationTestBase.fetchAccessToken(IntegrationTestBase.java:218)
	at io.cdap.cdap.test.IntegrationTestBase.checkSystemServices(IntegrationTestBase.java:196)
	at io.cdap.cdap.test.IntegrationTestBase.setUp(IntegrationTestBase.java:97)
	at sun.reflect.NativeMethodAccessorImpl.invoke0(Native Method)
	at sun.reflect.NativeMethodAccessorImpl.invoke(NativeMethodAccessorImpl.java:62)
(41 more lines...)
java.util.concurrent.TimeoutException: Unable to connect to Authentication service to obtain access token, Connection info : CLIConnectionConfig{hostname=10.210.0.27, port=11015, sslEnabled=false}
	at io.cdap.cdap.test.IntegrationTestBase.checkServicesWithRetry(IntegrationTestBase.java:265)
	at io.cdap.cdap.test.IntegrationTestBase.fetchAccessToken(IntegrationTestBase.java:233)
	at io.cdap.cdap.test.IntegrationTestBase.fetchAccessToken(IntegrationTestBase.java:218)
	at io.cdap.cdap.test.IntegrationTestBase.checkSystemServices(IntegrationTestBase.java:196)
	at io.cdap.cdap.test.IntegrationTestBase.setUp(IntegrationTestBase.java:97)
	at sun.reflect.NativeMethodAccessorImpl.invoke0(Native Method)
	at sun.reflect.NativeMethodAccessorImpl.invoke(NativeMethodAccessorImpl.java:62)
(41 more lines...)
java.util.concurrent.TimeoutException: Unable to connect to Authentication service to obtain access token, Connection info : CLIConnectionConfig{hostname=10.210.0.27, port=11015, sslEnabled=false}
	at io.cdap.cdap.test.IntegrationTestBase.checkServicesWithRetry(IntegrationTestBase.java:265)
	at io.cdap.cdap.test.IntegrationTestBase.fetchAccessToken(IntegrationTestBase.java:233)
	at io.cdap.cdap.test.IntegrationTestBase.fetchAccessToken(IntegrationTestBase.java:218)
	at io.cdap.cdap.test.IntegrationTestBase.checkSystemServices(IntegrationTestBase.java:196)
	at io.cdap.cdap.test.IntegrationTestBase.setUp(IntegrationTestBase.java:97)
	at sun.reflect.NativeMethodAccessorImpl.invoke0(Native Method)
	at sun.reflect.NativeMethodAccessorImpl.invoke(NativeMethodAccessorImpl.java:62)
(41 more lines...)
java.util.concurrent.TimeoutException: Unable to connect to Authentication service to obtain access token, Connection info : CLIConnectionConfig{hostname=10.210.0.27, port=11015, sslEnabled=false}
	at io.cdap.cdap.test.IntegrationTestBase.checkServicesWithRetry(IntegrationTestBase.java:265)
	at io.cdap.cdap.test.IntegrationTestBase.fetchAccessToken(IntegrationTestBase.java:233)
	at io.cdap.cdap.test.IntegrationTestBase.fetchAccessToken(IntegrationTestBase.java:218)
	at io.cdap.cdap.test.IntegrationTestBase.checkSystemServices(IntegrationTestBase.java:196)
	at io.cdap.cdap.test.IntegrationTestBase.setUp(IntegrationTestBase.java:97)
	at sun.reflect.NativeMethodAccessorImpl.invoke0(Native Method)
	at sun.reflect.NativeMethodAccessorImpl.invoke(NativeMethodAccessorImpl.java:62)
(41 more lines...)
java.util.concurrent.TimeoutException: Unable to connect to Authentication service to obtain access token, Connection info : CLIConnectionConfig{hostname=10.210.0.27, port=11015, sslEnabled=false}
	at io.cdap.cdap.test.IntegrationTestBase.checkServicesWithRetry(IntegrationTestBase.java:265)
	at io.cdap.cdap.test.IntegrationTestBase.fetchAccessToken(IntegrationTestBase.java:233)
	at io.cdap.cdap.test.IntegrationTestBase.fetchAccessToken(IntegrationTestBase.java:218)
	at io.cdap.cdap.test.IntegrationTestBase.checkSystemServices(IntegrationTestBase.java:196)
	at io.cdap.cdap.test.IntegrationTestBase.setUp(IntegrationTestBase.java:97)
	at sun.reflect.NativeMethodAccessorImpl.invoke0(Native Method)
	at sun.reflect.NativeMethodAccessorImpl.invoke(NativeMethodAccessorImpl.java:62)
(41 more lines...)
java.util.concurrent.TimeoutException: Unable to connect to Authentication service to obtain access token, Connection info : CLIConnectionConfig{hostname=10.210.0.27, port=11015, sslEnabled=false}
	at io.cdap.cdap.test.IntegrationTestBase.checkServicesWithRetry(IntegrationTestBase.java:265)
	at io.cdap.cdap.test.IntegrationTestBase.fetchAccessToken(IntegrationTestBase.java:233)
	at io.cdap.cdap.test.IntegrationTestBase.fetchAccessToken(IntegrationTestBase.java:218)
	at io.cdap.cdap.test.IntegrationTestBase.checkSystemServices(IntegrationTestBase.java:196)
	at io.cdap.cdap.test.IntegrationTestBase.setUp(IntegrationTestBase.java:97)
	at sun.reflect.NativeMethodAccessorImpl.invoke0(Native Method)
	at sun.reflect.NativeMethodAccessorImpl.invoke(NativeMethodAccessorImpl.java:62)
(41 more lines...)
java.util.concurrent.TimeoutException: Unable to connect to Authentication service to obtain access token, Connection info : CLIConnectionConfig{hostname=10.210.0.27, port=11015, sslEnabled=false}
	at io.cdap.cdap.test.IntegrationTestBase.checkServicesWithRetry(IntegrationTestBase.java:265)
	at io.cdap.cdap.test.IntegrationTestBase.fetchAccessToken(IntegrationTestBase.java:233)
	at io.cdap.cdap.test.IntegrationTestBase.fetchAccessToken(IntegrationTestBase.java:218)
	at io.cdap.cdap.test.IntegrationTestBase.checkSystemServices(IntegrationTestBase.java:196)
	at io.cdap.cdap.test.IntegrationTestBase.setUp(IntegrationTestBase.java:97)
	at sun.reflect.GeneratedMethodAccessor1.invoke(Unknown Source)
	at sun.reflect.DelegatingMethodAccessorImpl.invoke(DelegatingMethodAccessorImpl.java:43)
(41 more lines...)
java.util.concurrent.TimeoutException: Unable to connect to Authentication service to obtain access token, Connection info : CLIConnectionConfig{hostname=10.210.0.27, port=11015, sslEnabled=false}
	at io.cdap.cdap.test.IntegrationTestBase.checkServicesWithRetry(IntegrationTestBase.java:265)
	at io.cdap.cdap.test.IntegrationTestBase.fetchAccessToken(IntegrationTestBase.java:233)
	at io.cdap.cdap.test.IntegrationTestBase.fetchAccessToken(IntegrationTestBase.java:218)
	at io.cdap.cdap.test.IntegrationTestBase.checkSystemServices(IntegrationTestBase.java:196)
	at io.cdap.cdap.test.IntegrationTestBase.setUp(IntegrationTestBase.java:97)
	at sun.reflect.GeneratedMethodAccessor1.invoke(Unknown Source)
	at sun.reflect.DelegatingMethodAccessorImpl.invoke(DelegatingMethodAccessorImpl.java:43)
(41 more lines...)
java.util.concurrent.TimeoutException: Unable to connect to Authentication service to obtain access token, Connection info : CLIConnectionConfig{hostname=10.210.0.27, port=11015, sslEnabled=false}
	at io.cdap.cdap.test.IntegrationTestBase.checkServicesWithRetry(IntegrationTestBase.java:265)
	at io.cdap.cdap.test.IntegrationTestBase.fetchAccessToken(IntegrationTestBase.java:233)
	at io.cdap.cdap.test.IntegrationTestBase.fetchAccessToken(IntegrationTestBase.java:218)
	at io.cdap.cdap.test.IntegrationTestBase.checkSystemServices(IntegrationTestBase.java:196)
	at io.cdap.cdap.test.IntegrationTestBase.setUp(IntegrationTestBase.java:97)
	at sun.reflect.GeneratedMethodAccessor1.invoke(Unknown Source)
	at sun.reflect.DelegatingMethodAccessorImpl.invoke(DelegatingMethodAccessorImpl.java:43)
(40 more lines...)
java.util.concurrent.TimeoutException: Unable to connect to Authentication service to obtain access token, Connection info : CLIConnectionConfig{hostname=10.210.0.27, port=11015, sslEnabled=false}
	at io.cdap.cdap.test.IntegrationTestBase.checkServicesWithRetry(IntegrationTestBase.java:265)
	at io.cdap.cdap.test.IntegrationTestBase.fetchAccessToken(IntegrationTestBase.java:233)
	at io.cdap.cdap.test.IntegrationTestBase.fetchAccessToken(IntegrationTestBase.java:218)
	at io.cdap.cdap.test.IntegrationTestBase.checkSystemServices(IntegrationTestBase.java:196)
	at io.cdap.cdap.test.IntegrationTestBase.setUp(IntegrationTestBase.java:97)
	at sun.reflect.GeneratedMethodAccessor1.invoke(Unknown Source)
	at sun.reflect.DelegatingMethodAccessorImpl.invoke(DelegatingMethodAccessorImpl.java:43)
(40 more lines...)
java.util.concurrent.TimeoutException: Unable to connect to Authentication service to obtain access token, Connection info : CLIConnectionConfig{hostname=10.210.0.27, port=11015, sslEnabled=false}
	at io.cdap.cdap.test.IntegrationTestBase.checkServicesWithRetry(IntegrationTestBase.java:265)
	at io.cdap.cdap.test.IntegrationTestBase.fetchAccessToken(IntegrationTestBase.java:233)
	at io.cdap.cdap.test.IntegrationTestBase.fetchAccessToken(IntegrationTestBase.java:218)
	at io.cdap.cdap.test.IntegrationTestBase.checkSystemServices(IntegrationTestBase.java:196)
	at io.cdap.cdap.test.IntegrationTestBase.setUp(IntegrationTestBase.java:97)
	at sun.reflect.GeneratedMethodAccessor1.invoke(Unknown Source)
	at sun.reflect.DelegatingMethodAccessorImpl.invoke(DelegatingMethodAccessorImpl.java:43)
(40 more lines...)
java.util.concurrent.TimeoutException: Unable to connect to Authentication service to obtain access token, Connection info : CLIConnectionConfig{hostname=10.210.0.27, port=11015, sslEnabled=false}
	at io.cdap.cdap.test.IntegrationTestBase.checkServicesWithRetry(IntegrationTestBase.java:265)
	at io.cdap.cdap.test.IntegrationTestBase.fetchAccessToken(IntegrationTestBase.java:233)
	at io.cdap.cdap.test.IntegrationTestBase.fetchAccessToken(IntegrationTestBase.java:218)
	at io.cdap.cdap.test.IntegrationTestBase.checkSystemServices(IntegrationTestBase.java:196)
	at io.cdap.cdap.test.IntegrationTestBase.setUp(IntegrationTestBase.java:97)
	at sun.reflect.GeneratedMethodAccessor1.invoke(Unknown Source)
	at sun.reflect.DelegatingMethodAccessorImpl.invoke(DelegatingMethodAccessorImpl.java:43)
(40 more lines...)
java.util.concurrent.TimeoutException: Unable to connect to Authentication service to obtain access token, Connection info : CLIConnectionConfig{hostname=10.210.0.27, port=11015, sslEnabled=false}
	at io.cdap.cdap.test.IntegrationTestBase.checkServicesWithRetry(IntegrationTestBase.java:265)
	at io.cdap.cdap.test.IntegrationTestBase.fetchAccessToken(IntegrationTestBase.java:233)
	at io.cdap.cdap.test.IntegrationTestBase.fetchAccessToken(IntegrationTestBase.java:218)
	at io.cdap.cdap.test.IntegrationTestBase.checkSystemServices(IntegrationTestBase.java:196)
	at io.cdap.cdap.test.IntegrationTestBase.setUp(IntegrationTestBase.java:97)
	at sun.reflect.GeneratedMethodAccessor1.invoke(Unknown Source)
	at sun.reflect.DelegatingMethodAccessorImpl.invoke(DelegatingMethodAccessorImpl.java:43)
(40 more lines...)
java.util.concurrent.TimeoutException: Unable to connect to Authentication service to obtain access token, Connection info : CLIConnectionConfig{hostname=10.210.0.27, port=11015, sslEnabled=false}
	at io.cdap.cdap.test.IntegrationTestBase.checkServicesWithRetry(IntegrationTestBase.java:265)
	at io.cdap.cdap.test.IntegrationTestBase.fetchAccessToken(IntegrationTestBase.java:233)
	at io.cdap.cdap.test.IntegrationTestBase.fetchAccessToken(IntegrationTestBase.java:218)
	at io.cdap.cdap.test.IntegrationTestBase.checkSystemServices(IntegrationTestBase.java:196)
	at io.cdap.cdap.test.IntegrationTestBase.setUp(IntegrationTestBase.java:97)
	at sun.reflect.GeneratedMethodAccessor1.invoke(Unknown Source)
	at sun.reflect.DelegatingMethodAccessorImpl.invoke(DelegatingMethodAccessorImpl.java:43)
(40 more lines...)
java.util.concurrent.TimeoutException: Unable to connect to Authentication service to obtain access token, Connection info : CLIConnectionConfig{hostname=10.210.0.27, port=11015, sslEnabled=false}
	at io.cdap.cdap.test.IntegrationTestBase.checkServicesWithRetry(IntegrationTestBase.java:265)
	at io.cdap.cdap.test.IntegrationTestBase.fetchAccessToken(IntegrationTestBase.java:233)
	at io.cdap.cdap.test.IntegrationTestBase.fetchAccessToken(IntegrationTestBase.java:218)
	at io.cdap.cdap.test.IntegrationTestBase.checkSystemServices(IntegrationTestBase.java:196)
	at io.cdap.cdap.test.IntegrationTestBase.setUp(IntegrationTestBase.java:97)
	at sun.reflect.GeneratedMethodAccessor1.invoke(Unknown Source)
	at sun.reflect.DelegatingMethodAccessorImpl.invoke(DelegatingMethodAccessorImpl.java:43)
(40 more lines...)
java.util.concurrent.TimeoutException: Unable to connect to Authentication service to obtain access token, Connection info : CLIConnectionConfig{hostname=10.210.0.27, port=11015, sslEnabled=false}
	at io.cdap.cdap.test.IntegrationTestBase.checkServicesWithRetry(IntegrationTestBase.java:265)
	at io.cdap.cdap.test.IntegrationTestBase.fetchAccessToken(IntegrationTestBase.java:233)
	at io.cdap.cdap.test.IntegrationTestBase.fetchAccessToken(IntegrationTestBase.java:218)
	at io.cdap.cdap.test.IntegrationTestBase.checkSystemServices(IntegrationTestBase.java:196)
	at io.cdap.cdap.test.IntegrationTestBase.setUp(IntegrationTestBase.java:97)
	at sun.reflect.GeneratedMethodAccessor1.invoke(Unknown Source)
	at sun.reflect.DelegatingMethodAccessorImpl.invoke(DelegatingMethodAccessorImpl.java:43)
(40 more lines...)
java.util.concurrent.TimeoutException: Unable to connect to Authentication service to obtain access token, Connection info : CLIConnectionConfig{hostname=10.210.0.27, port=11015, sslEnabled=false}
	at io.cdap.cdap.test.IntegrationTestBase.checkServicesWithRetry(IntegrationTestBase.java:265)
	at io.cdap.cdap.test.IntegrationTestBase.fetchAccessToken(IntegrationTestBase.java:233)
	at io.cdap.cdap.test.IntegrationTestBase.fetchAccessToken(IntegrationTestBase.java:218)
	at io.cdap.cdap.test.IntegrationTestBase.checkSystemServices(IntegrationTestBase.java:196)
	at io.cdap.cdap.test.IntegrationTestBase.setUp(IntegrationTestBase.java:97)
	at sun.reflect.GeneratedMethodAccessor1.invoke(Unknown Source)
	at sun.reflect.DelegatingMethodAccessorImpl.invoke(DelegatingMethodAccessorImpl.java:43)
(40 more lines...)
java.util.concurrent.TimeoutException: Unable to connect to Authentication service to obtain access token, Connection info : CLIConnectionConfig{hostname=10.210.0.27, port=11015, sslEnabled=false}
	at io.cdap.cdap.test.IntegrationTestBase.checkServicesWithRetry(IntegrationTestBase.java:265)
	at io.cdap.cdap.test.IntegrationTestBase.fetchAccessToken(IntegrationTestBase.java:233)
	at io.cdap.cdap.test.IntegrationTestBase.fetchAccessToken(IntegrationTestBase.java:218)
	at io.cdap.cdap.test.IntegrationTestBase.checkSystemServices(IntegrationTestBase.java:196)
	at io.cdap.cdap.test.IntegrationTestBase.setUp(IntegrationTestBase.java:97)
	at sun.reflect.GeneratedMethodAccessor1.invoke(Unknown Source)
	at sun.reflect.DelegatingMethodAccessorImpl.invoke(DelegatingMethodAccessorImpl.java:43)
(40 more lines...)
java.util.concurrent.TimeoutException: Unable to connect to Authentication service to obtain access token, Connection info : CLIConnectionConfig{hostname=10.210.0.27, port=11015, sslEnabled=false}
	at io.cdap.cdap.test.IntegrationTestBase.checkServicesWithRetry(IntegrationTestBase.java:265)
	at io.cdap.cdap.test.IntegrationTestBase.fetchAccessToken(IntegrationTestBase.java:233)
	at io.cdap.cdap.test.IntegrationTestBase.fetchAccessToken(IntegrationTestBase.java:218)
	at io.cdap.cdap.test.IntegrationTestBase.checkSystemServices(IntegrationTestBase.java:196)
	at io.cdap.cdap.test.IntegrationTestBase.setUp(IntegrationTestBase.java:97)
	at sun.reflect.GeneratedMethodAccessor1.invoke(Unknown Source)
	at sun.reflect.DelegatingMethodAccessorImpl.invoke(DelegatingMethodAccessorImpl.java:43)
(40 more lines...)
java.util.concurrent.TimeoutException: Unable to connect to Authentication service to obtain access token, Connection info : CLIConnectionConfig{hostname=10.210.0.27, port=11015, sslEnabled=false}
	at io.cdap.cdap.test.IntegrationTestBase.checkServicesWithRetry(IntegrationTestBase.java:265)
	at io.cdap.cdap.test.IntegrationTestBase.fetchAccessToken(IntegrationTestBase.java:233)
	at io.cdap.cdap.test.IntegrationTestBase.fetchAccessToken(IntegrationTestBase.java:218)
	at io.cdap.cdap.test.IntegrationTestBase.checkSystemServices(IntegrationTestBase.java:196)
	at io.cdap.cdap.test.IntegrationTestBase.setUp(IntegrationTestBase.java:97)
	at sun.reflect.GeneratedMethodAccessor1.invoke(Unknown Source)
	at sun.reflect.DelegatingMethodAccessorImpl.invoke(DelegatingMethodAccessorImpl.java:43)
(40 more lines...)
java.util.concurrent.TimeoutException: Unable to connect to Authentication service to obtain access token, Connection info : CLIConnectionConfig{hostname=10.210.0.27, port=11015, sslEnabled=false}
	at io.cdap.cdap.test.IntegrationTestBase.checkServicesWithRetry(IntegrationTestBase.java:265)
	at io.cdap.cdap.test.IntegrationTestBase.fetchAccessToken(IntegrationTestBase.java:233)
	at io.cdap.cdap.test.IntegrationTestBase.fetchAccessToken(IntegrationTestBase.java:218)
	at io.cdap.cdap.test.IntegrationTestBase.checkSystemServices(IntegrationTestBase.java:196)
	at io.cdap.cdap.test.IntegrationTestBase.setUp(IntegrationTestBase.java:97)
	at sun.reflect.GeneratedMethodAccessor1.invoke(Unknown Source)
	at sun.reflect.DelegatingMethodAccessorImpl.invoke(DelegatingMethodAccessorImpl.java:43)
(40 more lines...)
java.util.concurrent.TimeoutException: Unable to connect to Authentication service to obtain access token, Connection info : CLIConnectionConfig{hostname=10.210.0.27, port=11015, sslEnabled=false}
	at io.cdap.cdap.test.IntegrationTestBase.checkServicesWithRetry(IntegrationTestBase.java:265)
	at io.cdap.cdap.test.IntegrationTestBase.fetchAccessToken(IntegrationTestBase.java:233)
	at io.cdap.cdap.test.IntegrationTestBase.fetchAccessToken(IntegrationTestBase.java:218)
	at io.cdap.cdap.test.IntegrationTestBase.checkSystemServices(IntegrationTestBase.java:196)
	at io.cdap.cdap.test.IntegrationTestBase.setUp(IntegrationTestBase.java:97)
	at sun.reflect.GeneratedMethodAccessor1.invoke(Unknown Source)
	at sun.reflect.DelegatingMethodAccessorImpl.invoke(DelegatingMethodAccessorImpl.java:43)
(40 more lines...)
java.util.concurrent.TimeoutException: Unable to connect to Authentication service to obtain access token, Connection info : CLIConnectionConfig{hostname=10.210.0.27, port=11015, sslEnabled=false}
	at io.cdap.cdap.test.IntegrationTestBase.checkServicesWithRetry(IntegrationTestBase.java:265)
	at io.cdap.cdap.test.IntegrationTestBase.fetchAccessToken(IntegrationTestBase.java:233)
	at io.cdap.cdap.test.IntegrationTestBase.fetchAccessToken(IntegrationTestBase.java:218)
	at io.cdap.cdap.test.IntegrationTestBase.checkSystemServices(IntegrationTestBase.java:196)
	at io.cdap.cdap.test.IntegrationTestBase.setUp(IntegrationTestBase.java:97)
	at sun.reflect.NativeMethodAccessorImpl.invoke0(Native Method)
	at sun.reflect.NativeMethodAccessorImpl.invoke(NativeMethodAccessorImpl.java:62)
(41 more lines...)
java.util.concurrent.TimeoutException: Unable to connect to Authentication service to obtain access token, Connection info : CLIConnectionConfig{hostname=10.210.0.27, port=11015, sslEnabled=false}
	at io.cdap.cdap.test.IntegrationTestBase.checkServicesWithRetry(IntegrationTestBase.java:265)
	at io.cdap.cdap.test.IntegrationTestBase.fetchAccessToken(IntegrationTestBase.java:233)
	at io.cdap.cdap.test.IntegrationTestBase.fetchAccessToken(IntegrationTestBase.java:218)
	at io.cdap.cdap.test.IntegrationTestBase.checkSystemServices(IntegrationTestBase.java:196)
	at io.cdap.cdap.test.IntegrationTestBase.setUp(IntegrationTestBase.java:97)
	at sun.reflect.GeneratedMethodAccessor1.invoke(Unknown Source)
	at sun.reflect.DelegatingMethodAccessorImpl.invoke(DelegatingMethodAccessorImpl.java:43)
(40 more lines...)
java.util.concurrent.TimeoutException: Unable to connect to Authentication service to obtain access token, Connection info : CLIConnectionConfig{hostname=10.210.0.27, port=11015, sslEnabled=false}
	at io.cdap.cdap.test.IntegrationTestBase.checkServicesWithRetry(IntegrationTestBase.java:265)
	at io.cdap.cdap.test.IntegrationTestBase.fetchAccessToken(IntegrationTestBase.java:233)
	at io.cdap.cdap.test.IntegrationTestBase.fetchAccessToken(IntegrationTestBase.java:218)
	at io.cdap.cdap.test.IntegrationTestBase.checkSystemServices(IntegrationTestBase.java:196)
	at io.cdap.cdap.test.IntegrationTestBase.setUp(IntegrationTestBase.java:97)
	at sun.reflect.NativeMethodAccessorImpl.invoke0(Native Method)
	at sun.reflect.NativeMethodAccessorImpl.invoke(NativeMethodAccessorImpl.java:62)
(41 more lines...)
java.util.concurrent.TimeoutException: Unable to connect to Authentication service to obtain access token, Connection info : CLIConnectionConfig{hostname=10.210.0.27, port=11015, sslEnabled=false}
	at io.cdap.cdap.test.IntegrationTestBase.checkServicesWithRetry(IntegrationTestBase.java:265)
	at io.cdap.cdap.test.IntegrationTestBase.fetchAccessToken(IntegrationTestBase.java:233)
	at io.cdap.cdap.test.IntegrationTestBase.fetchAccessToken(IntegrationTestBase.java:218)
	at io.cdap.cdap.test.IntegrationTestBase.checkSystemServices(IntegrationTestBase.java:196)
	at io.cdap.cdap.test.IntegrationTestBase.setUp(IntegrationTestBase.java:97)
	at sun.reflect.GeneratedMethodAccessor1.invoke(Unknown Source)
	at sun.reflect.DelegatingMethodAccessorImpl.invoke(DelegatingMethodAccessorImpl.java:43)
(40 more lines...)
java.util.concurrent.TimeoutException: Unable to connect to Authentication service to obtain access token, Connection info : CLIConnectionConfig{hostname=10.210.0.27, port=11015, sslEnabled=false}
	at io.cdap.cdap.test.IntegrationTestBase.checkServicesWithRetry(IntegrationTestBase.java:265)
	at io.cdap.cdap.test.IntegrationTestBase.fetchAccessToken(IntegrationTestBase.java:233)
	at io.cdap.cdap.test.IntegrationTestBase.fetchAccessToken(IntegrationTestBase.java:218)
	at io.cdap.cdap.test.IntegrationTestBase.checkSystemServices(IntegrationTestBase.java:196)
	at io.cdap.cdap.test.IntegrationTestBase.setUp(IntegrationTestBase.java:97)
	at sun.reflect.NativeMethodAccessorImpl.invoke0(Native Method)
	at sun.reflect.NativeMethodAccessorImpl.invoke(NativeMethodAccessorImpl.java:62)
(41 more lines...)
java.util.concurrent.TimeoutException: Unable to connect to Authentication service to obtain access token, Connection info : CLIConnectionConfig{hostname=10.210.0.27, port=11015, sslEnabled=false}
	at io.cdap.cdap.test.IntegrationTestBase.checkServicesWithRetry(IntegrationTestBase.java:265)
	at io.cdap.cdap.test.IntegrationTestBase.fetchAccessToken(IntegrationTestBase.java:233)
	at io.cdap.cdap.test.IntegrationTestBase.fetchAccessToken(IntegrationTestBase.java:218)
	at io.cdap.cdap.test.IntegrationTestBase.checkSystemServices(IntegrationTestBase.java:196)
	at io.cdap.cdap.test.IntegrationTestBase.setUp(IntegrationTestBase.java:97)
	at sun.reflect.NativeMethodAccessorImpl.invoke0(Native Method)
	at sun.reflect.NativeMethodAccessorImpl.invoke(NativeMethodAccessorImpl.java:62)
(41 more lines...)
java.util.concurrent.TimeoutException: Unable to connect to Authentication service to obtain access token, Connection info : CLIConnectionConfig{hostname=10.210.0.27, port=11015, sslEnabled=false}
	at io.cdap.cdap.test.IntegrationTestBase.checkServicesWithRetry(IntegrationTestBase.java:265)
	at io.cdap.cdap.test.IntegrationTestBase.fetchAccessToken(IntegrationTestBase.java:233)
	at io.cdap.cdap.test.IntegrationTestBase.fetchAccessToken(IntegrationTestBase.java:218)
	at io.cdap.cdap.test.IntegrationTestBase.checkSystemServices(IntegrationTestBase.java:196)
	at io.cdap.cdap.test.IntegrationTestBase.setUp(IntegrationTestBase.java:97)
	at sun.reflect.GeneratedMethodAccessor1.invoke(Unknown Source)
	at sun.reflect.DelegatingMethodAccessorImpl.invoke(DelegatingMethodAccessorImpl.java:43)
(40 more lines...)
java.util.concurrent.TimeoutException: Unable to connect to Authentication service to obtain access token, Connection info : CLIConnectionConfig{hostname=10.210.0.27, port=11015, sslEnabled=false}
	at io.cdap.cdap.test.IntegrationTestBase.checkServicesWithRetry(IntegrationTestBase.java:265)
	at io.cdap.cdap.test.IntegrationTestBase.fetchAccessToken(IntegrationTestBase.java:233)
	at io.cdap.cdap.test.IntegrationTestBase.fetchAccessToken(IntegrationTestBase.java:218)
	at io.cdap.cdap.test.IntegrationTestBase.checkSystemServices(IntegrationTestBase.java:196)
	at io.cdap.cdap.test.IntegrationTestBase.setUp(IntegrationTestBase.java:97)
	at sun.reflect.GeneratedMethodAccessor1.invoke(Unknown Source)
	at sun.reflect.DelegatingMethodAccessorImpl.invoke(DelegatingMethodAccessorImpl.java:43)
(40 more lines...)
java.util.concurrent.TimeoutException: Unable to connect to Authentication service to obtain access token, Connection info : CLIConnectionConfig{hostname=10.210.0.27, port=11015, sslEnabled=false}
	at io.cdap.cdap.test.IntegrationTestBase.checkServicesWithRetry(IntegrationTestBase.java:265)
	at io.cdap.cdap.test.IntegrationTestBase.fetchAccessToken(IntegrationTestBase.java:233)
	at io.cdap.cdap.test.IntegrationTestBase.fetchAccessToken(IntegrationTestBase.java:218)
	at io.cdap.cdap.test.IntegrationTestBase.checkSystemServices(IntegrationTestBase.java:196)
	at io.cdap.cdap.test.IntegrationTestBase.setUp(IntegrationTestBase.java:97)
	at sun.reflect.GeneratedMethodAccessor1.invoke(Unknown Source)
	at sun.reflect.DelegatingMethodAccessorImpl.invoke(DelegatingMethodAccessorImpl.java:43)
(40 more lines...)
java.util.concurrent.TimeoutException: Unable to connect to Authentication service to obtain access token, Connection info : CLIConnectionConfig{hostname=10.210.0.27, port=11015, sslEnabled=false}
	at io.cdap.cdap.test.IntegrationTestBase.checkServicesWithRetry(IntegrationTestBase.java:265)
	at io.cdap.cdap.test.IntegrationTestBase.fetchAccessToken(IntegrationTestBase.java:233)
	at io.cdap.cdap.test.IntegrationTestBase.fetchAccessToken(IntegrationTestBase.java:218)
	at io.cdap.cdap.test.IntegrationTestBase.checkSystemServices(IntegrationTestBase.java:196)
	at io.cdap.cdap.test.IntegrationTestBase.setUp(IntegrationTestBase.java:97)
	at sun.reflect.GeneratedMethodAccessor1.invoke(Unknown Source)
	at sun.reflect.DelegatingMethodAccessorImpl.invoke(DelegatingMethodAccessorImpl.java:43)
(40 more lines...)
java.util.concurrent.TimeoutException: Unable to connect to Authentication service to obtain access token, Connection info : CLIConnectionConfig{hostname=10.210.0.27, port=11015, sslEnabled=false}
	at io.cdap.cdap.test.IntegrationTestBase.checkServicesWithRetry(IntegrationTestBase.java:265)
	at io.cdap.cdap.test.IntegrationTestBase.fetchAccessToken(IntegrationTestBase.java:233)
	at io.cdap.cdap.test.IntegrationTestBase.fetchAccessToken(IntegrationTestBase.java:218)
	at io.cdap.cdap.test.IntegrationTestBase.checkSystemServices(IntegrationTestBase.java:196)
	at io.cdap.cdap.test.IntegrationTestBase.setUp(IntegrationTestBase.java:97)
	at sun.reflect.GeneratedMethodAccessor1.invoke(Unknown Source)
	at sun.reflect.DelegatingMethodAccessorImpl.invoke(DelegatingMethodAccessorImpl.java:43)
(40 more lines...)
java.util.concurrent.TimeoutException: Unable to connect to Authentication service to obtain access token, Connection info : CLIConnectionConfig{hostname=10.210.0.27, port=11015, sslEnabled=false}
	at io.cdap.cdap.test.IntegrationTestBase.checkServicesWithRetry(IntegrationTestBase.java:265)
	at io.cdap.cdap.test.IntegrationTestBase.fetchAccessToken(IntegrationTestBase.java:233)
	at io.cdap.cdap.test.IntegrationTestBase.fetchAccessToken(IntegrationTestBase.java:218)
	at io.cdap.cdap.test.IntegrationTestBase.checkSystemServices(IntegrationTestBase.java:196)
	at io.cdap.cdap.test.IntegrationTestBase.setUp(IntegrationTestBase.java:97)
	at sun.reflect.GeneratedMethodAccessor1.invoke(Unknown Source)
	at sun.reflect.DelegatingMethodAccessorImpl.invoke(DelegatingMethodAccessorImpl.java:43)
(40 more lines...)
java.util.concurrent.TimeoutException: Unable to connect to Authentication service to obtain access token, Connection info : CLIConnectionConfig{hostname=10.210.0.27, port=11015, sslEnabled=false}
	at io.cdap.cdap.test.IntegrationTestBase.checkServicesWithRetry(IntegrationTestBase.java:265)
	at io.cdap.cdap.test.IntegrationTestBase.fetchAccessToken(IntegrationTestBase.java:233)
	at io.cdap.cdap.test.IntegrationTestBase.fetchAccessToken(IntegrationTestBase.java:218)
	at io.cdap.cdap.test.IntegrationTestBase.checkSystemServices(IntegrationTestBase.java:196)
	at io.cdap.cdap.test.IntegrationTestBase.setUp(IntegrationTestBase.java:97)
	at sun.reflect.GeneratedMethodAccessor1.invoke(Unknown Source)
	at sun.reflect.DelegatingMethodAccessorImpl.invoke(DelegatingMethodAccessorImpl.java:43)
(40 more lines...)
java.util.concurrent.TimeoutException: Unable to connect to Authentication service to obtain access token, Connection info : CLIConnectionConfig{hostname=10.210.0.27, port=11015, sslEnabled=false}
	at io.cdap.cdap.test.IntegrationTestBase.checkServicesWithRetry(IntegrationTestBase.java:265)
	at io.cdap.cdap.test.IntegrationTestBase.fetchAccessToken(IntegrationTestBase.java:233)
	at io.cdap.cdap.test.IntegrationTestBase.fetchAccessToken(IntegrationTestBase.java:218)
	at io.cdap.cdap.test.IntegrationTestBase.checkSystemServices(IntegrationTestBase.java:196)
	at io.cdap.cdap.test.IntegrationTestBase.setUp(IntegrationTestBase.java:97)
	at sun.reflect.GeneratedMethodAccessor1.invoke(Unknown Source)
	at sun.reflect.DelegatingMethodAccessorImpl.invoke(DelegatingMethodAccessorImpl.java:43)
(40 more lines...)
java.util.concurrent.TimeoutException: Unable to connect to Authentication service to obtain access token, Connection info : CLIConnectionConfig{hostname=10.210.0.27, port=11015, sslEnabled=false}
	at io.cdap.cdap.test.IntegrationTestBase.checkServicesWithRetry(IntegrationTestBase.java:265)
	at io.cdap.cdap.test.IntegrationTestBase.fetchAccessToken(IntegrationTestBase.java:233)
	at io.cdap.cdap.test.IntegrationTestBase.fetchAccessToken(IntegrationTestBase.java:218)
	at io.cdap.cdap.test.IntegrationTestBase.checkSystemServices(IntegrationTestBase.java:196)
	at io.cdap.cdap.test.IntegrationTestBase.setUp(IntegrationTestBase.java:97)
	at sun.reflect.GeneratedMethodAccessor1.invoke(Unknown Source)
	at sun.reflect.DelegatingMethodAccessorImpl.invoke(DelegatingMethodAccessorImpl.java:43)
(40 more lines...)

Error summary

The build generated some errors. See the full build log for more details.

Java HotSpot(TM) 64-Bit Server VM warning: ignoring option MaxPermSize=128m; support was removed in 8.0
Warning:  org.apache.xerces.jaxp.SAXParserImpl$JAXPSAXParser: Property 'http://www.oracle.com/xml/jaxp/properties/entityExpansionLimit' is not recognized.
Compiler warnings:
  WARNING:  'org.apache.xerces.jaxp.SAXParserImpl: Property 'http://javax.xml.XMLConstants/property/accessExternalDTD' is not recognized.'
Warning:  org.apache.xerces.parsers.SAXParser: Feature 'http://javax.xml.XMLConstants/feature/secure-processing' is not recognized.
Warning:  org.apache.xerces.parsers.SAXParser: Property 'http://javax.xml.XMLConstants/property/accessExternalDTD' is not recognized.
Warning:  org.apache.xerces.parsers.SAXParser: Property 'http://www.oracle.com/xml/jaxp/properties/entityExpansionLimit' is not recognized.
Warning:  org.apache.xerces.jaxp.SAXParserImpl$JAXPSAXParser: Property 'http://www.oracle.com/xml/jaxp/properties/entityExpansionLimit' is not recognized.
Compiler warnings:
  WARNING:  'org.apache.xerces.jaxp.SAXParserImpl: Property 'http://javax.xml.XMLConstants/property/accessExternalDTD' is not recognized.'
Warning:  org.apache.xerces.parsers.SAXParser: Feature 'http://javax.xml.XMLConstants/feature/secure-processing' is not recognized.
Warning:  org.apache.xerces.parsers.SAXParser: Property 'http://javax.xml.XMLConstants/property/accessExternalDTD' is not recognized.
Warning:  org.apache.xerces.parsers.SAXParser: Property 'http://www.oracle.com/xml/jaxp/properties/entityExpansionLimit' is not recognized.
Warning:  org.apache.xerces.jaxp.SAXParserImpl$JAXPSAXParser: Property 'http://www.oracle.com/xml/jaxp/properties/entityExpansionLimit' is not recognized.
Compiler warnings:
  WARNING:  'org.apache.xerces.jaxp.SAXParserImpl: Property 'http://javax.xml.XMLConstants/property/accessExternalDTD' is not recognized.'
Warning:  org.apache.xerces.parsers.SAXParser: Feature 'http://javax.xml.XMLConstants/feature/secure-processing' is not recognized.
Warning:  org.apache.xerces.parsers.SAXParser: Property 'http://javax.xml.XMLConstants/property/accessExternalDTD' is not recognized.
Warning:  org.apache.xerces.parsers.SAXParser: Property 'http://www.oracle.com/xml/jaxp/properties/entityExpansionLimit' is not recognized.
SLF4J: Class path contains multiple SLF4J bindings.
SLF4J: Found binding in [jar:file:/home/bamboo/.m2/repository/io/cdap/cdap/cdap-cli/6.1.0-SNAPSHOT/cdap-cli-6.1.0-SNAPSHOT.jar!/org/slf4j/impl/StaticLoggerBinder.class]
SLF4J: Found binding in [jar:file:/home/bamboo/.m2/repository/io/cdap/cdap/cdap-explore-jdbc/6.1.0-SNAPSHOT/cdap-explore-jdbc-6.1.0-SNAPSHOT.jar!/org/slf4j/impl/StaticLoggerBinder.class]
SLF4J: Found binding in [jar:file:/home/bamboo/.m2/repository/ch/qos/logback/logback-classic/1.0.9/logback-classic-1.0.9.jar!/org/slf4j/impl/StaticLoggerBinder.class]
SLF4J: See http://www.slf4j.org/codes.html#multiple_bindings for an explanation.
SLF4J: Actual binding is of type [ch.qos.logback.classic.util.ContextSelectorStaticBinder]