Build #314

Build: #314 failed

Job: Distro Tests - CDH 5.4 failed

Test results

  • 45 tests in total
  • 45 tests failed
  • 45 failures are new
  • 451 minutes taken in total.

Build 314 has the following 45 errors: 45 new failure(s) occurred since the previous build.

New test failures 45
Status Test Duration
Collapse Failed KVTableWithProjectionTest testKVTableWithProjection History
10 mins
java.util.concurrent.TimeoutException: Unable to connect to Authentication service to obtain access token, Connection info : CLIConnectionConfig{hostname=10.210.0.169, port=11015, sslEnabled=false}
	at io.cdap.cdap.test.IntegrationTestBase.checkServicesWithRetry(IntegrationTestBase.java:265)
	at io.cdap.cdap.test.IntegrationTestBase.fetchAccessToken(IntegrationTestBase.java:233)
	at io.cdap.cdap.test.IntegrationTestBase.fetchAccessToken(IntegrationTestBase.java:218)
	at io.cdap.cdap.test.IntegrationTestBase.checkSystemServices(IntegrationTestBase.java:196)
	at io.cdap.cdap.test.IntegrationTestBase.setUp(IntegrationTestBase.java:97)
	at sun.reflect.GeneratedMethodAccessor1.invoke(Unknown Source)
	at sun.reflect.DelegatingMethodAccessorImpl.invoke(DelegatingMethodAccessorImpl.java:43)
(40 more lines...)
Collapse Failed TPFSAvroSinkSourceTest testTPFSWithProjection History
10 mins
java.util.concurrent.TimeoutException: Unable to connect to Authentication service to obtain access token, Connection info : CLIConnectionConfig{hostname=10.210.0.169, port=11015, sslEnabled=false}
	at io.cdap.cdap.test.IntegrationTestBase.checkServicesWithRetry(IntegrationTestBase.java:265)
	at io.cdap.cdap.test.IntegrationTestBase.fetchAccessToken(IntegrationTestBase.java:233)
	at io.cdap.cdap.test.IntegrationTestBase.fetchAccessToken(IntegrationTestBase.java:218)
	at io.cdap.cdap.test.IntegrationTestBase.checkSystemServices(IntegrationTestBase.java:196)
	at io.cdap.cdap.test.IntegrationTestBase.setUp(IntegrationTestBase.java:97)
	at sun.reflect.GeneratedMethodAccessor1.invoke(Unknown Source)
	at sun.reflect.DelegatingMethodAccessorImpl.invoke(DelegatingMethodAccessorImpl.java:43)
(40 more lines...)
Collapse Failed BatchAggregatorTest test History
10 mins
java.util.concurrent.TimeoutException: Unable to connect to Authentication service to obtain access token, Connection info : CLIConnectionConfig{hostname=10.210.0.169, port=11015, sslEnabled=false}
	at io.cdap.cdap.test.IntegrationTestBase.checkServicesWithRetry(IntegrationTestBase.java:265)
	at io.cdap.cdap.test.IntegrationTestBase.fetchAccessToken(IntegrationTestBase.java:233)
	at io.cdap.cdap.test.IntegrationTestBase.fetchAccessToken(IntegrationTestBase.java:218)
	at io.cdap.cdap.test.IntegrationTestBase.checkSystemServices(IntegrationTestBase.java:196)
	at io.cdap.cdap.test.IntegrationTestBase.setUp(IntegrationTestBase.java:97)
	at sun.reflect.NativeMethodAccessorImpl.invoke0(Native Method)
	at sun.reflect.NativeMethodAccessorImpl.invoke(NativeMethodAccessorImpl.java:62)
(41 more lines...)
Collapse Failed BatchCubeSinkTest test History
10 mins
java.util.concurrent.TimeoutException: Unable to connect to Authentication service to obtain access token, Connection info : CLIConnectionConfig{hostname=10.210.0.169, port=11015, sslEnabled=false}
	at io.cdap.cdap.test.IntegrationTestBase.checkServicesWithRetry(IntegrationTestBase.java:265)
	at io.cdap.cdap.test.IntegrationTestBase.fetchAccessToken(IntegrationTestBase.java:233)
	at io.cdap.cdap.test.IntegrationTestBase.fetchAccessToken(IntegrationTestBase.java:218)
	at io.cdap.cdap.test.IntegrationTestBase.checkSystemServices(IntegrationTestBase.java:196)
	at io.cdap.cdap.test.IntegrationTestBase.setUp(IntegrationTestBase.java:97)
	at sun.reflect.NativeMethodAccessorImpl.invoke0(Native Method)
	at sun.reflect.NativeMethodAccessorImpl.invoke(NativeMethodAccessorImpl.java:62)
(41 more lines...)
Collapse Failed BatchJoinerTest testJoinerMR History
10 mins
java.util.concurrent.TimeoutException: Unable to connect to Authentication service to obtain access token, Connection info : CLIConnectionConfig{hostname=10.210.0.169, port=11015, sslEnabled=false}
	at io.cdap.cdap.test.IntegrationTestBase.checkServicesWithRetry(IntegrationTestBase.java:265)
	at io.cdap.cdap.test.IntegrationTestBase.fetchAccessToken(IntegrationTestBase.java:233)
	at io.cdap.cdap.test.IntegrationTestBase.fetchAccessToken(IntegrationTestBase.java:218)
	at io.cdap.cdap.test.IntegrationTestBase.checkSystemServices(IntegrationTestBase.java:196)
	at io.cdap.cdap.test.IntegrationTestBase.setUp(IntegrationTestBase.java:97)
	at sun.reflect.NativeMethodAccessorImpl.invoke0(Native Method)
	at sun.reflect.NativeMethodAccessorImpl.invoke(NativeMethodAccessorImpl.java:62)
(41 more lines...)
Collapse Failed BatchJoinerTest testJoinerSpark History
10 mins
java.util.concurrent.TimeoutException: Unable to connect to Authentication service to obtain access token, Connection info : CLIConnectionConfig{hostname=10.210.0.169, port=11015, sslEnabled=false}
	at io.cdap.cdap.test.IntegrationTestBase.checkServicesWithRetry(IntegrationTestBase.java:265)
	at io.cdap.cdap.test.IntegrationTestBase.fetchAccessToken(IntegrationTestBase.java:233)
	at io.cdap.cdap.test.IntegrationTestBase.fetchAccessToken(IntegrationTestBase.java:218)
	at io.cdap.cdap.test.IntegrationTestBase.checkSystemServices(IntegrationTestBase.java:196)
	at io.cdap.cdap.test.IntegrationTestBase.setUp(IntegrationTestBase.java:97)
	at sun.reflect.NativeMethodAccessorImpl.invoke0(Native Method)
	at sun.reflect.NativeMethodAccessorImpl.invoke(NativeMethodAccessorImpl.java:62)
(41 more lines...)
Collapse Failed ETLMapReduceTest testDAG History
10 mins
java.util.concurrent.TimeoutException: Unable to connect to Authentication service to obtain access token, Connection info : CLIConnectionConfig{hostname=10.210.0.169, port=11015, sslEnabled=false}
	at io.cdap.cdap.test.IntegrationTestBase.checkServicesWithRetry(IntegrationTestBase.java:265)
	at io.cdap.cdap.test.IntegrationTestBase.fetchAccessToken(IntegrationTestBase.java:233)
	at io.cdap.cdap.test.IntegrationTestBase.fetchAccessToken(IntegrationTestBase.java:218)
	at io.cdap.cdap.test.IntegrationTestBase.checkSystemServices(IntegrationTestBase.java:196)
	at io.cdap.cdap.test.IntegrationTestBase.setUp(IntegrationTestBase.java:97)
	at sun.reflect.NativeMethodAccessorImpl.invoke0(Native Method)
	at sun.reflect.NativeMethodAccessorImpl.invoke(NativeMethodAccessorImpl.java:62)
(41 more lines...)
Collapse Failed ETLMapReduceTest testDAGInvalidSchema History
10 mins
java.util.concurrent.TimeoutException: Unable to connect to Authentication service to obtain access token, Connection info : CLIConnectionConfig{hostname=10.210.0.169, port=11015, sslEnabled=false}
	at io.cdap.cdap.test.IntegrationTestBase.checkServicesWithRetry(IntegrationTestBase.java:265)
	at io.cdap.cdap.test.IntegrationTestBase.fetchAccessToken(IntegrationTestBase.java:233)
	at io.cdap.cdap.test.IntegrationTestBase.fetchAccessToken(IntegrationTestBase.java:218)
	at io.cdap.cdap.test.IntegrationTestBase.checkSystemServices(IntegrationTestBase.java:196)
	at io.cdap.cdap.test.IntegrationTestBase.setUp(IntegrationTestBase.java:97)
	at sun.reflect.NativeMethodAccessorImpl.invoke0(Native Method)
	at sun.reflect.NativeMethodAccessorImpl.invoke(NativeMethodAccessorImpl.java:62)
(41 more lines...)
Collapse Failed ETLMapReduceTest testDAGSchemaChanges History
10 mins
java.util.concurrent.TimeoutException: Unable to connect to Authentication service to obtain access token, Connection info : CLIConnectionConfig{hostname=10.210.0.169, port=11015, sslEnabled=false}
	at io.cdap.cdap.test.IntegrationTestBase.checkServicesWithRetry(IntegrationTestBase.java:265)
	at io.cdap.cdap.test.IntegrationTestBase.fetchAccessToken(IntegrationTestBase.java:233)
	at io.cdap.cdap.test.IntegrationTestBase.fetchAccessToken(IntegrationTestBase.java:218)
	at io.cdap.cdap.test.IntegrationTestBase.checkSystemServices(IntegrationTestBase.java:196)
	at io.cdap.cdap.test.IntegrationTestBase.setUp(IntegrationTestBase.java:97)
	at sun.reflect.NativeMethodAccessorImpl.invoke0(Native Method)
	at sun.reflect.NativeMethodAccessorImpl.invoke(NativeMethodAccessorImpl.java:62)
(41 more lines...)
Collapse Failed ETLMapReduceTest testKVToKV History
10 mins
java.util.concurrent.TimeoutException: Unable to connect to Authentication service to obtain access token, Connection info : CLIConnectionConfig{hostname=10.210.0.169, port=11015, sslEnabled=false}
	at io.cdap.cdap.test.IntegrationTestBase.checkServicesWithRetry(IntegrationTestBase.java:265)
	at io.cdap.cdap.test.IntegrationTestBase.fetchAccessToken(IntegrationTestBase.java:233)
	at io.cdap.cdap.test.IntegrationTestBase.fetchAccessToken(IntegrationTestBase.java:218)
	at io.cdap.cdap.test.IntegrationTestBase.checkSystemServices(IntegrationTestBase.java:196)
	at io.cdap.cdap.test.IntegrationTestBase.setUp(IntegrationTestBase.java:97)
	at sun.reflect.NativeMethodAccessorImpl.invoke0(Native Method)
	at sun.reflect.NativeMethodAccessorImpl.invoke(NativeMethodAccessorImpl.java:62)
(41 more lines...)
Collapse Failed ETLMapReduceTest testTableToTableWithValidations History
10 mins
java.util.concurrent.TimeoutException: Unable to connect to Authentication service to obtain access token, Connection info : CLIConnectionConfig{hostname=10.210.0.169, port=11015, sslEnabled=false}
	at io.cdap.cdap.test.IntegrationTestBase.checkServicesWithRetry(IntegrationTestBase.java:265)
	at io.cdap.cdap.test.IntegrationTestBase.fetchAccessToken(IntegrationTestBase.java:233)
	at io.cdap.cdap.test.IntegrationTestBase.fetchAccessToken(IntegrationTestBase.java:218)
	at io.cdap.cdap.test.IntegrationTestBase.checkSystemServices(IntegrationTestBase.java:196)
	at io.cdap.cdap.test.IntegrationTestBase.setUp(IntegrationTestBase.java:97)
	at sun.reflect.NativeMethodAccessorImpl.invoke0(Native Method)
	at sun.reflect.NativeMethodAccessorImpl.invoke(NativeMethodAccessorImpl.java:62)
(41 more lines...)
Collapse Failed ExcelInputReaderTest testExcelReader History
10 mins
java.util.concurrent.TimeoutException: Unable to connect to Authentication service to obtain access token, Connection info : CLIConnectionConfig{hostname=10.210.0.169, port=11015, sslEnabled=false}
	at io.cdap.cdap.test.IntegrationTestBase.checkServicesWithRetry(IntegrationTestBase.java:265)
	at io.cdap.cdap.test.IntegrationTestBase.fetchAccessToken(IntegrationTestBase.java:233)
	at io.cdap.cdap.test.IntegrationTestBase.fetchAccessToken(IntegrationTestBase.java:218)
	at io.cdap.cdap.test.IntegrationTestBase.checkSystemServices(IntegrationTestBase.java:196)
	at io.cdap.cdap.test.IntegrationTestBase.setUp(IntegrationTestBase.java:97)
	at sun.reflect.NativeMethodAccessorImpl.invoke0(Native Method)
	at sun.reflect.NativeMethodAccessorImpl.invoke(NativeMethodAccessorImpl.java:62)
(41 more lines...)
Collapse Failed ExcelInputReaderTest testExcelReaderReprocessFalse History
10 mins
java.util.concurrent.TimeoutException: Unable to connect to Authentication service to obtain access token, Connection info : CLIConnectionConfig{hostname=10.210.0.169, port=11015, sslEnabled=false}
	at io.cdap.cdap.test.IntegrationTestBase.checkServicesWithRetry(IntegrationTestBase.java:265)
	at io.cdap.cdap.test.IntegrationTestBase.fetchAccessToken(IntegrationTestBase.java:233)
	at io.cdap.cdap.test.IntegrationTestBase.fetchAccessToken(IntegrationTestBase.java:218)
	at io.cdap.cdap.test.IntegrationTestBase.checkSystemServices(IntegrationTestBase.java:196)
	at io.cdap.cdap.test.IntegrationTestBase.setUp(IntegrationTestBase.java:97)
	at sun.reflect.NativeMethodAccessorImpl.invoke0(Native Method)
	at sun.reflect.NativeMethodAccessorImpl.invoke(NativeMethodAccessorImpl.java:62)
(41 more lines...)
Collapse Failed HivePluginTest testHivePlugins History
10 mins
java.util.concurrent.TimeoutException: Unable to connect to Authentication service to obtain access token, Connection info : CLIConnectionConfig{hostname=10.210.0.169, port=11015, sslEnabled=false}
	at io.cdap.cdap.test.IntegrationTestBase.checkServicesWithRetry(IntegrationTestBase.java:265)
	at io.cdap.cdap.test.IntegrationTestBase.fetchAccessToken(IntegrationTestBase.java:233)
	at io.cdap.cdap.test.IntegrationTestBase.fetchAccessToken(IntegrationTestBase.java:218)
	at io.cdap.cdap.test.IntegrationTestBase.checkSystemServices(IntegrationTestBase.java:196)
	at io.cdap.cdap.test.IntegrationTestBase.setUp(IntegrationTestBase.java:97)
	at sun.reflect.NativeMethodAccessorImpl.invoke0(Native Method)
	at sun.reflect.NativeMethodAccessorImpl.invoke(NativeMethodAccessorImpl.java:62)
(41 more lines...)
Collapse Failed NormalizeTest testNormalize History
10 mins
java.util.concurrent.TimeoutException: Unable to connect to Authentication service to obtain access token, Connection info : CLIConnectionConfig{hostname=10.210.0.169, port=11015, sslEnabled=false}
	at io.cdap.cdap.test.IntegrationTestBase.checkServicesWithRetry(IntegrationTestBase.java:265)
	at io.cdap.cdap.test.IntegrationTestBase.fetchAccessToken(IntegrationTestBase.java:233)
	at io.cdap.cdap.test.IntegrationTestBase.fetchAccessToken(IntegrationTestBase.java:218)
	at io.cdap.cdap.test.IntegrationTestBase.checkSystemServices(IntegrationTestBase.java:196)
	at io.cdap.cdap.test.IntegrationTestBase.setUp(IntegrationTestBase.java:97)
	at sun.reflect.GeneratedMethodAccessor1.invoke(Unknown Source)
	at sun.reflect.DelegatingMethodAccessorImpl.invoke(DelegatingMethodAccessorImpl.java:43)
(41 more lines...)
Collapse Failed NormalizeTest testNormalizeWithEmptyAttributeValue History
10 mins
java.util.concurrent.TimeoutException: Unable to connect to Authentication service to obtain access token, Connection info : CLIConnectionConfig{hostname=10.210.0.169, port=11015, sslEnabled=false}
	at io.cdap.cdap.test.IntegrationTestBase.checkServicesWithRetry(IntegrationTestBase.java:265)
	at io.cdap.cdap.test.IntegrationTestBase.fetchAccessToken(IntegrationTestBase.java:233)
	at io.cdap.cdap.test.IntegrationTestBase.fetchAccessToken(IntegrationTestBase.java:218)
	at io.cdap.cdap.test.IntegrationTestBase.checkSystemServices(IntegrationTestBase.java:196)
	at io.cdap.cdap.test.IntegrationTestBase.setUp(IntegrationTestBase.java:97)
	at sun.reflect.GeneratedMethodAccessor1.invoke(Unknown Source)
	at sun.reflect.DelegatingMethodAccessorImpl.invoke(DelegatingMethodAccessorImpl.java:43)
(41 more lines...)
Collapse Failed RowDenormalizerTest test History
10 mins
java.util.concurrent.TimeoutException: Unable to connect to Authentication service to obtain access token, Connection info : CLIConnectionConfig{hostname=10.210.0.169, port=11015, sslEnabled=false}
	at io.cdap.cdap.test.IntegrationTestBase.checkServicesWithRetry(IntegrationTestBase.java:265)
	at io.cdap.cdap.test.IntegrationTestBase.fetchAccessToken(IntegrationTestBase.java:233)
	at io.cdap.cdap.test.IntegrationTestBase.fetchAccessToken(IntegrationTestBase.java:218)
	at io.cdap.cdap.test.IntegrationTestBase.checkSystemServices(IntegrationTestBase.java:196)
	at io.cdap.cdap.test.IntegrationTestBase.setUp(IntegrationTestBase.java:97)
	at sun.reflect.GeneratedMethodAccessor1.invoke(Unknown Source)
	at sun.reflect.DelegatingMethodAccessorImpl.invoke(DelegatingMethodAccessorImpl.java:43)
(40 more lines...)
Collapse Failed TPFSParquetSinkSourceTest testMR History
10 mins
java.util.concurrent.TimeoutException: Unable to connect to Authentication service to obtain access token, Connection info : CLIConnectionConfig{hostname=10.210.0.169, port=11015, sslEnabled=false}
	at io.cdap.cdap.test.IntegrationTestBase.checkServicesWithRetry(IntegrationTestBase.java:265)
	at io.cdap.cdap.test.IntegrationTestBase.fetchAccessToken(IntegrationTestBase.java:233)
	at io.cdap.cdap.test.IntegrationTestBase.fetchAccessToken(IntegrationTestBase.java:218)
	at io.cdap.cdap.test.IntegrationTestBase.checkSystemServices(IntegrationTestBase.java:196)
	at io.cdap.cdap.test.IntegrationTestBase.setUp(IntegrationTestBase.java:97)
	at sun.reflect.GeneratedMethodAccessor1.invoke(Unknown Source)
	at sun.reflect.DelegatingMethodAccessorImpl.invoke(DelegatingMethodAccessorImpl.java:43)
(40 more lines...)
Collapse Failed TPFSParquetSinkSourceTest testSpark History
10 mins
java.util.concurrent.TimeoutException: Unable to connect to Authentication service to obtain access token, Connection info : CLIConnectionConfig{hostname=10.210.0.169, port=11015, sslEnabled=false}
	at io.cdap.cdap.test.IntegrationTestBase.checkServicesWithRetry(IntegrationTestBase.java:265)
	at io.cdap.cdap.test.IntegrationTestBase.fetchAccessToken(IntegrationTestBase.java:233)
	at io.cdap.cdap.test.IntegrationTestBase.fetchAccessToken(IntegrationTestBase.java:218)
	at io.cdap.cdap.test.IntegrationTestBase.checkSystemServices(IntegrationTestBase.java:196)
	at io.cdap.cdap.test.IntegrationTestBase.setUp(IntegrationTestBase.java:97)
	at sun.reflect.GeneratedMethodAccessor1.invoke(Unknown Source)
	at sun.reflect.DelegatingMethodAccessorImpl.invoke(DelegatingMethodAccessorImpl.java:43)
(40 more lines...)
Collapse Failed ValueMapperTest test History
10 mins
java.util.concurrent.TimeoutException: Unable to connect to Authentication service to obtain access token, Connection info : CLIConnectionConfig{hostname=10.210.0.169, port=11015, sslEnabled=false}
	at io.cdap.cdap.test.IntegrationTestBase.checkServicesWithRetry(IntegrationTestBase.java:265)
	at io.cdap.cdap.test.IntegrationTestBase.fetchAccessToken(IntegrationTestBase.java:233)
	at io.cdap.cdap.test.IntegrationTestBase.fetchAccessToken(IntegrationTestBase.java:218)
	at io.cdap.cdap.test.IntegrationTestBase.checkSystemServices(IntegrationTestBase.java:196)
	at io.cdap.cdap.test.IntegrationTestBase.setUp(IntegrationTestBase.java:97)
	at sun.reflect.GeneratedMethodAccessor1.invoke(Unknown Source)
	at sun.reflect.DelegatingMethodAccessorImpl.invoke(DelegatingMethodAccessorImpl.java:43)
(40 more lines...)
Collapse Failed XMLReaderTest testInvalidNodePathWithMoveAction History
10 mins
java.util.concurrent.TimeoutException: Unable to connect to Authentication service to obtain access token, Connection info : CLIConnectionConfig{hostname=10.210.0.169, port=11015, sslEnabled=false}
	at io.cdap.cdap.test.IntegrationTestBase.checkServicesWithRetry(IntegrationTestBase.java:265)
	at io.cdap.cdap.test.IntegrationTestBase.fetchAccessToken(IntegrationTestBase.java:233)
	at io.cdap.cdap.test.IntegrationTestBase.fetchAccessToken(IntegrationTestBase.java:218)
	at io.cdap.cdap.test.IntegrationTestBase.checkSystemServices(IntegrationTestBase.java:196)
	at io.cdap.cdap.test.IntegrationTestBase.setUp(IntegrationTestBase.java:97)
	at sun.reflect.GeneratedMethodAccessor1.invoke(Unknown Source)
	at sun.reflect.DelegatingMethodAccessorImpl.invoke(DelegatingMethodAccessorImpl.java:43)
(40 more lines...)
Collapse Failed XMLReaderTest testInvalidPatternWithDeleteAction History
10 mins
java.util.concurrent.TimeoutException: Unable to connect to Authentication service to obtain access token, Connection info : CLIConnectionConfig{hostname=10.210.0.169, port=11015, sslEnabled=false}
	at io.cdap.cdap.test.IntegrationTestBase.checkServicesWithRetry(IntegrationTestBase.java:265)
	at io.cdap.cdap.test.IntegrationTestBase.fetchAccessToken(IntegrationTestBase.java:233)
	at io.cdap.cdap.test.IntegrationTestBase.fetchAccessToken(IntegrationTestBase.java:218)
	at io.cdap.cdap.test.IntegrationTestBase.checkSystemServices(IntegrationTestBase.java:196)
	at io.cdap.cdap.test.IntegrationTestBase.setUp(IntegrationTestBase.java:97)
	at sun.reflect.GeneratedMethodAccessor1.invoke(Unknown Source)
	at sun.reflect.DelegatingMethodAccessorImpl.invoke(DelegatingMethodAccessorImpl.java:43)
(40 more lines...)
Collapse Failed XMLReaderTest testPatternWithDeleteAction History
10 mins
java.util.concurrent.TimeoutException: Unable to connect to Authentication service to obtain access token, Connection info : CLIConnectionConfig{hostname=10.210.0.169, port=11015, sslEnabled=false}
	at io.cdap.cdap.test.IntegrationTestBase.checkServicesWithRetry(IntegrationTestBase.java:265)
	at io.cdap.cdap.test.IntegrationTestBase.fetchAccessToken(IntegrationTestBase.java:233)
	at io.cdap.cdap.test.IntegrationTestBase.fetchAccessToken(IntegrationTestBase.java:218)
	at io.cdap.cdap.test.IntegrationTestBase.checkSystemServices(IntegrationTestBase.java:196)
	at io.cdap.cdap.test.IntegrationTestBase.setUp(IntegrationTestBase.java:97)
	at sun.reflect.GeneratedMethodAccessor1.invoke(Unknown Source)
	at sun.reflect.DelegatingMethodAccessorImpl.invoke(DelegatingMethodAccessorImpl.java:43)
(40 more lines...)
Collapse Failed XMLReaderTest testPreProcessingNotRequired History
10 mins
java.util.concurrent.TimeoutException: Unable to connect to Authentication service to obtain access token, Connection info : CLIConnectionConfig{hostname=10.210.0.169, port=11015, sslEnabled=false}
	at io.cdap.cdap.test.IntegrationTestBase.checkServicesWithRetry(IntegrationTestBase.java:265)
	at io.cdap.cdap.test.IntegrationTestBase.fetchAccessToken(IntegrationTestBase.java:233)
	at io.cdap.cdap.test.IntegrationTestBase.fetchAccessToken(IntegrationTestBase.java:218)
	at io.cdap.cdap.test.IntegrationTestBase.checkSystemServices(IntegrationTestBase.java:196)
	at io.cdap.cdap.test.IntegrationTestBase.setUp(IntegrationTestBase.java:97)
	at sun.reflect.GeneratedMethodAccessor1.invoke(Unknown Source)
	at sun.reflect.DelegatingMethodAccessorImpl.invoke(DelegatingMethodAccessorImpl.java:43)
(40 more lines...)
Collapse Failed XMLReaderTest testPreProcessingRequired History
10 mins
java.util.concurrent.TimeoutException: Unable to connect to Authentication service to obtain access token, Connection info : CLIConnectionConfig{hostname=10.210.0.169, port=11015, sslEnabled=false}
	at io.cdap.cdap.test.IntegrationTestBase.checkServicesWithRetry(IntegrationTestBase.java:265)
	at io.cdap.cdap.test.IntegrationTestBase.fetchAccessToken(IntegrationTestBase.java:233)
	at io.cdap.cdap.test.IntegrationTestBase.fetchAccessToken(IntegrationTestBase.java:218)
	at io.cdap.cdap.test.IntegrationTestBase.checkSystemServices(IntegrationTestBase.java:196)
	at io.cdap.cdap.test.IntegrationTestBase.setUp(IntegrationTestBase.java:97)
	at sun.reflect.GeneratedMethodAccessor1.invoke(Unknown Source)
	at sun.reflect.DelegatingMethodAccessorImpl.invoke(DelegatingMethodAccessorImpl.java:43)
(40 more lines...)
Collapse Failed WranglerServiceTest test History
10 mins
java.util.concurrent.TimeoutException: Unable to connect to Authentication service to obtain access token, Connection info : CLIConnectionConfig{hostname=10.210.0.169, port=11015, sslEnabled=false}
	at io.cdap.cdap.test.IntegrationTestBase.checkServicesWithRetry(IntegrationTestBase.java:265)
	at io.cdap.cdap.test.IntegrationTestBase.fetchAccessToken(IntegrationTestBase.java:233)
	at io.cdap.cdap.test.IntegrationTestBase.fetchAccessToken(IntegrationTestBase.java:218)
	at io.cdap.cdap.test.IntegrationTestBase.checkSystemServices(IntegrationTestBase.java:196)
	at io.cdap.cdap.test.IntegrationTestBase.setUp(IntegrationTestBase.java:97)
	at sun.reflect.GeneratedMethodAccessor1.invoke(Unknown Source)
	at sun.reflect.DelegatingMethodAccessorImpl.invoke(DelegatingMethodAccessorImpl.java:43)
(40 more lines...)
Collapse Failed WranglerTest testWranglerMR History
10 mins
java.util.concurrent.TimeoutException: Unable to connect to Authentication service to obtain access token, Connection info : CLIConnectionConfig{hostname=10.210.0.169, port=11015, sslEnabled=false}
	at io.cdap.cdap.test.IntegrationTestBase.checkServicesWithRetry(IntegrationTestBase.java:265)
	at io.cdap.cdap.test.IntegrationTestBase.fetchAccessToken(IntegrationTestBase.java:233)
	at io.cdap.cdap.test.IntegrationTestBase.fetchAccessToken(IntegrationTestBase.java:218)
	at io.cdap.cdap.test.IntegrationTestBase.checkSystemServices(IntegrationTestBase.java:196)
	at io.cdap.cdap.test.IntegrationTestBase.setUp(IntegrationTestBase.java:97)
	at sun.reflect.GeneratedMethodAccessor1.invoke(Unknown Source)
	at sun.reflect.DelegatingMethodAccessorImpl.invoke(DelegatingMethodAccessorImpl.java:43)
(40 more lines...)
Collapse Failed WranglerTest testWranglerSpark History
10 mins
java.util.concurrent.TimeoutException: Unable to connect to Authentication service to obtain access token, Connection info : CLIConnectionConfig{hostname=10.210.0.169, port=11015, sslEnabled=false}
	at io.cdap.cdap.test.IntegrationTestBase.checkServicesWithRetry(IntegrationTestBase.java:265)
	at io.cdap.cdap.test.IntegrationTestBase.fetchAccessToken(IntegrationTestBase.java:233)
	at io.cdap.cdap.test.IntegrationTestBase.fetchAccessToken(IntegrationTestBase.java:218)
	at io.cdap.cdap.test.IntegrationTestBase.checkSystemServices(IntegrationTestBase.java:196)
	at io.cdap.cdap.test.IntegrationTestBase.setUp(IntegrationTestBase.java:97)
	at sun.reflect.GeneratedMethodAccessor1.invoke(Unknown Source)
	at sun.reflect.DelegatingMethodAccessorImpl.invoke(DelegatingMethodAccessorImpl.java:43)
(40 more lines...)
Collapse Failed PermissionTest test History
10 mins
java.util.concurrent.TimeoutException: Unable to connect to Authentication service to obtain access token, Connection info : CLIConnectionConfig{hostname=10.210.0.169, port=11015, sslEnabled=false}
	at io.cdap.cdap.test.IntegrationTestBase.checkServicesWithRetry(IntegrationTestBase.java:265)
	at io.cdap.cdap.test.IntegrationTestBase.fetchAccessToken(IntegrationTestBase.java:233)
	at io.cdap.cdap.test.IntegrationTestBase.fetchAccessToken(IntegrationTestBase.java:218)
	at io.cdap.cdap.test.IntegrationTestBase.checkSystemServices(IntegrationTestBase.java:196)
	at io.cdap.cdap.test.IntegrationTestBase.setUp(IntegrationTestBase.java:97)
	at sun.reflect.GeneratedMethodAccessor1.invoke(Unknown Source)
	at sun.reflect.DelegatingMethodAccessorImpl.invoke(DelegatingMethodAccessorImpl.java:43)
(40 more lines...)
Collapse Failed ReadlessIncrementTest testReadlessIncrementsInMapReduce History
10 mins
java.util.concurrent.TimeoutException: Unable to connect to Authentication service to obtain access token, Connection info : CLIConnectionConfig{hostname=10.210.0.169, port=11015, sslEnabled=false}
	at io.cdap.cdap.test.IntegrationTestBase.checkServicesWithRetry(IntegrationTestBase.java:265)
	at io.cdap.cdap.test.IntegrationTestBase.fetchAccessToken(IntegrationTestBase.java:233)
	at io.cdap.cdap.test.IntegrationTestBase.fetchAccessToken(IntegrationTestBase.java:218)
	at io.cdap.cdap.test.IntegrationTestBase.checkSystemServices(IntegrationTestBase.java:196)
	at io.cdap.cdap.test.IntegrationTestBase.setUp(IntegrationTestBase.java:97)
	at sun.reflect.GeneratedMethodAccessor1.invoke(Unknown Source)
	at sun.reflect.DelegatingMethodAccessorImpl.invoke(DelegatingMethodAccessorImpl.java:43)
(40 more lines...)
Collapse Failed HangingWorkerTest testRestart History
10 mins
java.util.concurrent.TimeoutException: Unable to connect to Authentication service to obtain access token, Connection info : CLIConnectionConfig{hostname=10.210.0.169, port=11015, sslEnabled=false}
	at io.cdap.cdap.test.IntegrationTestBase.checkServicesWithRetry(IntegrationTestBase.java:265)
	at io.cdap.cdap.test.IntegrationTestBase.fetchAccessToken(IntegrationTestBase.java:233)
	at io.cdap.cdap.test.IntegrationTestBase.fetchAccessToken(IntegrationTestBase.java:218)
	at io.cdap.cdap.test.IntegrationTestBase.checkSystemServices(IntegrationTestBase.java:196)
	at io.cdap.cdap.test.IntegrationTestBase.setUp(IntegrationTestBase.java:97)
	at sun.reflect.NativeMethodAccessorImpl.invoke0(Native Method)
	at sun.reflect.NativeMethodAccessorImpl.invoke(NativeMethodAccessorImpl.java:62)
(41 more lines...)
Collapse Failed ServiceWorkerTest test History
10 mins
java.util.concurrent.TimeoutException: Unable to connect to Authentication service to obtain access token, Connection info : CLIConnectionConfig{hostname=10.210.0.169, port=11015, sslEnabled=false}
	at io.cdap.cdap.test.IntegrationTestBase.checkServicesWithRetry(IntegrationTestBase.java:265)
	at io.cdap.cdap.test.IntegrationTestBase.fetchAccessToken(IntegrationTestBase.java:233)
	at io.cdap.cdap.test.IntegrationTestBase.fetchAccessToken(IntegrationTestBase.java:218)
	at io.cdap.cdap.test.IntegrationTestBase.checkSystemServices(IntegrationTestBase.java:196)
	at io.cdap.cdap.test.IntegrationTestBase.setUp(IntegrationTestBase.java:97)
	at sun.reflect.GeneratedMethodAccessor1.invoke(Unknown Source)
	at sun.reflect.DelegatingMethodAccessorImpl.invoke(DelegatingMethodAccessorImpl.java:43)
(40 more lines...)
Collapse Failed ApplicationTest test History
10 mins
java.util.concurrent.TimeoutException: Unable to connect to Authentication service to obtain access token, Connection info : CLIConnectionConfig{hostname=10.210.0.169, port=11015, sslEnabled=false}
	at io.cdap.cdap.test.IntegrationTestBase.checkServicesWithRetry(IntegrationTestBase.java:265)
	at io.cdap.cdap.test.IntegrationTestBase.fetchAccessToken(IntegrationTestBase.java:233)
	at io.cdap.cdap.test.IntegrationTestBase.fetchAccessToken(IntegrationTestBase.java:218)
	at io.cdap.cdap.test.IntegrationTestBase.checkSystemServices(IntegrationTestBase.java:196)
	at io.cdap.cdap.test.IntegrationTestBase.setUp(IntegrationTestBase.java:97)
	at sun.reflect.NativeMethodAccessorImpl.invoke0(Native Method)
	at sun.reflect.NativeMethodAccessorImpl.invoke(NativeMethodAccessorImpl.java:62)
(41 more lines...)
Collapse Failed NamespaceTest testNamespaces History
10 mins
java.util.concurrent.TimeoutException: Unable to connect to Authentication service to obtain access token, Connection info : CLIConnectionConfig{hostname=10.210.0.169, port=11015, sslEnabled=false}
	at io.cdap.cdap.test.IntegrationTestBase.checkServicesWithRetry(IntegrationTestBase.java:265)
	at io.cdap.cdap.test.IntegrationTestBase.fetchAccessToken(IntegrationTestBase.java:233)
	at io.cdap.cdap.test.IntegrationTestBase.fetchAccessToken(IntegrationTestBase.java:218)
	at io.cdap.cdap.test.IntegrationTestBase.checkSystemServices(IntegrationTestBase.java:196)
	at io.cdap.cdap.test.IntegrationTestBase.setUp(IntegrationTestBase.java:97)
	at sun.reflect.GeneratedMethodAccessor1.invoke(Unknown Source)
	at sun.reflect.DelegatingMethodAccessorImpl.invoke(DelegatingMethodAccessorImpl.java:43)
(40 more lines...)
Collapse Failed DatasetTest test History
10 mins
java.util.concurrent.TimeoutException: Unable to connect to Authentication service to obtain access token, Connection info : CLIConnectionConfig{hostname=10.210.0.169, port=11015, sslEnabled=false}
	at io.cdap.cdap.test.IntegrationTestBase.checkServicesWithRetry(IntegrationTestBase.java:265)
	at io.cdap.cdap.test.IntegrationTestBase.fetchAccessToken(IntegrationTestBase.java:233)
	at io.cdap.cdap.test.IntegrationTestBase.fetchAccessToken(IntegrationTestBase.java:218)
	at io.cdap.cdap.test.IntegrationTestBase.checkSystemServices(IntegrationTestBase.java:196)
	at io.cdap.cdap.test.IntegrationTestBase.setUp(IntegrationTestBase.java:97)
	at sun.reflect.NativeMethodAccessorImpl.invoke0(Native Method)
	at sun.reflect.NativeMethodAccessorImpl.invoke(NativeMethodAccessorImpl.java:62)
(41 more lines...)
Collapse Failed FileSetTest test History
10 mins
java.util.concurrent.TimeoutException: Unable to connect to Authentication service to obtain access token, Connection info : CLIConnectionConfig{hostname=10.210.0.169, port=11015, sslEnabled=false}
	at io.cdap.cdap.test.IntegrationTestBase.checkServicesWithRetry(IntegrationTestBase.java:265)
	at io.cdap.cdap.test.IntegrationTestBase.fetchAccessToken(IntegrationTestBase.java:233)
	at io.cdap.cdap.test.IntegrationTestBase.fetchAccessToken(IntegrationTestBase.java:218)
	at io.cdap.cdap.test.IntegrationTestBase.checkSystemServices(IntegrationTestBase.java:196)
	at io.cdap.cdap.test.IntegrationTestBase.setUp(IntegrationTestBase.java:97)
	at sun.reflect.NativeMethodAccessorImpl.invoke0(Native Method)
	at sun.reflect.NativeMethodAccessorImpl.invoke(NativeMethodAccessorImpl.java:62)
(41 more lines...)
Collapse Failed PartitionCorrectorTest test History
10 mins
java.util.concurrent.TimeoutException: Unable to connect to Authentication service to obtain access token, Connection info : CLIConnectionConfig{hostname=10.210.0.169, port=11015, sslEnabled=false}
	at io.cdap.cdap.test.IntegrationTestBase.checkServicesWithRetry(IntegrationTestBase.java:265)
	at io.cdap.cdap.test.IntegrationTestBase.fetchAccessToken(IntegrationTestBase.java:233)
	at io.cdap.cdap.test.IntegrationTestBase.fetchAccessToken(IntegrationTestBase.java:218)
	at io.cdap.cdap.test.IntegrationTestBase.checkSystemServices(IntegrationTestBase.java:196)
	at io.cdap.cdap.test.IntegrationTestBase.setUp(IntegrationTestBase.java:97)
	at sun.reflect.GeneratedMethodAccessor1.invoke(Unknown Source)
	at sun.reflect.DelegatingMethodAccessorImpl.invoke(DelegatingMethodAccessorImpl.java:43)
(40 more lines...)
Collapse Failed PartitionedFileSetUpdateTest test History
10 mins
java.util.concurrent.TimeoutException: Unable to connect to Authentication service to obtain access token, Connection info : CLIConnectionConfig{hostname=10.210.0.169, port=11015, sslEnabled=false}
	at io.cdap.cdap.test.IntegrationTestBase.checkServicesWithRetry(IntegrationTestBase.java:265)
	at io.cdap.cdap.test.IntegrationTestBase.fetchAccessToken(IntegrationTestBase.java:233)
	at io.cdap.cdap.test.IntegrationTestBase.fetchAccessToken(IntegrationTestBase.java:218)
	at io.cdap.cdap.test.IntegrationTestBase.checkSystemServices(IntegrationTestBase.java:196)
	at io.cdap.cdap.test.IntegrationTestBase.setUp(IntegrationTestBase.java:97)
	at sun.reflect.GeneratedMethodAccessor1.invoke(Unknown Source)
	at sun.reflect.DelegatingMethodAccessorImpl.invoke(DelegatingMethodAccessorImpl.java:43)
(40 more lines...)
Collapse Failed ProgramMetadataTest testSearchUsingSystemMetadata History
10 mins
java.util.concurrent.TimeoutException: Unable to connect to Authentication service to obtain access token, Connection info : CLIConnectionConfig{hostname=10.210.0.169, port=11015, sslEnabled=false}
	at io.cdap.cdap.test.IntegrationTestBase.checkServicesWithRetry(IntegrationTestBase.java:265)
	at io.cdap.cdap.test.IntegrationTestBase.fetchAccessToken(IntegrationTestBase.java:233)
	at io.cdap.cdap.test.IntegrationTestBase.fetchAccessToken(IntegrationTestBase.java:218)
	at io.cdap.cdap.test.IntegrationTestBase.checkSystemServices(IntegrationTestBase.java:196)
	at io.cdap.cdap.test.IntegrationTestBase.setUp(IntegrationTestBase.java:97)
	at sun.reflect.GeneratedMethodAccessor1.invoke(Unknown Source)
	at sun.reflect.DelegatingMethodAccessorImpl.invoke(DelegatingMethodAccessorImpl.java:43)
(40 more lines...)
Collapse Failed ProgramMetadataTest testWithLineage History
10 mins
java.util.concurrent.TimeoutException: Unable to connect to Authentication service to obtain access token, Connection info : CLIConnectionConfig{hostname=10.210.0.169, port=11015, sslEnabled=false}
	at io.cdap.cdap.test.IntegrationTestBase.checkServicesWithRetry(IntegrationTestBase.java:265)
	at io.cdap.cdap.test.IntegrationTestBase.fetchAccessToken(IntegrationTestBase.java:233)
	at io.cdap.cdap.test.IntegrationTestBase.fetchAccessToken(IntegrationTestBase.java:218)
	at io.cdap.cdap.test.IntegrationTestBase.checkSystemServices(IntegrationTestBase.java:196)
	at io.cdap.cdap.test.IntegrationTestBase.setUp(IntegrationTestBase.java:97)
	at sun.reflect.GeneratedMethodAccessor1.invoke(Unknown Source)
	at sun.reflect.DelegatingMethodAccessorImpl.invoke(DelegatingMethodAccessorImpl.java:43)
(40 more lines...)
Collapse Failed WorkflowTest test History
10 mins
java.util.concurrent.TimeoutException: Unable to connect to Authentication service to obtain access token, Connection info : CLIConnectionConfig{hostname=10.210.0.169, port=11015, sslEnabled=false}
	at io.cdap.cdap.test.IntegrationTestBase.checkServicesWithRetry(IntegrationTestBase.java:265)
	at io.cdap.cdap.test.IntegrationTestBase.fetchAccessToken(IntegrationTestBase.java:233)
	at io.cdap.cdap.test.IntegrationTestBase.fetchAccessToken(IntegrationTestBase.java:218)
	at io.cdap.cdap.test.IntegrationTestBase.checkSystemServices(IntegrationTestBase.java:196)
	at io.cdap.cdap.test.IntegrationTestBase.setUp(IntegrationTestBase.java:97)
	at sun.reflect.GeneratedMethodAccessor1.invoke(Unknown Source)
	at sun.reflect.DelegatingMethodAccessorImpl.invoke(DelegatingMethodAccessorImpl.java:43)
(40 more lines...)
Collapse Failed OperationalStatsTest testCDAPStats History
10 mins
java.util.concurrent.TimeoutException: Unable to connect to Authentication service to obtain access token, Connection info : CLIConnectionConfig{hostname=10.210.0.169, port=11015, sslEnabled=false}
	at io.cdap.cdap.test.IntegrationTestBase.checkServicesWithRetry(IntegrationTestBase.java:265)
	at io.cdap.cdap.test.IntegrationTestBase.fetchAccessToken(IntegrationTestBase.java:233)
	at io.cdap.cdap.test.IntegrationTestBase.fetchAccessToken(IntegrationTestBase.java:218)
	at io.cdap.cdap.test.IntegrationTestBase.checkSystemServices(IntegrationTestBase.java:196)
	at io.cdap.cdap.test.IntegrationTestBase.setUp(IntegrationTestBase.java:97)
	at sun.reflect.GeneratedMethodAccessor1.invoke(Unknown Source)
	at sun.reflect.DelegatingMethodAccessorImpl.invoke(DelegatingMethodAccessorImpl.java:43)
(40 more lines...)
Collapse Failed RemoteCubeTest test History
10 mins
java.util.concurrent.TimeoutException: Unable to connect to Authentication service to obtain access token, Connection info : CLIConnectionConfig{hostname=10.210.0.169, port=11015, sslEnabled=false}
	at io.cdap.cdap.test.IntegrationTestBase.checkServicesWithRetry(IntegrationTestBase.java:265)
	at io.cdap.cdap.test.IntegrationTestBase.fetchAccessToken(IntegrationTestBase.java:233)
	at io.cdap.cdap.test.IntegrationTestBase.fetchAccessToken(IntegrationTestBase.java:218)
	at io.cdap.cdap.test.IntegrationTestBase.checkSystemServices(IntegrationTestBase.java:196)
	at io.cdap.cdap.test.IntegrationTestBase.setUp(IntegrationTestBase.java:97)
	at sun.reflect.GeneratedMethodAccessor1.invoke(Unknown Source)
	at sun.reflect.DelegatingMethodAccessorImpl.invoke(DelegatingMethodAccessorImpl.java:43)
(40 more lines...)
Collapse Failed RemoteKeyValueTest test History
10 mins
java.util.concurrent.TimeoutException: Unable to connect to Authentication service to obtain access token, Connection info : CLIConnectionConfig{hostname=10.210.0.169, port=11015, sslEnabled=false}
	at io.cdap.cdap.test.IntegrationTestBase.checkServicesWithRetry(IntegrationTestBase.java:265)
	at io.cdap.cdap.test.IntegrationTestBase.fetchAccessToken(IntegrationTestBase.java:233)
	at io.cdap.cdap.test.IntegrationTestBase.fetchAccessToken(IntegrationTestBase.java:218)
	at io.cdap.cdap.test.IntegrationTestBase.checkSystemServices(IntegrationTestBase.java:196)
	at io.cdap.cdap.test.IntegrationTestBase.setUp(IntegrationTestBase.java:97)
	at sun.reflect.GeneratedMethodAccessor1.invoke(Unknown Source)
	at sun.reflect.DelegatingMethodAccessorImpl.invoke(DelegatingMethodAccessorImpl.java:43)
(40 more lines...)
Collapse Failed RemoteTableTest test History
10 mins
java.util.concurrent.TimeoutException: Unable to connect to Authentication service to obtain access token, Connection info : CLIConnectionConfig{hostname=10.210.0.169, port=11015, sslEnabled=false}
	at io.cdap.cdap.test.IntegrationTestBase.checkServicesWithRetry(IntegrationTestBase.java:265)
	at io.cdap.cdap.test.IntegrationTestBase.fetchAccessToken(IntegrationTestBase.java:233)
	at io.cdap.cdap.test.IntegrationTestBase.fetchAccessToken(IntegrationTestBase.java:218)
	at io.cdap.cdap.test.IntegrationTestBase.checkSystemServices(IntegrationTestBase.java:196)
	at io.cdap.cdap.test.IntegrationTestBase.setUp(IntegrationTestBase.java:97)
	at sun.reflect.GeneratedMethodAccessor1.invoke(Unknown Source)
	at sun.reflect.DelegatingMethodAccessorImpl.invoke(DelegatingMethodAccessorImpl.java:43)
(40 more lines...)