Build #314

Build: #314 failed

Job: Distro Tests - CDH 5.4 failed

Build log

The build generated 30,455 lines of output.The output is too long and has been truncated to the last 1,000 lines. Download or view full build log

10-Sep-2019 13:43:49         at io.cdap.cdap.test.IntegrationTestBase.fetchAccessToken(IntegrationTestBase.java:233)
10-Sep-2019 13:43:49         at io.cdap.cdap.test.IntegrationTestBase.fetchAccessToken(IntegrationTestBase.java:218)
10-Sep-2019 13:43:49         at io.cdap.cdap.test.IntegrationTestBase.checkSystemServices(IntegrationTestBase.java:196)
10-Sep-2019 13:43:49         at io.cdap.cdap.test.IntegrationTestBase.setUp(IntegrationTestBase.java:97)
10-Sep-2019 13:43:49         at sun.reflect.GeneratedMethodAccessor1.invoke(Unknown Source)
10-Sep-2019 13:43:49         at sun.reflect.DelegatingMethodAccessorImpl.invoke(DelegatingMethodAccessorImpl.java:43)
10-Sep-2019 13:43:49         at java.lang.reflect.Method.invoke(Method.java:498)
10-Sep-2019 13:43:49         at org.junit.runners.model.FrameworkMethod$1.runReflectiveCall(FrameworkMethod.java:50)
10-Sep-2019 13:43:49         at org.junit.internal.runners.model.ReflectiveCallable.run(ReflectiveCallable.java:12)
10-Sep-2019 13:43:49         at org.junit.runners.model.FrameworkMethod.invokeExplosively(FrameworkMethod.java:47)
10-Sep-2019 13:43:49         at org.junit.internal.runners.statements.RunBefores.evaluate(RunBefores.java:24)
10-Sep-2019 13:43:49         at org.junit.internal.runners.statements.RunAfters.evaluate(RunAfters.java:27)
10-Sep-2019 13:43:49         at org.junit.runners.ParentRunner.runLeaf(ParentRunner.java:325)
10-Sep-2019 13:43:49         at org.junit.runners.BlockJUnit4ClassRunner.runChild(BlockJUnit4ClassRunner.java:78)
10-Sep-2019 13:43:49         at org.junit.runners.BlockJUnit4ClassRunner.runChild(BlockJUnit4ClassRunner.java:57)
10-Sep-2019 13:43:49         at org.junit.runners.ParentRunner$3.run(ParentRunner.java:290)
10-Sep-2019 13:43:49         at org.junit.runners.ParentRunner$1.schedule(ParentRunner.java:71)
10-Sep-2019 13:43:49         at org.junit.runners.ParentRunner.runChildren(ParentRunner.java:288)
10-Sep-2019 13:43:49         at org.junit.runners.ParentRunner.access$000(ParentRunner.java:58)
10-Sep-2019 13:43:49         at org.junit.runners.ParentRunner$2.evaluate(ParentRunner.java:268)
10-Sep-2019 13:43:49         at org.junit.rules.ExternalResource$1.evaluate(ExternalResource.java:48)
10-Sep-2019 13:43:49         at org.junit.rules.RunRules.evaluate(RunRules.java:20)
10-Sep-2019 13:43:49         at org.junit.runners.ParentRunner.run(ParentRunner.java:363)
10-Sep-2019 13:43:49         at org.junit.runners.Suite.runChild(Suite.java:128)
10-Sep-2019 13:43:49         at org.junit.runners.Suite.runChild(Suite.java:27)
10-Sep-2019 13:43:49         at org.junit.runners.ParentRunner$3.run(ParentRunner.java:290)
10-Sep-2019 13:43:49         at org.junit.runners.ParentRunner$1.schedule(ParentRunner.java:71)
10-Sep-2019 13:43:49         at org.junit.runners.ParentRunner.runChildren(ParentRunner.java:288)
10-Sep-2019 13:43:49         at org.junit.runners.ParentRunner.access$000(ParentRunner.java:58)
10-Sep-2019 13:43:49         at org.junit.runners.ParentRunner$2.evaluate(ParentRunner.java:268)
10-Sep-2019 13:43:49         at org.junit.runners.ParentRunner.run(ParentRunner.java:363)
10-Sep-2019 13:43:49         at org.junit.runners.Suite.runChild(Suite.java:128)
10-Sep-2019 13:43:49         at org.junit.runners.Suite.runChild(Suite.java:27)
10-Sep-2019 13:43:49         at org.junit.runners.ParentRunner$3.run(ParentRunner.java:290)
10-Sep-2019 13:43:49         at org.junit.runners.ParentRunner$1.schedule(ParentRunner.java:71)
10-Sep-2019 13:43:49         at org.junit.runners.ParentRunner.runChildren(ParentRunner.java:288)
10-Sep-2019 13:43:49         at org.junit.runners.ParentRunner.access$000(ParentRunner.java:58)
10-Sep-2019 13:43:49         at org.junit.runners.ParentRunner$2.evaluate(ParentRunner.java:268)
10-Sep-2019 13:43:49         at org.junit.runners.ParentRunner.run(ParentRunner.java:363)
10-Sep-2019 13:43:49         at org.apache.maven.surefire.junit4.JUnit4Provider.execute(JUnit4Provider.java:283)
10-Sep-2019 13:43:49         at org.apache.maven.surefire.junit4.JUnit4Provider.executeWithRerun(JUnit4Provider.java:173)
10-Sep-2019 13:43:49         at org.apache.maven.surefire.junit4.JUnit4Provider.executeTestSet(JUnit4Provider.java:153)
10-Sep-2019 13:43:49         at org.apache.maven.surefire.junit4.JUnit4Provider.invoke(JUnit4Provider.java:128)
10-Sep-2019 13:43:49         at org.apache.maven.surefire.booter.ForkedBooter.invokeProviderInSameClassLoader(ForkedBooter.java:203)
10-Sep-2019 13:43:49         at org.apache.maven.surefire.booter.ForkedBooter.runSuitesInProcess(ForkedBooter.java:155)
10-Sep-2019 13:43:49         at org.apache.maven.surefire.booter.ForkedBooter.main(ForkedBooter.java:103)
10-Sep-2019 13:43:49
10-Sep-2019 13:43:49 test(io.cdap.cdap.remote.dataset.test.RemoteKeyValueTest)  Time elapsed: 601.897 sec  <<< ERROR!
10-Sep-2019 13:43:49 java.util.concurrent.TimeoutException: Unable to connect to Authentication service to obtain access token, Connection info : CLIConnectionConfig{hostname=10.210.0.169, port=11015, sslEnabled=false}
10-Sep-2019 13:43:49         at io.cdap.cdap.test.IntegrationTestBase.checkServicesWithRetry(IntegrationTestBase.java:265)
10-Sep-2019 13:43:49         at io.cdap.cdap.test.IntegrationTestBase.fetchAccessToken(IntegrationTestBase.java:233)
10-Sep-2019 13:43:49         at io.cdap.cdap.test.IntegrationTestBase.fetchAccessToken(IntegrationTestBase.java:218)
10-Sep-2019 13:43:49         at io.cdap.cdap.test.IntegrationTestBase.checkSystemServices(IntegrationTestBase.java:196)
10-Sep-2019 13:43:49         at io.cdap.cdap.test.IntegrationTestBase.setUp(IntegrationTestBase.java:97)
10-Sep-2019 13:43:49         at sun.reflect.GeneratedMethodAccessor1.invoke(Unknown Source)
10-Sep-2019 13:43:49         at sun.reflect.DelegatingMethodAccessorImpl.invoke(DelegatingMethodAccessorImpl.java:43)
10-Sep-2019 13:43:49         at java.lang.reflect.Method.invoke(Method.java:498)
10-Sep-2019 13:43:49         at org.junit.runners.model.FrameworkMethod$1.runReflectiveCall(FrameworkMethod.java:50)
10-Sep-2019 13:43:49         at org.junit.internal.runners.model.ReflectiveCallable.run(ReflectiveCallable.java:12)
10-Sep-2019 13:43:49         at org.junit.runners.model.FrameworkMethod.invokeExplosively(FrameworkMethod.java:47)
10-Sep-2019 13:43:49         at org.junit.internal.runners.statements.RunBefores.evaluate(RunBefores.java:24)
10-Sep-2019 13:43:49         at org.junit.internal.runners.statements.RunAfters.evaluate(RunAfters.java:27)
10-Sep-2019 13:43:49         at org.junit.runners.ParentRunner.runLeaf(ParentRunner.java:325)
10-Sep-2019 13:43:49         at org.junit.runners.BlockJUnit4ClassRunner.runChild(BlockJUnit4ClassRunner.java:78)
10-Sep-2019 13:43:49         at org.junit.runners.BlockJUnit4ClassRunner.runChild(BlockJUnit4ClassRunner.java:57)
10-Sep-2019 13:43:49         at org.junit.runners.ParentRunner$3.run(ParentRunner.java:290)
10-Sep-2019 13:43:49         at org.junit.runners.ParentRunner$1.schedule(ParentRunner.java:71)
10-Sep-2019 13:43:49         at org.junit.runners.ParentRunner.runChildren(ParentRunner.java:288)
10-Sep-2019 13:43:49         at org.junit.runners.ParentRunner.access$000(ParentRunner.java:58)
10-Sep-2019 13:43:49         at org.junit.runners.ParentRunner$2.evaluate(ParentRunner.java:268)
10-Sep-2019 13:43:49         at org.junit.rules.ExternalResource$1.evaluate(ExternalResource.java:48)
10-Sep-2019 13:43:49         at org.junit.rules.RunRules.evaluate(RunRules.java:20)
10-Sep-2019 13:43:49         at org.junit.runners.ParentRunner.run(ParentRunner.java:363)
10-Sep-2019 13:43:49         at org.junit.runners.Suite.runChild(Suite.java:128)
10-Sep-2019 13:43:49         at org.junit.runners.Suite.runChild(Suite.java:27)
10-Sep-2019 13:43:49         at org.junit.runners.ParentRunner$3.run(ParentRunner.java:290)
10-Sep-2019 13:43:49         at org.junit.runners.ParentRunner$1.schedule(ParentRunner.java:71)
10-Sep-2019 13:43:49         at org.junit.runners.ParentRunner.runChildren(ParentRunner.java:288)
10-Sep-2019 13:43:49         at org.junit.runners.ParentRunner.access$000(ParentRunner.java:58)
10-Sep-2019 13:43:49         at org.junit.runners.ParentRunner$2.evaluate(ParentRunner.java:268)
10-Sep-2019 13:43:49         at org.junit.runners.ParentRunner.run(ParentRunner.java:363)
10-Sep-2019 13:43:49         at org.junit.runners.Suite.runChild(Suite.java:128)
10-Sep-2019 13:43:49         at org.junit.runners.Suite.runChild(Suite.java:27)
10-Sep-2019 13:43:49         at org.junit.runners.ParentRunner$3.run(ParentRunner.java:290)
10-Sep-2019 13:43:49         at org.junit.runners.ParentRunner$1.schedule(ParentRunner.java:71)
10-Sep-2019 13:43:49         at org.junit.runners.ParentRunner.runChildren(ParentRunner.java:288)
10-Sep-2019 13:43:49         at org.junit.runners.ParentRunner.access$000(ParentRunner.java:58)
10-Sep-2019 13:43:49         at org.junit.runners.ParentRunner$2.evaluate(ParentRunner.java:268)
10-Sep-2019 13:43:49         at org.junit.runners.ParentRunner.run(ParentRunner.java:363)
10-Sep-2019 13:43:49         at org.apache.maven.surefire.junit4.JUnit4Provider.execute(JUnit4Provider.java:283)
10-Sep-2019 13:43:49         at org.apache.maven.surefire.junit4.JUnit4Provider.executeWithRerun(JUnit4Provider.java:173)
10-Sep-2019 13:43:49         at org.apache.maven.surefire.junit4.JUnit4Provider.executeTestSet(JUnit4Provider.java:153)
10-Sep-2019 13:43:49         at org.apache.maven.surefire.junit4.JUnit4Provider.invoke(JUnit4Provider.java:128)
10-Sep-2019 13:43:49         at org.apache.maven.surefire.booter.ForkedBooter.invokeProviderInSameClassLoader(ForkedBooter.java:203)
10-Sep-2019 13:43:49         at org.apache.maven.surefire.booter.ForkedBooter.runSuitesInProcess(ForkedBooter.java:155)
10-Sep-2019 13:43:49         at org.apache.maven.surefire.booter.ForkedBooter.main(ForkedBooter.java:103)
10-Sep-2019 13:43:49
10-Sep-2019 13:43:49 test(io.cdap.cdap.remote.dataset.test.RemoteTableTest)  Time elapsed: 601.878 sec  <<< ERROR!
10-Sep-2019 13:43:49 java.util.concurrent.TimeoutException: Unable to connect to Authentication service to obtain access token, Connection info : CLIConnectionConfig{hostname=10.210.0.169, port=11015, sslEnabled=false}
10-Sep-2019 13:43:49         at io.cdap.cdap.test.IntegrationTestBase.checkServicesWithRetry(IntegrationTestBase.java:265)
10-Sep-2019 13:43:49         at io.cdap.cdap.test.IntegrationTestBase.fetchAccessToken(IntegrationTestBase.java:233)
10-Sep-2019 13:43:49         at io.cdap.cdap.test.IntegrationTestBase.fetchAccessToken(IntegrationTestBase.java:218)
10-Sep-2019 13:43:49         at io.cdap.cdap.test.IntegrationTestBase.checkSystemServices(IntegrationTestBase.java:196)
10-Sep-2019 13:43:49         at io.cdap.cdap.test.IntegrationTestBase.setUp(IntegrationTestBase.java:97)
10-Sep-2019 13:43:49         at sun.reflect.GeneratedMethodAccessor1.invoke(Unknown Source)
10-Sep-2019 13:43:49         at sun.reflect.DelegatingMethodAccessorImpl.invoke(DelegatingMethodAccessorImpl.java:43)
10-Sep-2019 13:43:49         at java.lang.reflect.Method.invoke(Method.java:498)
10-Sep-2019 13:43:49         at org.junit.runners.model.FrameworkMethod$1.runReflectiveCall(FrameworkMethod.java:50)
10-Sep-2019 13:43:49         at org.junit.internal.runners.model.ReflectiveCallable.run(ReflectiveCallable.java:12)
10-Sep-2019 13:43:49         at org.junit.runners.model.FrameworkMethod.invokeExplosively(FrameworkMethod.java:47)
10-Sep-2019 13:43:49         at org.junit.internal.runners.statements.RunBefores.evaluate(RunBefores.java:24)
10-Sep-2019 13:43:49         at org.junit.internal.runners.statements.RunAfters.evaluate(RunAfters.java:27)
10-Sep-2019 13:43:49         at org.junit.runners.ParentRunner.runLeaf(ParentRunner.java:325)
10-Sep-2019 13:43:49         at org.junit.runners.BlockJUnit4ClassRunner.runChild(BlockJUnit4ClassRunner.java:78)
10-Sep-2019 13:43:49         at org.junit.runners.BlockJUnit4ClassRunner.runChild(BlockJUnit4ClassRunner.java:57)
10-Sep-2019 13:43:49         at org.junit.runners.ParentRunner$3.run(ParentRunner.java:290)
10-Sep-2019 13:43:49         at org.junit.runners.ParentRunner$1.schedule(ParentRunner.java:71)
10-Sep-2019 13:43:49         at org.junit.runners.ParentRunner.runChildren(ParentRunner.java:288)
10-Sep-2019 13:43:49         at org.junit.runners.ParentRunner.access$000(ParentRunner.java:58)
10-Sep-2019 13:43:49         at org.junit.runners.ParentRunner$2.evaluate(ParentRunner.java:268)
10-Sep-2019 13:43:49         at org.junit.rules.ExternalResource$1.evaluate(ExternalResource.java:48)
10-Sep-2019 13:43:49         at org.junit.rules.RunRules.evaluate(RunRules.java:20)
10-Sep-2019 13:43:49         at org.junit.runners.ParentRunner.run(ParentRunner.java:363)
10-Sep-2019 13:43:49         at org.junit.runners.Suite.runChild(Suite.java:128)
10-Sep-2019 13:43:49         at org.junit.runners.Suite.runChild(Suite.java:27)
10-Sep-2019 13:43:49         at org.junit.runners.ParentRunner$3.run(ParentRunner.java:290)
10-Sep-2019 13:43:49         at org.junit.runners.ParentRunner$1.schedule(ParentRunner.java:71)
10-Sep-2019 13:43:49         at org.junit.runners.ParentRunner.runChildren(ParentRunner.java:288)
10-Sep-2019 13:43:49         at org.junit.runners.ParentRunner.access$000(ParentRunner.java:58)
10-Sep-2019 13:43:49         at org.junit.runners.ParentRunner$2.evaluate(ParentRunner.java:268)
10-Sep-2019 13:43:49         at org.junit.runners.ParentRunner.run(ParentRunner.java:363)
10-Sep-2019 13:43:49         at org.junit.runners.Suite.runChild(Suite.java:128)
10-Sep-2019 13:43:49         at org.junit.runners.Suite.runChild(Suite.java:27)
10-Sep-2019 13:43:49         at org.junit.runners.ParentRunner$3.run(ParentRunner.java:290)
10-Sep-2019 13:43:49         at org.junit.runners.ParentRunner$1.schedule(ParentRunner.java:71)
10-Sep-2019 13:43:49         at org.junit.runners.ParentRunner.runChildren(ParentRunner.java:288)
10-Sep-2019 13:43:49         at org.junit.runners.ParentRunner.access$000(ParentRunner.java:58)
10-Sep-2019 13:43:49         at org.junit.runners.ParentRunner$2.evaluate(ParentRunner.java:268)
10-Sep-2019 13:43:49         at org.junit.runners.ParentRunner.run(ParentRunner.java:363)
10-Sep-2019 13:43:49         at org.apache.maven.surefire.junit4.JUnit4Provider.execute(JUnit4Provider.java:283)
10-Sep-2019 13:43:49         at org.apache.maven.surefire.junit4.JUnit4Provider.executeWithRerun(JUnit4Provider.java:173)
10-Sep-2019 13:43:49         at org.apache.maven.surefire.junit4.JUnit4Provider.executeTestSet(JUnit4Provider.java:153)
10-Sep-2019 13:43:49         at org.apache.maven.surefire.junit4.JUnit4Provider.invoke(JUnit4Provider.java:128)
10-Sep-2019 13:43:49         at org.apache.maven.surefire.booter.ForkedBooter.invokeProviderInSameClassLoader(ForkedBooter.java:203)
10-Sep-2019 13:43:49         at org.apache.maven.surefire.booter.ForkedBooter.runSuitesInProcess(ForkedBooter.java:155)
10-Sep-2019 13:43:49         at org.apache.maven.surefire.booter.ForkedBooter.main(ForkedBooter.java:103)
10-Sep-2019 13:43:49
10-Sep-2019 13:43:49 test(io.cdap.cdap.app.etl.batch.RowDenormalizerTest)  Time elapsed: 601.899 sec  <<< ERROR!
10-Sep-2019 13:43:49 java.util.concurrent.TimeoutException: Unable to connect to Authentication service to obtain access token, Connection info : CLIConnectionConfig{hostname=10.210.0.169, port=11015, sslEnabled=false}
10-Sep-2019 13:43:49         at io.cdap.cdap.test.IntegrationTestBase.checkServicesWithRetry(IntegrationTestBase.java:265)
10-Sep-2019 13:43:49         at io.cdap.cdap.test.IntegrationTestBase.fetchAccessToken(IntegrationTestBase.java:233)
10-Sep-2019 13:43:49         at io.cdap.cdap.test.IntegrationTestBase.fetchAccessToken(IntegrationTestBase.java:218)
10-Sep-2019 13:43:49         at io.cdap.cdap.test.IntegrationTestBase.checkSystemServices(IntegrationTestBase.java:196)
10-Sep-2019 13:43:49         at io.cdap.cdap.test.IntegrationTestBase.setUp(IntegrationTestBase.java:97)
10-Sep-2019 13:43:49         at sun.reflect.GeneratedMethodAccessor1.invoke(Unknown Source)
10-Sep-2019 13:43:49         at sun.reflect.DelegatingMethodAccessorImpl.invoke(DelegatingMethodAccessorImpl.java:43)
10-Sep-2019 13:43:49         at java.lang.reflect.Method.invoke(Method.java:498)
10-Sep-2019 13:43:49         at org.junit.runners.model.FrameworkMethod$1.runReflectiveCall(FrameworkMethod.java:50)
10-Sep-2019 13:43:49         at org.junit.internal.runners.model.ReflectiveCallable.run(ReflectiveCallable.java:12)
10-Sep-2019 13:43:49         at org.junit.runners.model.FrameworkMethod.invokeExplosively(FrameworkMethod.java:47)
10-Sep-2019 13:43:49         at org.junit.internal.runners.statements.RunBefores.evaluate(RunBefores.java:24)
10-Sep-2019 13:43:49         at org.junit.internal.runners.statements.RunAfters.evaluate(RunAfters.java:27)
10-Sep-2019 13:43:49         at org.junit.runners.ParentRunner.runLeaf(ParentRunner.java:325)
10-Sep-2019 13:43:49         at org.junit.runners.BlockJUnit4ClassRunner.runChild(BlockJUnit4ClassRunner.java:78)
10-Sep-2019 13:43:49         at org.junit.runners.BlockJUnit4ClassRunner.runChild(BlockJUnit4ClassRunner.java:57)
10-Sep-2019 13:43:49         at org.junit.runners.ParentRunner$3.run(ParentRunner.java:290)
10-Sep-2019 13:43:49         at org.junit.runners.ParentRunner$1.schedule(ParentRunner.java:71)
10-Sep-2019 13:43:49         at org.junit.runners.ParentRunner.runChildren(ParentRunner.java:288)
10-Sep-2019 13:43:49         at org.junit.runners.ParentRunner.access$000(ParentRunner.java:58)
10-Sep-2019 13:43:49         at org.junit.runners.ParentRunner$2.evaluate(ParentRunner.java:268)
10-Sep-2019 13:43:49         at org.junit.rules.ExternalResource$1.evaluate(ExternalResource.java:48)
10-Sep-2019 13:43:49         at org.junit.rules.RunRules.evaluate(RunRules.java:20)
10-Sep-2019 13:43:49         at org.junit.runners.ParentRunner.run(ParentRunner.java:363)
10-Sep-2019 13:43:49         at org.junit.runners.Suite.runChild(Suite.java:128)
10-Sep-2019 13:43:49         at org.junit.runners.Suite.runChild(Suite.java:27)
10-Sep-2019 13:43:49         at org.junit.runners.ParentRunner$3.run(ParentRunner.java:290)
10-Sep-2019 13:43:49         at org.junit.runners.ParentRunner$1.schedule(ParentRunner.java:71)
10-Sep-2019 13:43:49         at org.junit.runners.ParentRunner.runChildren(ParentRunner.java:288)
10-Sep-2019 13:43:49         at org.junit.runners.ParentRunner.access$000(ParentRunner.java:58)
10-Sep-2019 13:43:49         at org.junit.runners.ParentRunner$2.evaluate(ParentRunner.java:268)
10-Sep-2019 13:43:49         at org.junit.runners.ParentRunner.run(ParentRunner.java:363)
10-Sep-2019 13:43:49         at org.junit.runners.Suite.runChild(Suite.java:128)
10-Sep-2019 13:43:49         at org.junit.runners.Suite.runChild(Suite.java:27)
10-Sep-2019 13:43:49         at org.junit.runners.ParentRunner$3.run(ParentRunner.java:290)
10-Sep-2019 13:43:49         at org.junit.runners.ParentRunner$1.schedule(ParentRunner.java:71)
10-Sep-2019 13:43:49         at org.junit.runners.ParentRunner.runChildren(ParentRunner.java:288)
10-Sep-2019 13:43:49         at org.junit.runners.ParentRunner.access$000(ParentRunner.java:58)
10-Sep-2019 13:43:49         at org.junit.runners.ParentRunner$2.evaluate(ParentRunner.java:268)
10-Sep-2019 13:43:49         at org.junit.runners.ParentRunner.run(ParentRunner.java:363)
10-Sep-2019 13:43:49         at org.apache.maven.surefire.junit4.JUnit4Provider.execute(JUnit4Provider.java:283)
10-Sep-2019 13:43:49         at org.apache.maven.surefire.junit4.JUnit4Provider.executeWithRerun(JUnit4Provider.java:173)
10-Sep-2019 13:43:49         at org.apache.maven.surefire.junit4.JUnit4Provider.executeTestSet(JUnit4Provider.java:153)
10-Sep-2019 13:43:49         at org.apache.maven.surefire.junit4.JUnit4Provider.invoke(JUnit4Provider.java:128)
10-Sep-2019 13:43:49         at org.apache.maven.surefire.booter.ForkedBooter.invokeProviderInSameClassLoader(ForkedBooter.java:203)
10-Sep-2019 13:43:49         at org.apache.maven.surefire.booter.ForkedBooter.runSuitesInProcess(ForkedBooter.java:155)
10-Sep-2019 13:43:49         at org.apache.maven.surefire.booter.ForkedBooter.main(ForkedBooter.java:103)
10-Sep-2019 13:43:49
10-Sep-2019 13:43:49 test(io.cdap.cdap.app.serviceworker.ServiceWorkerTest)  Time elapsed: 601.931 sec  <<< ERROR!
10-Sep-2019 13:43:49 java.util.concurrent.TimeoutException: Unable to connect to Authentication service to obtain access token, Connection info : CLIConnectionConfig{hostname=10.210.0.169, port=11015, sslEnabled=false}
10-Sep-2019 13:43:49         at io.cdap.cdap.test.IntegrationTestBase.checkServicesWithRetry(IntegrationTestBase.java:265)
10-Sep-2019 13:43:49         at io.cdap.cdap.test.IntegrationTestBase.fetchAccessToken(IntegrationTestBase.java:233)
10-Sep-2019 13:43:49         at io.cdap.cdap.test.IntegrationTestBase.fetchAccessToken(IntegrationTestBase.java:218)
10-Sep-2019 13:43:49         at io.cdap.cdap.test.IntegrationTestBase.checkSystemServices(IntegrationTestBase.java:196)
10-Sep-2019 13:43:49         at io.cdap.cdap.test.IntegrationTestBase.setUp(IntegrationTestBase.java:97)
10-Sep-2019 13:43:49         at sun.reflect.GeneratedMethodAccessor1.invoke(Unknown Source)
10-Sep-2019 13:43:49         at sun.reflect.DelegatingMethodAccessorImpl.invoke(DelegatingMethodAccessorImpl.java:43)
10-Sep-2019 13:43:49         at java.lang.reflect.Method.invoke(Method.java:498)
10-Sep-2019 13:43:49         at org.junit.runners.model.FrameworkMethod$1.runReflectiveCall(FrameworkMethod.java:50)
10-Sep-2019 13:43:49         at org.junit.internal.runners.model.ReflectiveCallable.run(ReflectiveCallable.java:12)
10-Sep-2019 13:43:49         at org.junit.runners.model.FrameworkMethod.invokeExplosively(FrameworkMethod.java:47)
10-Sep-2019 13:43:49         at org.junit.internal.runners.statements.RunBefores.evaluate(RunBefores.java:24)
10-Sep-2019 13:43:49         at org.junit.internal.runners.statements.RunAfters.evaluate(RunAfters.java:27)
10-Sep-2019 13:43:49         at org.junit.runners.ParentRunner.runLeaf(ParentRunner.java:325)
10-Sep-2019 13:43:49         at org.junit.runners.BlockJUnit4ClassRunner.runChild(BlockJUnit4ClassRunner.java:78)
10-Sep-2019 13:43:49         at org.junit.runners.BlockJUnit4ClassRunner.runChild(BlockJUnit4ClassRunner.java:57)
10-Sep-2019 13:43:49         at org.junit.runners.ParentRunner$3.run(ParentRunner.java:290)
10-Sep-2019 13:43:49         at org.junit.runners.ParentRunner$1.schedule(ParentRunner.java:71)
10-Sep-2019 13:43:49         at org.junit.runners.ParentRunner.runChildren(ParentRunner.java:288)
10-Sep-2019 13:43:49         at org.junit.runners.ParentRunner.access$000(ParentRunner.java:58)
10-Sep-2019 13:43:49         at org.junit.runners.ParentRunner$2.evaluate(ParentRunner.java:268)
10-Sep-2019 13:43:49         at org.junit.rules.ExternalResource$1.evaluate(ExternalResource.java:48)
10-Sep-2019 13:43:49         at org.junit.rules.RunRules.evaluate(RunRules.java:20)
10-Sep-2019 13:43:49         at org.junit.runners.ParentRunner.run(ParentRunner.java:363)
10-Sep-2019 13:43:49         at org.junit.runners.Suite.runChild(Suite.java:128)
10-Sep-2019 13:43:49         at org.junit.runners.Suite.runChild(Suite.java:27)
10-Sep-2019 13:43:49         at org.junit.runners.ParentRunner$3.run(ParentRunner.java:290)
10-Sep-2019 13:43:49         at org.junit.runners.ParentRunner$1.schedule(ParentRunner.java:71)
10-Sep-2019 13:43:49         at org.junit.runners.ParentRunner.runChildren(ParentRunner.java:288)
10-Sep-2019 13:43:49         at org.junit.runners.ParentRunner.access$000(ParentRunner.java:58)
10-Sep-2019 13:43:49         at org.junit.runners.ParentRunner$2.evaluate(ParentRunner.java:268)
10-Sep-2019 13:43:49         at org.junit.runners.ParentRunner.run(ParentRunner.java:363)
10-Sep-2019 13:43:49         at org.junit.runners.Suite.runChild(Suite.java:128)
10-Sep-2019 13:43:49         at org.junit.runners.Suite.runChild(Suite.java:27)
10-Sep-2019 13:43:49         at org.junit.runners.ParentRunner$3.run(ParentRunner.java:290)
10-Sep-2019 13:43:49         at org.junit.runners.ParentRunner$1.schedule(ParentRunner.java:71)
10-Sep-2019 13:43:49         at org.junit.runners.ParentRunner.runChildren(ParentRunner.java:288)
10-Sep-2019 13:43:49         at org.junit.runners.ParentRunner.access$000(ParentRunner.java:58)
10-Sep-2019 13:43:49         at org.junit.runners.ParentRunner$2.evaluate(ParentRunner.java:268)
10-Sep-2019 13:43:49         at org.junit.runners.ParentRunner.run(ParentRunner.java:363)
10-Sep-2019 13:43:49         at org.apache.maven.surefire.junit4.JUnit4Provider.execute(JUnit4Provider.java:283)
10-Sep-2019 13:43:49         at org.apache.maven.surefire.junit4.JUnit4Provider.executeWithRerun(JUnit4Provider.java:173)
10-Sep-2019 13:43:49         at org.apache.maven.surefire.junit4.JUnit4Provider.executeTestSet(JUnit4Provider.java:153)
10-Sep-2019 13:43:49         at org.apache.maven.surefire.junit4.JUnit4Provider.invoke(JUnit4Provider.java:128)
10-Sep-2019 13:43:49         at org.apache.maven.surefire.booter.ForkedBooter.invokeProviderInSameClassLoader(ForkedBooter.java:203)
10-Sep-2019 13:43:49         at org.apache.maven.surefire.booter.ForkedBooter.runSuitesInProcess(ForkedBooter.java:155)
10-Sep-2019 13:43:49         at org.apache.maven.surefire.booter.ForkedBooter.main(ForkedBooter.java:103)
10-Sep-2019 13:43:49
10-Sep-2019 13:43:49 testTPFSWithProjection(io.cdap.cdap.app.etl.TPFSAvroSinkSourceTest)  Time elapsed: 601.939 sec  <<< ERROR!
10-Sep-2019 13:43:49 java.util.concurrent.TimeoutException: Unable to connect to Authentication service to obtain access token, Connection info : CLIConnectionConfig{hostname=10.210.0.169, port=11015, sslEnabled=false}
10-Sep-2019 13:43:49         at io.cdap.cdap.test.IntegrationTestBase.checkServicesWithRetry(IntegrationTestBase.java:265)
10-Sep-2019 13:43:49         at io.cdap.cdap.test.IntegrationTestBase.fetchAccessToken(IntegrationTestBase.java:233)
10-Sep-2019 13:43:49         at io.cdap.cdap.test.IntegrationTestBase.fetchAccessToken(IntegrationTestBase.java:218)
10-Sep-2019 13:43:49         at io.cdap.cdap.test.IntegrationTestBase.checkSystemServices(IntegrationTestBase.java:196)
10-Sep-2019 13:43:49         at io.cdap.cdap.test.IntegrationTestBase.setUp(IntegrationTestBase.java:97)
10-Sep-2019 13:43:49         at sun.reflect.GeneratedMethodAccessor1.invoke(Unknown Source)
10-Sep-2019 13:43:49         at sun.reflect.DelegatingMethodAccessorImpl.invoke(DelegatingMethodAccessorImpl.java:43)
10-Sep-2019 13:43:49         at java.lang.reflect.Method.invoke(Method.java:498)
10-Sep-2019 13:43:49         at org.junit.runners.model.FrameworkMethod$1.runReflectiveCall(FrameworkMethod.java:50)
10-Sep-2019 13:43:49         at org.junit.internal.runners.model.ReflectiveCallable.run(ReflectiveCallable.java:12)
10-Sep-2019 13:43:49         at org.junit.runners.model.FrameworkMethod.invokeExplosively(FrameworkMethod.java:47)
10-Sep-2019 13:43:49         at org.junit.internal.runners.statements.RunBefores.evaluate(RunBefores.java:24)
10-Sep-2019 13:43:49         at org.junit.internal.runners.statements.RunAfters.evaluate(RunAfters.java:27)
10-Sep-2019 13:43:49         at org.junit.runners.ParentRunner.runLeaf(ParentRunner.java:325)
10-Sep-2019 13:43:49         at org.junit.runners.BlockJUnit4ClassRunner.runChild(BlockJUnit4ClassRunner.java:78)
10-Sep-2019 13:43:49         at org.junit.runners.BlockJUnit4ClassRunner.runChild(BlockJUnit4ClassRunner.java:57)
10-Sep-2019 13:43:49         at org.junit.runners.ParentRunner$3.run(ParentRunner.java:290)
10-Sep-2019 13:43:49         at org.junit.runners.ParentRunner$1.schedule(ParentRunner.java:71)
10-Sep-2019 13:43:49         at org.junit.runners.ParentRunner.runChildren(ParentRunner.java:288)
10-Sep-2019 13:43:49         at org.junit.runners.ParentRunner.access$000(ParentRunner.java:58)
10-Sep-2019 13:43:49         at org.junit.runners.ParentRunner$2.evaluate(ParentRunner.java:268)
10-Sep-2019 13:43:49         at org.junit.rules.ExternalResource$1.evaluate(ExternalResource.java:48)
10-Sep-2019 13:43:49         at org.junit.rules.RunRules.evaluate(RunRules.java:20)
10-Sep-2019 13:43:49         at org.junit.runners.ParentRunner.run(ParentRunner.java:363)
10-Sep-2019 13:43:49         at org.junit.runners.Suite.runChild(Suite.java:128)
10-Sep-2019 13:43:49         at org.junit.runners.Suite.runChild(Suite.java:27)
10-Sep-2019 13:43:49         at org.junit.runners.ParentRunner$3.run(ParentRunner.java:290)
10-Sep-2019 13:43:49         at org.junit.runners.ParentRunner$1.schedule(ParentRunner.java:71)
10-Sep-2019 13:43:49         at org.junit.runners.ParentRunner.runChildren(ParentRunner.java:288)
10-Sep-2019 13:43:49         at org.junit.runners.ParentRunner.access$000(ParentRunner.java:58)
10-Sep-2019 13:43:49         at org.junit.runners.ParentRunner$2.evaluate(ParentRunner.java:268)
10-Sep-2019 13:43:49         at org.junit.runners.ParentRunner.run(ParentRunner.java:363)
10-Sep-2019 13:43:49         at org.junit.runners.Suite.runChild(Suite.java:128)
10-Sep-2019 13:43:49         at org.junit.runners.Suite.runChild(Suite.java:27)
10-Sep-2019 13:43:49         at org.junit.runners.ParentRunner$3.run(ParentRunner.java:290)
10-Sep-2019 13:43:49         at org.junit.runners.ParentRunner$1.schedule(ParentRunner.java:71)
10-Sep-2019 13:43:49         at org.junit.runners.ParentRunner.runChildren(ParentRunner.java:288)
10-Sep-2019 13:43:49         at org.junit.runners.ParentRunner.access$000(ParentRunner.java:58)
10-Sep-2019 13:43:49         at org.junit.runners.ParentRunner$2.evaluate(ParentRunner.java:268)
10-Sep-2019 13:43:49         at org.junit.runners.ParentRunner.run(ParentRunner.java:363)
10-Sep-2019 13:43:49         at org.apache.maven.surefire.junit4.JUnit4Provider.execute(JUnit4Provider.java:283)
10-Sep-2019 13:43:49         at org.apache.maven.surefire.junit4.JUnit4Provider.executeWithRerun(JUnit4Provider.java:173)
10-Sep-2019 13:43:49         at org.apache.maven.surefire.junit4.JUnit4Provider.executeTestSet(JUnit4Provider.java:153)
10-Sep-2019 13:43:49         at org.apache.maven.surefire.junit4.JUnit4Provider.invoke(JUnit4Provider.java:128)
10-Sep-2019 13:43:49         at org.apache.maven.surefire.booter.ForkedBooter.invokeProviderInSameClassLoader(ForkedBooter.java:203)
10-Sep-2019 13:43:49         at org.apache.maven.surefire.booter.ForkedBooter.runSuitesInProcess(ForkedBooter.java:155)
10-Sep-2019 13:43:49         at org.apache.maven.surefire.booter.ForkedBooter.main(ForkedBooter.java:103)
10-Sep-2019 13:43:49
10-Sep-2019 13:43:49 testSpark(io.cdap.cdap.app.etl.batch.TPFSParquetSinkSourceTest)  Time elapsed: 601.885 sec  <<< ERROR!
10-Sep-2019 13:43:49 java.util.concurrent.TimeoutException: Unable to connect to Authentication service to obtain access token, Connection info : CLIConnectionConfig{hostname=10.210.0.169, port=11015, sslEnabled=false}
10-Sep-2019 13:43:49         at io.cdap.cdap.test.IntegrationTestBase.checkServicesWithRetry(IntegrationTestBase.java:265)
10-Sep-2019 13:43:49         at io.cdap.cdap.test.IntegrationTestBase.fetchAccessToken(IntegrationTestBase.java:233)
10-Sep-2019 13:43:49         at io.cdap.cdap.test.IntegrationTestBase.fetchAccessToken(IntegrationTestBase.java:218)
10-Sep-2019 13:43:49         at io.cdap.cdap.test.IntegrationTestBase.checkSystemServices(IntegrationTestBase.java:196)
10-Sep-2019 13:43:49         at io.cdap.cdap.test.IntegrationTestBase.setUp(IntegrationTestBase.java:97)
10-Sep-2019 13:43:49         at sun.reflect.GeneratedMethodAccessor1.invoke(Unknown Source)
10-Sep-2019 13:43:49         at sun.reflect.DelegatingMethodAccessorImpl.invoke(DelegatingMethodAccessorImpl.java:43)
10-Sep-2019 13:43:49         at java.lang.reflect.Method.invoke(Method.java:498)
10-Sep-2019 13:43:49         at org.junit.runners.model.FrameworkMethod$1.runReflectiveCall(FrameworkMethod.java:50)
10-Sep-2019 13:43:49         at org.junit.internal.runners.model.ReflectiveCallable.run(ReflectiveCallable.java:12)
10-Sep-2019 13:43:49         at org.junit.runners.model.FrameworkMethod.invokeExplosively(FrameworkMethod.java:47)
10-Sep-2019 13:43:49         at org.junit.internal.runners.statements.RunBefores.evaluate(RunBefores.java:24)
10-Sep-2019 13:43:49         at org.junit.internal.runners.statements.RunAfters.evaluate(RunAfters.java:27)
10-Sep-2019 13:43:49         at org.junit.runners.ParentRunner.runLeaf(ParentRunner.java:325)
10-Sep-2019 13:43:49         at org.junit.runners.BlockJUnit4ClassRunner.runChild(BlockJUnit4ClassRunner.java:78)
10-Sep-2019 13:43:49         at org.junit.runners.BlockJUnit4ClassRunner.runChild(BlockJUnit4ClassRunner.java:57)
10-Sep-2019 13:43:49         at org.junit.runners.ParentRunner$3.run(ParentRunner.java:290)
10-Sep-2019 13:43:49         at org.junit.runners.ParentRunner$1.schedule(ParentRunner.java:71)
10-Sep-2019 13:43:49         at org.junit.runners.ParentRunner.runChildren(ParentRunner.java:288)
10-Sep-2019 13:43:49         at org.junit.runners.ParentRunner.access$000(ParentRunner.java:58)
10-Sep-2019 13:43:49         at org.junit.runners.ParentRunner$2.evaluate(ParentRunner.java:268)
10-Sep-2019 13:43:49         at org.junit.rules.ExternalResource$1.evaluate(ExternalResource.java:48)
10-Sep-2019 13:43:49         at org.junit.rules.RunRules.evaluate(RunRules.java:20)
10-Sep-2019 13:43:49         at org.junit.runners.ParentRunner.run(ParentRunner.java:363)
10-Sep-2019 13:43:49         at org.junit.runners.Suite.runChild(Suite.java:128)
10-Sep-2019 13:43:49         at org.junit.runners.Suite.runChild(Suite.java:27)
10-Sep-2019 13:43:49         at org.junit.runners.ParentRunner$3.run(ParentRunner.java:290)
10-Sep-2019 13:43:49         at org.junit.runners.ParentRunner$1.schedule(ParentRunner.java:71)
10-Sep-2019 13:43:49         at org.junit.runners.ParentRunner.runChildren(ParentRunner.java:288)
10-Sep-2019 13:43:49         at org.junit.runners.ParentRunner.access$000(ParentRunner.java:58)
10-Sep-2019 13:43:49         at org.junit.runners.ParentRunner$2.evaluate(ParentRunner.java:268)
10-Sep-2019 13:43:49         at org.junit.runners.ParentRunner.run(ParentRunner.java:363)
10-Sep-2019 13:43:49         at org.junit.runners.Suite.runChild(Suite.java:128)
10-Sep-2019 13:43:49         at org.junit.runners.Suite.runChild(Suite.java:27)
10-Sep-2019 13:43:49         at org.junit.runners.ParentRunner$3.run(ParentRunner.java:290)
10-Sep-2019 13:43:49         at org.junit.runners.ParentRunner$1.schedule(ParentRunner.java:71)
10-Sep-2019 13:43:49         at org.junit.runners.ParentRunner.runChildren(ParentRunner.java:288)
10-Sep-2019 13:43:49         at org.junit.runners.ParentRunner.access$000(ParentRunner.java:58)
10-Sep-2019 13:43:49         at org.junit.runners.ParentRunner$2.evaluate(ParentRunner.java:268)
10-Sep-2019 13:43:49         at org.junit.runners.ParentRunner.run(ParentRunner.java:363)
10-Sep-2019 13:43:49         at org.apache.maven.surefire.junit4.JUnit4Provider.execute(JUnit4Provider.java:283)
10-Sep-2019 13:43:49         at org.apache.maven.surefire.junit4.JUnit4Provider.executeWithRerun(JUnit4Provider.java:173)
10-Sep-2019 13:43:49         at org.apache.maven.surefire.junit4.JUnit4Provider.executeTestSet(JUnit4Provider.java:153)
10-Sep-2019 13:43:49         at org.apache.maven.surefire.junit4.JUnit4Provider.invoke(JUnit4Provider.java:128)
10-Sep-2019 13:43:49         at org.apache.maven.surefire.booter.ForkedBooter.invokeProviderInSameClassLoader(ForkedBooter.java:203)
10-Sep-2019 13:43:49         at org.apache.maven.surefire.booter.ForkedBooter.runSuitesInProcess(ForkedBooter.java:155)
10-Sep-2019 13:43:49         at org.apache.maven.surefire.booter.ForkedBooter.main(ForkedBooter.java:103)
10-Sep-2019 13:43:49
10-Sep-2019 13:43:49 testMR(io.cdap.cdap.app.etl.batch.TPFSParquetSinkSourceTest)  Time elapsed: 601.923 sec  <<< ERROR!
10-Sep-2019 13:43:49 java.util.concurrent.TimeoutException: Unable to connect to Authentication service to obtain access token, Connection info : CLIConnectionConfig{hostname=10.210.0.169, port=11015, sslEnabled=false}
10-Sep-2019 13:43:49         at io.cdap.cdap.test.IntegrationTestBase.checkServicesWithRetry(IntegrationTestBase.java:265)
10-Sep-2019 13:43:49         at io.cdap.cdap.test.IntegrationTestBase.fetchAccessToken(IntegrationTestBase.java:233)
10-Sep-2019 13:43:49         at io.cdap.cdap.test.IntegrationTestBase.fetchAccessToken(IntegrationTestBase.java:218)
10-Sep-2019 13:43:49         at io.cdap.cdap.test.IntegrationTestBase.checkSystemServices(IntegrationTestBase.java:196)
10-Sep-2019 13:43:49         at io.cdap.cdap.test.IntegrationTestBase.setUp(IntegrationTestBase.java:97)
10-Sep-2019 13:43:49         at sun.reflect.GeneratedMethodAccessor1.invoke(Unknown Source)
10-Sep-2019 13:43:49         at sun.reflect.DelegatingMethodAccessorImpl.invoke(DelegatingMethodAccessorImpl.java:43)
10-Sep-2019 13:43:49         at java.lang.reflect.Method.invoke(Method.java:498)
10-Sep-2019 13:43:49         at org.junit.runners.model.FrameworkMethod$1.runReflectiveCall(FrameworkMethod.java:50)
10-Sep-2019 13:43:49         at org.junit.internal.runners.model.ReflectiveCallable.run(ReflectiveCallable.java:12)
10-Sep-2019 13:43:49         at org.junit.runners.model.FrameworkMethod.invokeExplosively(FrameworkMethod.java:47)
10-Sep-2019 13:43:49         at org.junit.internal.runners.statements.RunBefores.evaluate(RunBefores.java:24)
10-Sep-2019 13:43:49         at org.junit.internal.runners.statements.RunAfters.evaluate(RunAfters.java:27)
10-Sep-2019 13:43:49         at org.junit.runners.ParentRunner.runLeaf(ParentRunner.java:325)
10-Sep-2019 13:43:49         at org.junit.runners.BlockJUnit4ClassRunner.runChild(BlockJUnit4ClassRunner.java:78)
10-Sep-2019 13:43:49         at org.junit.runners.BlockJUnit4ClassRunner.runChild(BlockJUnit4ClassRunner.java:57)
10-Sep-2019 13:43:49         at org.junit.runners.ParentRunner$3.run(ParentRunner.java:290)
10-Sep-2019 13:43:49         at org.junit.runners.ParentRunner$1.schedule(ParentRunner.java:71)
10-Sep-2019 13:43:49         at org.junit.runners.ParentRunner.runChildren(ParentRunner.java:288)
10-Sep-2019 13:43:49         at org.junit.runners.ParentRunner.access$000(ParentRunner.java:58)
10-Sep-2019 13:43:49         at org.junit.runners.ParentRunner$2.evaluate(ParentRunner.java:268)
10-Sep-2019 13:43:49         at org.junit.rules.ExternalResource$1.evaluate(ExternalResource.java:48)
10-Sep-2019 13:43:49         at org.junit.rules.RunRules.evaluate(RunRules.java:20)
10-Sep-2019 13:43:49         at org.junit.runners.ParentRunner.run(ParentRunner.java:363)
10-Sep-2019 13:43:49         at org.junit.runners.Suite.runChild(Suite.java:128)
10-Sep-2019 13:43:49         at org.junit.runners.Suite.runChild(Suite.java:27)
10-Sep-2019 13:43:49         at org.junit.runners.ParentRunner$3.run(ParentRunner.java:290)
10-Sep-2019 13:43:49         at org.junit.runners.ParentRunner$1.schedule(ParentRunner.java:71)
10-Sep-2019 13:43:49         at org.junit.runners.ParentRunner.runChildren(ParentRunner.java:288)
10-Sep-2019 13:43:49         at org.junit.runners.ParentRunner.access$000(ParentRunner.java:58)
10-Sep-2019 13:43:49         at org.junit.runners.ParentRunner$2.evaluate(ParentRunner.java:268)
10-Sep-2019 13:43:49         at org.junit.runners.ParentRunner.run(ParentRunner.java:363)
10-Sep-2019 13:43:49         at org.junit.runners.Suite.runChild(Suite.java:128)
10-Sep-2019 13:43:49         at org.junit.runners.Suite.runChild(Suite.java:27)
10-Sep-2019 13:43:49         at org.junit.runners.ParentRunner$3.run(ParentRunner.java:290)
10-Sep-2019 13:43:49         at org.junit.runners.ParentRunner$1.schedule(ParentRunner.java:71)
10-Sep-2019 13:43:49         at org.junit.runners.ParentRunner.runChildren(ParentRunner.java:288)
10-Sep-2019 13:43:49         at org.junit.runners.ParentRunner.access$000(ParentRunner.java:58)
10-Sep-2019 13:43:49         at org.junit.runners.ParentRunner$2.evaluate(ParentRunner.java:268)
10-Sep-2019 13:43:49         at org.junit.runners.ParentRunner.run(ParentRunner.java:363)
10-Sep-2019 13:43:49         at org.apache.maven.surefire.junit4.JUnit4Provider.execute(JUnit4Provider.java:283)
10-Sep-2019 13:43:49         at org.apache.maven.surefire.junit4.JUnit4Provider.executeWithRerun(JUnit4Provider.java:173)
10-Sep-2019 13:43:49         at org.apache.maven.surefire.junit4.JUnit4Provider.executeTestSet(JUnit4Provider.java:153)
10-Sep-2019 13:43:49         at org.apache.maven.surefire.junit4.JUnit4Provider.invoke(JUnit4Provider.java:128)
10-Sep-2019 13:43:49         at org.apache.maven.surefire.booter.ForkedBooter.invokeProviderInSameClassLoader(ForkedBooter.java:203)
10-Sep-2019 13:43:49         at org.apache.maven.surefire.booter.ForkedBooter.runSuitesInProcess(ForkedBooter.java:155)
10-Sep-2019 13:43:49         at org.apache.maven.surefire.booter.ForkedBooter.main(ForkedBooter.java:103)
10-Sep-2019 13:43:49
10-Sep-2019 13:43:49 test(io.cdap.cdap.app.etl.batch.ValueMapperTest)  Time elapsed: 601.901 sec  <<< ERROR!
10-Sep-2019 13:43:49 java.util.concurrent.TimeoutException: Unable to connect to Authentication service to obtain access token, Connection info : CLIConnectionConfig{hostname=10.210.0.169, port=11015, sslEnabled=false}
10-Sep-2019 13:43:49         at io.cdap.cdap.test.IntegrationTestBase.checkServicesWithRetry(IntegrationTestBase.java:265)
10-Sep-2019 13:43:49         at io.cdap.cdap.test.IntegrationTestBase.fetchAccessToken(IntegrationTestBase.java:233)
10-Sep-2019 13:43:49         at io.cdap.cdap.test.IntegrationTestBase.fetchAccessToken(IntegrationTestBase.java:218)
10-Sep-2019 13:43:49         at io.cdap.cdap.test.IntegrationTestBase.checkSystemServices(IntegrationTestBase.java:196)
10-Sep-2019 13:43:49         at io.cdap.cdap.test.IntegrationTestBase.setUp(IntegrationTestBase.java:97)
10-Sep-2019 13:43:49         at sun.reflect.GeneratedMethodAccessor1.invoke(Unknown Source)
10-Sep-2019 13:43:49         at sun.reflect.DelegatingMethodAccessorImpl.invoke(DelegatingMethodAccessorImpl.java:43)
10-Sep-2019 13:43:49         at java.lang.reflect.Method.invoke(Method.java:498)
10-Sep-2019 13:43:49         at org.junit.runners.model.FrameworkMethod$1.runReflectiveCall(FrameworkMethod.java:50)
10-Sep-2019 13:43:49         at org.junit.internal.runners.model.ReflectiveCallable.run(ReflectiveCallable.java:12)
10-Sep-2019 13:43:49         at org.junit.runners.model.FrameworkMethod.invokeExplosively(FrameworkMethod.java:47)
10-Sep-2019 13:43:49         at org.junit.internal.runners.statements.RunBefores.evaluate(RunBefores.java:24)
10-Sep-2019 13:43:49         at org.junit.internal.runners.statements.RunAfters.evaluate(RunAfters.java:27)
10-Sep-2019 13:43:49         at org.junit.runners.ParentRunner.runLeaf(ParentRunner.java:325)
10-Sep-2019 13:43:49         at org.junit.runners.BlockJUnit4ClassRunner.runChild(BlockJUnit4ClassRunner.java:78)
10-Sep-2019 13:43:49         at org.junit.runners.BlockJUnit4ClassRunner.runChild(BlockJUnit4ClassRunner.java:57)
10-Sep-2019 13:43:49         at org.junit.runners.ParentRunner$3.run(ParentRunner.java:290)
10-Sep-2019 13:43:49         at org.junit.runners.ParentRunner$1.schedule(ParentRunner.java:71)
10-Sep-2019 13:43:49         at org.junit.runners.ParentRunner.runChildren(ParentRunner.java:288)
10-Sep-2019 13:43:49         at org.junit.runners.ParentRunner.access$000(ParentRunner.java:58)
10-Sep-2019 13:43:49         at org.junit.runners.ParentRunner$2.evaluate(ParentRunner.java:268)
10-Sep-2019 13:43:49         at org.junit.rules.ExternalResource$1.evaluate(ExternalResource.java:48)
10-Sep-2019 13:43:49         at org.junit.rules.RunRules.evaluate(RunRules.java:20)
10-Sep-2019 13:43:49         at org.junit.runners.ParentRunner.run(ParentRunner.java:363)
10-Sep-2019 13:43:49         at org.junit.runners.Suite.runChild(Suite.java:128)
10-Sep-2019 13:43:49         at org.junit.runners.Suite.runChild(Suite.java:27)
10-Sep-2019 13:43:49         at org.junit.runners.ParentRunner$3.run(ParentRunner.java:290)
10-Sep-2019 13:43:49         at org.junit.runners.ParentRunner$1.schedule(ParentRunner.java:71)
10-Sep-2019 13:43:49         at org.junit.runners.ParentRunner.runChildren(ParentRunner.java:288)
10-Sep-2019 13:43:49         at org.junit.runners.ParentRunner.access$000(ParentRunner.java:58)
10-Sep-2019 13:43:49         at org.junit.runners.ParentRunner$2.evaluate(ParentRunner.java:268)
10-Sep-2019 13:43:49         at org.junit.runners.ParentRunner.run(ParentRunner.java:363)
10-Sep-2019 13:43:49         at org.junit.runners.Suite.runChild(Suite.java:128)
10-Sep-2019 13:43:49         at org.junit.runners.Suite.runChild(Suite.java:27)
10-Sep-2019 13:43:49         at org.junit.runners.ParentRunner$3.run(ParentRunner.java:290)
10-Sep-2019 13:43:49         at org.junit.runners.ParentRunner$1.schedule(ParentRunner.java:71)
10-Sep-2019 13:43:49         at org.junit.runners.ParentRunner.runChildren(ParentRunner.java:288)
10-Sep-2019 13:43:49         at org.junit.runners.ParentRunner.access$000(ParentRunner.java:58)
10-Sep-2019 13:43:49         at org.junit.runners.ParentRunner$2.evaluate(ParentRunner.java:268)
10-Sep-2019 13:43:49         at org.junit.runners.ParentRunner.run(ParentRunner.java:363)
10-Sep-2019 13:43:49         at org.apache.maven.surefire.junit4.JUnit4Provider.execute(JUnit4Provider.java:283)
10-Sep-2019 13:43:49         at org.apache.maven.surefire.junit4.JUnit4Provider.executeWithRerun(JUnit4Provider.java:173)
10-Sep-2019 13:43:49         at org.apache.maven.surefire.junit4.JUnit4Provider.executeTestSet(JUnit4Provider.java:153)
10-Sep-2019 13:43:49         at org.apache.maven.surefire.junit4.JUnit4Provider.invoke(JUnit4Provider.java:128)
10-Sep-2019 13:43:49         at org.apache.maven.surefire.booter.ForkedBooter.invokeProviderInSameClassLoader(ForkedBooter.java:203)
10-Sep-2019 13:43:49         at org.apache.maven.surefire.booter.ForkedBooter.runSuitesInProcess(ForkedBooter.java:155)
10-Sep-2019 13:43:49         at org.apache.maven.surefire.booter.ForkedBooter.main(ForkedBooter.java:103)
10-Sep-2019 13:43:49
10-Sep-2019 13:43:49 test(io.cdap.cdap.apps.workflow.WorkflowTest)  Time elapsed: 601.877 sec  <<< ERROR!
10-Sep-2019 13:43:49 java.util.concurrent.TimeoutException: Unable to connect to Authentication service to obtain access token, Connection info : CLIConnectionConfig{hostname=10.210.0.169, port=11015, sslEnabled=false}
10-Sep-2019 13:43:49         at io.cdap.cdap.test.IntegrationTestBase.checkServicesWithRetry(IntegrationTestBase.java:265)
10-Sep-2019 13:43:49         at io.cdap.cdap.test.IntegrationTestBase.fetchAccessToken(IntegrationTestBase.java:233)
10-Sep-2019 13:43:49         at io.cdap.cdap.test.IntegrationTestBase.fetchAccessToken(IntegrationTestBase.java:218)
10-Sep-2019 13:43:49         at io.cdap.cdap.test.IntegrationTestBase.checkSystemServices(IntegrationTestBase.java:196)
10-Sep-2019 13:43:49         at io.cdap.cdap.test.IntegrationTestBase.setUp(IntegrationTestBase.java:97)
10-Sep-2019 13:43:49         at sun.reflect.GeneratedMethodAccessor1.invoke(Unknown Source)
10-Sep-2019 13:43:49         at sun.reflect.DelegatingMethodAccessorImpl.invoke(DelegatingMethodAccessorImpl.java:43)
10-Sep-2019 13:43:49         at java.lang.reflect.Method.invoke(Method.java:498)
10-Sep-2019 13:43:49         at org.junit.runners.model.FrameworkMethod$1.runReflectiveCall(FrameworkMethod.java:50)
10-Sep-2019 13:43:49         at org.junit.internal.runners.model.ReflectiveCallable.run(ReflectiveCallable.java:12)
10-Sep-2019 13:43:49         at org.junit.runners.model.FrameworkMethod.invokeExplosively(FrameworkMethod.java:47)
10-Sep-2019 13:43:49         at org.junit.internal.runners.statements.RunBefores.evaluate(RunBefores.java:24)
10-Sep-2019 13:43:49         at org.junit.internal.runners.statements.RunAfters.evaluate(RunAfters.java:27)
10-Sep-2019 13:43:49         at org.junit.runners.ParentRunner.runLeaf(ParentRunner.java:325)
10-Sep-2019 13:43:49         at org.junit.runners.BlockJUnit4ClassRunner.runChild(BlockJUnit4ClassRunner.java:78)
10-Sep-2019 13:43:49         at org.junit.runners.BlockJUnit4ClassRunner.runChild(BlockJUnit4ClassRunner.java:57)
10-Sep-2019 13:43:49         at org.junit.runners.ParentRunner$3.run(ParentRunner.java:290)
10-Sep-2019 13:43:49         at org.junit.runners.ParentRunner$1.schedule(ParentRunner.java:71)
10-Sep-2019 13:43:49         at org.junit.runners.ParentRunner.runChildren(ParentRunner.java:288)
10-Sep-2019 13:43:49         at org.junit.runners.ParentRunner.access$000(ParentRunner.java:58)
10-Sep-2019 13:43:49         at org.junit.runners.ParentRunner$2.evaluate(ParentRunner.java:268)
10-Sep-2019 13:43:49         at org.junit.rules.ExternalResource$1.evaluate(ExternalResource.java:48)
10-Sep-2019 13:43:49         at org.junit.rules.RunRules.evaluate(RunRules.java:20)
10-Sep-2019 13:43:49         at org.junit.runners.ParentRunner.run(ParentRunner.java:363)
10-Sep-2019 13:43:49         at org.junit.runners.Suite.runChild(Suite.java:128)
10-Sep-2019 13:43:49         at org.junit.runners.Suite.runChild(Suite.java:27)
10-Sep-2019 13:43:49         at org.junit.runners.ParentRunner$3.run(ParentRunner.java:290)
10-Sep-2019 13:43:49         at org.junit.runners.ParentRunner$1.schedule(ParentRunner.java:71)
10-Sep-2019 13:43:49         at org.junit.runners.ParentRunner.runChildren(ParentRunner.java:288)
10-Sep-2019 13:43:49         at org.junit.runners.ParentRunner.access$000(ParentRunner.java:58)
10-Sep-2019 13:43:49         at org.junit.runners.ParentRunner$2.evaluate(ParentRunner.java:268)
10-Sep-2019 13:43:49         at org.junit.runners.ParentRunner.run(ParentRunner.java:363)
10-Sep-2019 13:43:49         at org.junit.runners.Suite.runChild(Suite.java:128)
10-Sep-2019 13:43:49         at org.junit.runners.Suite.runChild(Suite.java:27)
10-Sep-2019 13:43:49         at org.junit.runners.ParentRunner$3.run(ParentRunner.java:290)
10-Sep-2019 13:43:49         at org.junit.runners.ParentRunner$1.schedule(ParentRunner.java:71)
10-Sep-2019 13:43:49         at org.junit.runners.ParentRunner.runChildren(ParentRunner.java:288)
10-Sep-2019 13:43:49         at org.junit.runners.ParentRunner.access$000(ParentRunner.java:58)
10-Sep-2019 13:43:49         at org.junit.runners.ParentRunner$2.evaluate(ParentRunner.java:268)
10-Sep-2019 13:43:49         at org.junit.runners.ParentRunner.run(ParentRunner.java:363)
10-Sep-2019 13:43:49         at org.apache.maven.surefire.junit4.JUnit4Provider.execute(JUnit4Provider.java:283)
10-Sep-2019 13:43:49         at org.apache.maven.surefire.junit4.JUnit4Provider.executeWithRerun(JUnit4Provider.java:173)
10-Sep-2019 13:43:49         at org.apache.maven.surefire.junit4.JUnit4Provider.executeTestSet(JUnit4Provider.java:153)
10-Sep-2019 13:43:49         at org.apache.maven.surefire.junit4.JUnit4Provider.invoke(JUnit4Provider.java:128)
10-Sep-2019 13:43:49         at org.apache.maven.surefire.booter.ForkedBooter.invokeProviderInSameClassLoader(ForkedBooter.java:203)
10-Sep-2019 13:43:49         at org.apache.maven.surefire.booter.ForkedBooter.runSuitesInProcess(ForkedBooter.java:155)
10-Sep-2019 13:43:49         at org.apache.maven.surefire.booter.ForkedBooter.main(ForkedBooter.java:103)
10-Sep-2019 13:43:49
10-Sep-2019 13:43:49 test(io.cdap.cdap.app.etl.wrangler.WranglerServiceTest)  Time elapsed: 601.881 sec  <<< ERROR!
10-Sep-2019 13:43:49 java.util.concurrent.TimeoutException: Unable to connect to Authentication service to obtain access token, Connection info : CLIConnectionConfig{hostname=10.210.0.169, port=11015, sslEnabled=false}
10-Sep-2019 13:43:49         at io.cdap.cdap.test.IntegrationTestBase.checkServicesWithRetry(IntegrationTestBase.java:265)
10-Sep-2019 13:43:49         at io.cdap.cdap.test.IntegrationTestBase.fetchAccessToken(IntegrationTestBase.java:233)
10-Sep-2019 13:43:49         at io.cdap.cdap.test.IntegrationTestBase.fetchAccessToken(IntegrationTestBase.java:218)
10-Sep-2019 13:43:49         at io.cdap.cdap.test.IntegrationTestBase.checkSystemServices(IntegrationTestBase.java:196)
10-Sep-2019 13:43:49         at io.cdap.cdap.test.IntegrationTestBase.setUp(IntegrationTestBase.java:97)
10-Sep-2019 13:43:49         at sun.reflect.GeneratedMethodAccessor1.invoke(Unknown Source)
10-Sep-2019 13:43:49         at sun.reflect.DelegatingMethodAccessorImpl.invoke(DelegatingMethodAccessorImpl.java:43)
10-Sep-2019 13:43:49         at java.lang.reflect.Method.invoke(Method.java:498)
10-Sep-2019 13:43:49         at org.junit.runners.model.FrameworkMethod$1.runReflectiveCall(FrameworkMethod.java:50)
10-Sep-2019 13:43:49         at org.junit.internal.runners.model.ReflectiveCallable.run(ReflectiveCallable.java:12)
10-Sep-2019 13:43:49         at org.junit.runners.model.FrameworkMethod.invokeExplosively(FrameworkMethod.java:47)
10-Sep-2019 13:43:49         at org.junit.internal.runners.statements.RunBefores.evaluate(RunBefores.java:24)
10-Sep-2019 13:43:49         at org.junit.internal.runners.statements.RunAfters.evaluate(RunAfters.java:27)
10-Sep-2019 13:43:49         at org.junit.runners.ParentRunner.runLeaf(ParentRunner.java:325)
10-Sep-2019 13:43:49         at org.junit.runners.BlockJUnit4ClassRunner.runChild(BlockJUnit4ClassRunner.java:78)
10-Sep-2019 13:43:49         at org.junit.runners.BlockJUnit4ClassRunner.runChild(BlockJUnit4ClassRunner.java:57)
10-Sep-2019 13:43:49         at org.junit.runners.ParentRunner$3.run(ParentRunner.java:290)
10-Sep-2019 13:43:49         at org.junit.runners.ParentRunner$1.schedule(ParentRunner.java:71)
10-Sep-2019 13:43:49         at org.junit.runners.ParentRunner.runChildren(ParentRunner.java:288)
10-Sep-2019 13:43:49         at org.junit.runners.ParentRunner.access$000(ParentRunner.java:58)
10-Sep-2019 13:43:49         at org.junit.runners.ParentRunner$2.evaluate(ParentRunner.java:268)
10-Sep-2019 13:43:49         at org.junit.rules.ExternalResource$1.evaluate(ExternalResource.java:48)
10-Sep-2019 13:43:49         at org.junit.rules.RunRules.evaluate(RunRules.java:20)
10-Sep-2019 13:43:49         at org.junit.runners.ParentRunner.run(ParentRunner.java:363)
10-Sep-2019 13:43:49         at org.junit.runners.Suite.runChild(Suite.java:128)
10-Sep-2019 13:43:49         at org.junit.runners.Suite.runChild(Suite.java:27)
10-Sep-2019 13:43:49         at org.junit.runners.ParentRunner$3.run(ParentRunner.java:290)
10-Sep-2019 13:43:49         at org.junit.runners.ParentRunner$1.schedule(ParentRunner.java:71)
10-Sep-2019 13:43:49         at org.junit.runners.ParentRunner.runChildren(ParentRunner.java:288)
10-Sep-2019 13:43:49         at org.junit.runners.ParentRunner.access$000(ParentRunner.java:58)
10-Sep-2019 13:43:49         at org.junit.runners.ParentRunner$2.evaluate(ParentRunner.java:268)
10-Sep-2019 13:43:49         at org.junit.runners.ParentRunner.run(ParentRunner.java:363)
10-Sep-2019 13:43:49         at org.junit.runners.Suite.runChild(Suite.java:128)
10-Sep-2019 13:43:49         at org.junit.runners.Suite.runChild(Suite.java:27)
10-Sep-2019 13:43:49         at org.junit.runners.ParentRunner$3.run(ParentRunner.java:290)
10-Sep-2019 13:43:49         at org.junit.runners.ParentRunner$1.schedule(ParentRunner.java:71)
10-Sep-2019 13:43:49         at org.junit.runners.ParentRunner.runChildren(ParentRunner.java:288)
10-Sep-2019 13:43:49         at org.junit.runners.ParentRunner.access$000(ParentRunner.java:58)
10-Sep-2019 13:43:49         at org.junit.runners.ParentRunner$2.evaluate(ParentRunner.java:268)
10-Sep-2019 13:43:49         at org.junit.runners.ParentRunner.run(ParentRunner.java:363)
10-Sep-2019 13:43:49         at org.apache.maven.surefire.junit4.JUnit4Provider.execute(JUnit4Provider.java:283)
10-Sep-2019 13:43:49         at org.apache.maven.surefire.junit4.JUnit4Provider.executeWithRerun(JUnit4Provider.java:173)
10-Sep-2019 13:43:49         at org.apache.maven.surefire.junit4.JUnit4Provider.executeTestSet(JUnit4Provider.java:153)
10-Sep-2019 13:43:49         at org.apache.maven.surefire.junit4.JUnit4Provider.invoke(JUnit4Provider.java:128)
10-Sep-2019 13:43:49         at org.apache.maven.surefire.booter.ForkedBooter.invokeProviderInSameClassLoader(ForkedBooter.java:203)
10-Sep-2019 13:43:49         at org.apache.maven.surefire.booter.ForkedBooter.runSuitesInProcess(ForkedBooter.java:155)
10-Sep-2019 13:43:49         at org.apache.maven.surefire.booter.ForkedBooter.main(ForkedBooter.java:103)
10-Sep-2019 13:43:49
10-Sep-2019 13:43:49 testWranglerMR(io.cdap.cdap.app.etl.wrangler.WranglerTest)  Time elapsed: 602.005 sec  <<< ERROR!
10-Sep-2019 13:43:49 java.util.concurrent.TimeoutException: Unable to connect to Authentication service to obtain access token, Connection info : CLIConnectionConfig{hostname=10.210.0.169, port=11015, sslEnabled=false}
10-Sep-2019 13:43:49         at io.cdap.cdap.test.IntegrationTestBase.checkServicesWithRetry(IntegrationTestBase.java:265)
10-Sep-2019 13:43:49         at io.cdap.cdap.test.IntegrationTestBase.fetchAccessToken(IntegrationTestBase.java:233)
10-Sep-2019 13:43:49         at io.cdap.cdap.test.IntegrationTestBase.fetchAccessToken(IntegrationTestBase.java:218)
10-Sep-2019 13:43:49         at io.cdap.cdap.test.IntegrationTestBase.checkSystemServices(IntegrationTestBase.java:196)
10-Sep-2019 13:43:49         at io.cdap.cdap.test.IntegrationTestBase.setUp(IntegrationTestBase.java:97)
10-Sep-2019 13:43:49         at sun.reflect.GeneratedMethodAccessor1.invoke(Unknown Source)
10-Sep-2019 13:43:49         at sun.reflect.DelegatingMethodAccessorImpl.invoke(DelegatingMethodAccessorImpl.java:43)
10-Sep-2019 13:43:49         at java.lang.reflect.Method.invoke(Method.java:498)
10-Sep-2019 13:43:49         at org.junit.runners.model.FrameworkMethod$1.runReflectiveCall(FrameworkMethod.java:50)
10-Sep-2019 13:43:49         at org.junit.internal.runners.model.ReflectiveCallable.run(ReflectiveCallable.java:12)
10-Sep-2019 13:43:49         at org.junit.runners.model.FrameworkMethod.invokeExplosively(FrameworkMethod.java:47)
10-Sep-2019 13:43:49         at org.junit.internal.runners.statements.RunBefores.evaluate(RunBefores.java:24)
10-Sep-2019 13:43:49         at org.junit.internal.runners.statements.RunAfters.evaluate(RunAfters.java:27)
10-Sep-2019 13:43:49         at org.junit.runners.ParentRunner.runLeaf(ParentRunner.java:325)
10-Sep-2019 13:43:49         at org.junit.runners.BlockJUnit4ClassRunner.runChild(BlockJUnit4ClassRunner.java:78)
10-Sep-2019 13:43:49         at org.junit.runners.BlockJUnit4ClassRunner.runChild(BlockJUnit4ClassRunner.java:57)
10-Sep-2019 13:43:49         at org.junit.runners.ParentRunner$3.run(ParentRunner.java:290)
10-Sep-2019 13:43:49         at org.junit.runners.ParentRunner$1.schedule(ParentRunner.java:71)
10-Sep-2019 13:43:49         at org.junit.runners.ParentRunner.runChildren(ParentRunner.java:288)
10-Sep-2019 13:43:49         at org.junit.runners.ParentRunner.access$000(ParentRunner.java:58)
10-Sep-2019 13:43:49         at org.junit.runners.ParentRunner$2.evaluate(ParentRunner.java:268)
10-Sep-2019 13:43:49         at org.junit.rules.ExternalResource$1.evaluate(ExternalResource.java:48)
10-Sep-2019 13:43:49         at org.junit.rules.RunRules.evaluate(RunRules.java:20)
10-Sep-2019 13:43:49         at org.junit.runners.ParentRunner.run(ParentRunner.java:363)
10-Sep-2019 13:43:49         at org.junit.runners.Suite.runChild(Suite.java:128)
10-Sep-2019 13:43:49         at org.junit.runners.Suite.runChild(Suite.java:27)
10-Sep-2019 13:43:49         at org.junit.runners.ParentRunner$3.run(ParentRunner.java:290)
10-Sep-2019 13:43:49         at org.junit.runners.ParentRunner$1.schedule(ParentRunner.java:71)
10-Sep-2019 13:43:49         at org.junit.runners.ParentRunner.runChildren(ParentRunner.java:288)
10-Sep-2019 13:43:49         at org.junit.runners.ParentRunner.access$000(ParentRunner.java:58)
10-Sep-2019 13:43:49         at org.junit.runners.ParentRunner$2.evaluate(ParentRunner.java:268)
10-Sep-2019 13:43:49         at org.junit.runners.ParentRunner.run(ParentRunner.java:363)
10-Sep-2019 13:43:49         at org.junit.runners.Suite.runChild(Suite.java:128)
10-Sep-2019 13:43:49         at org.junit.runners.Suite.runChild(Suite.java:27)
10-Sep-2019 13:43:49         at org.junit.runners.ParentRunner$3.run(ParentRunner.java:290)
10-Sep-2019 13:43:49         at org.junit.runners.ParentRunner$1.schedule(ParentRunner.java:71)
10-Sep-2019 13:43:49         at org.junit.runners.ParentRunner.runChildren(ParentRunner.java:288)
10-Sep-2019 13:43:49         at org.junit.runners.ParentRunner.access$000(ParentRunner.java:58)
10-Sep-2019 13:43:49         at org.junit.runners.ParentRunner$2.evaluate(ParentRunner.java:268)
10-Sep-2019 13:43:49         at org.junit.runners.ParentRunner.run(ParentRunner.java:363)
10-Sep-2019 13:43:49         at org.apache.maven.surefire.junit4.JUnit4Provider.execute(JUnit4Provider.java:283)
10-Sep-2019 13:43:49         at org.apache.maven.surefire.junit4.JUnit4Provider.executeWithRerun(JUnit4Provider.java:173)
10-Sep-2019 13:43:49         at org.apache.maven.surefire.junit4.JUnit4Provider.executeTestSet(JUnit4Provider.java:153)
10-Sep-2019 13:43:49         at org.apache.maven.surefire.junit4.JUnit4Provider.invoke(JUnit4Provider.java:128)
10-Sep-2019 13:43:49         at org.apache.maven.surefire.booter.ForkedBooter.invokeProviderInSameClassLoader(ForkedBooter.java:203)
10-Sep-2019 13:43:49         at org.apache.maven.surefire.booter.ForkedBooter.runSuitesInProcess(ForkedBooter.java:155)
10-Sep-2019 13:43:49         at org.apache.maven.surefire.booter.ForkedBooter.main(ForkedBooter.java:103)
10-Sep-2019 13:43:49
10-Sep-2019 13:43:49 testWranglerSpark(io.cdap.cdap.app.etl.wrangler.WranglerTest)  Time elapsed: 601.869 sec  <<< ERROR!
10-Sep-2019 13:43:49 java.util.concurrent.TimeoutException: Unable to connect to Authentication service to obtain access token, Connection info : CLIConnectionConfig{hostname=10.210.0.169, port=11015, sslEnabled=false}
10-Sep-2019 13:43:49         at io.cdap.cdap.test.IntegrationTestBase.checkServicesWithRetry(IntegrationTestBase.java:265)
10-Sep-2019 13:43:49         at io.cdap.cdap.test.IntegrationTestBase.fetchAccessToken(IntegrationTestBase.java:233)
10-Sep-2019 13:43:49         at io.cdap.cdap.test.IntegrationTestBase.fetchAccessToken(IntegrationTestBase.java:218)
10-Sep-2019 13:43:49         at io.cdap.cdap.test.IntegrationTestBase.checkSystemServices(IntegrationTestBase.java:196)
10-Sep-2019 13:43:49         at io.cdap.cdap.test.IntegrationTestBase.setUp(IntegrationTestBase.java:97)
10-Sep-2019 13:43:49         at sun.reflect.GeneratedMethodAccessor1.invoke(Unknown Source)
10-Sep-2019 13:43:49         at sun.reflect.DelegatingMethodAccessorImpl.invoke(DelegatingMethodAccessorImpl.java:43)
10-Sep-2019 13:43:49         at java.lang.reflect.Method.invoke(Method.java:498)
10-Sep-2019 13:43:49         at org.junit.runners.model.FrameworkMethod$1.runReflectiveCall(FrameworkMethod.java:50)
10-Sep-2019 13:43:49         at org.junit.internal.runners.model.ReflectiveCallable.run(ReflectiveCallable.java:12)
10-Sep-2019 13:43:49         at org.junit.runners.model.FrameworkMethod.invokeExplosively(FrameworkMethod.java:47)
10-Sep-2019 13:43:49         at org.junit.internal.runners.statements.RunBefores.evaluate(RunBefores.java:24)
10-Sep-2019 13:43:49         at org.junit.internal.runners.statements.RunAfters.evaluate(RunAfters.java:27)
10-Sep-2019 13:43:49         at org.junit.runners.ParentRunner.runLeaf(ParentRunner.java:325)
10-Sep-2019 13:43:49         at org.junit.runners.BlockJUnit4ClassRunner.runChild(BlockJUnit4ClassRunner.java:78)
10-Sep-2019 13:43:49         at org.junit.runners.BlockJUnit4ClassRunner.runChild(BlockJUnit4ClassRunner.java:57)
10-Sep-2019 13:43:49         at org.junit.runners.ParentRunner$3.run(ParentRunner.java:290)
10-Sep-2019 13:43:49         at org.junit.runners.ParentRunner$1.schedule(ParentRunner.java:71)
10-Sep-2019 13:43:49         at org.junit.runners.ParentRunner.runChildren(ParentRunner.java:288)
10-Sep-2019 13:43:49         at org.junit.runners.ParentRunner.access$000(ParentRunner.java:58)
10-Sep-2019 13:43:49         at org.junit.runners.ParentRunner$2.evaluate(ParentRunner.java:268)
10-Sep-2019 13:43:49         at org.junit.rules.ExternalResource$1.evaluate(ExternalResource.java:48)
10-Sep-2019 13:43:49         at org.junit.rules.RunRules.evaluate(RunRules.java:20)
10-Sep-2019 13:43:49         at org.junit.runners.ParentRunner.run(ParentRunner.java:363)
10-Sep-2019 13:43:49         at org.junit.runners.Suite.runChild(Suite.java:128)
10-Sep-2019 13:43:49         at org.junit.runners.Suite.runChild(Suite.java:27)
10-Sep-2019 13:43:49         at org.junit.runners.ParentRunner$3.run(ParentRunner.java:290)
10-Sep-2019 13:43:49         at org.junit.runners.ParentRunner$1.schedule(ParentRunner.java:71)
10-Sep-2019 13:43:49         at org.junit.runners.ParentRunner.runChildren(ParentRunner.java:288)
10-Sep-2019 13:43:49         at org.junit.runners.ParentRunner.access$000(ParentRunner.java:58)
10-Sep-2019 13:43:49         at org.junit.runners.ParentRunner$2.evaluate(ParentRunner.java:268)
10-Sep-2019 13:43:49         at org.junit.runners.ParentRunner.run(ParentRunner.java:363)
10-Sep-2019 13:43:49         at org.junit.runners.Suite.runChild(Suite.java:128)
10-Sep-2019 13:43:49         at org.junit.runners.Suite.runChild(Suite.java:27)
10-Sep-2019 13:43:49         at org.junit.runners.ParentRunner$3.run(ParentRunner.java:290)
10-Sep-2019 13:43:49         at org.junit.runners.ParentRunner$1.schedule(ParentRunner.java:71)
10-Sep-2019 13:43:49         at org.junit.runners.ParentRunner.runChildren(ParentRunner.java:288)
10-Sep-2019 13:43:49         at org.junit.runners.ParentRunner.access$000(ParentRunner.java:58)
10-Sep-2019 13:43:49         at org.junit.runners.ParentRunner$2.evaluate(ParentRunner.java:268)
10-Sep-2019 13:43:49         at org.junit.runners.ParentRunner.run(ParentRunner.java:363)
10-Sep-2019 13:43:49         at org.apache.maven.surefire.junit4.JUnit4Provider.execute(JUnit4Provider.java:283)
10-Sep-2019 13:43:49         at org.apache.maven.surefire.junit4.JUnit4Provider.executeWithRerun(JUnit4Provider.java:173)
10-Sep-2019 13:43:49         at org.apache.maven.surefire.junit4.JUnit4Provider.executeTestSet(JUnit4Provider.java:153)
10-Sep-2019 13:43:49         at org.apache.maven.surefire.junit4.JUnit4Provider.invoke(JUnit4Provider.java:128)
10-Sep-2019 13:43:49         at org.apache.maven.surefire.booter.ForkedBooter.invokeProviderInSameClassLoader(ForkedBooter.java:203)
10-Sep-2019 13:43:49         at org.apache.maven.surefire.booter.ForkedBooter.runSuitesInProcess(ForkedBooter.java:155)
10-Sep-2019 13:43:49         at org.apache.maven.surefire.booter.ForkedBooter.main(ForkedBooter.java:103)
10-Sep-2019 13:43:49
10-Sep-2019 13:43:49 testPreProcessingNotRequired(io.cdap.cdap.app.etl.batch.XMLReaderTest)  Time elapsed: 601.935 sec  <<< ERROR!
10-Sep-2019 13:43:49 java.util.concurrent.TimeoutException: Unable to connect to Authentication service to obtain access token, Connection info : CLIConnectionConfig{hostname=10.210.0.169, port=11015, sslEnabled=false}
10-Sep-2019 13:43:49         at io.cdap.cdap.test.IntegrationTestBase.checkServicesWithRetry(IntegrationTestBase.java:265)
10-Sep-2019 13:43:49         at io.cdap.cdap.test.IntegrationTestBase.fetchAccessToken(IntegrationTestBase.java:233)
10-Sep-2019 13:43:49         at io.cdap.cdap.test.IntegrationTestBase.fetchAccessToken(IntegrationTestBase.java:218)
10-Sep-2019 13:43:49         at io.cdap.cdap.test.IntegrationTestBase.checkSystemServices(IntegrationTestBase.java:196)
10-Sep-2019 13:43:49         at io.cdap.cdap.test.IntegrationTestBase.setUp(IntegrationTestBase.java:97)
10-Sep-2019 13:43:49         at sun.reflect.GeneratedMethodAccessor1.invoke(Unknown Source)
10-Sep-2019 13:43:49         at sun.reflect.DelegatingMethodAccessorImpl.invoke(DelegatingMethodAccessorImpl.java:43)
10-Sep-2019 13:43:49         at java.lang.reflect.Method.invoke(Method.java:498)
10-Sep-2019 13:43:49         at org.junit.runners.model.FrameworkMethod$1.runReflectiveCall(FrameworkMethod.java:50)
10-Sep-2019 13:43:49         at org.junit.internal.runners.model.ReflectiveCallable.run(ReflectiveCallable.java:12)
10-Sep-2019 13:43:49         at org.junit.runners.model.FrameworkMethod.invokeExplosively(FrameworkMethod.java:47)
10-Sep-2019 13:43:49         at org.junit.internal.runners.statements.RunBefores.evaluate(RunBefores.java:24)
10-Sep-2019 13:43:49         at org.junit.internal.runners.statements.RunAfters.evaluate(RunAfters.java:27)
10-Sep-2019 13:43:49         at org.junit.runners.ParentRunner.runLeaf(ParentRunner.java:325)
10-Sep-2019 13:43:49         at org.junit.runners.BlockJUnit4ClassRunner.runChild(BlockJUnit4ClassRunner.java:78)
10-Sep-2019 13:43:49         at org.junit.runners.BlockJUnit4ClassRunner.runChild(BlockJUnit4ClassRunner.java:57)
10-Sep-2019 13:43:49         at org.junit.runners.ParentRunner$3.run(ParentRunner.java:290)
10-Sep-2019 13:43:49         at org.junit.runners.ParentRunner$1.schedule(ParentRunner.java:71)
10-Sep-2019 13:43:49         at org.junit.runners.ParentRunner.runChildren(ParentRunner.java:288)
10-Sep-2019 13:43:49         at org.junit.runners.ParentRunner.access$000(ParentRunner.java:58)
10-Sep-2019 13:43:49         at org.junit.runners.ParentRunner$2.evaluate(ParentRunner.java:268)
10-Sep-2019 13:43:49         at org.junit.rules.ExternalResource$1.evaluate(ExternalResource.java:48)
10-Sep-2019 13:43:49         at org.junit.rules.RunRules.evaluate(RunRules.java:20)
10-Sep-2019 13:43:49         at org.junit.runners.ParentRunner.run(ParentRunner.java:363)
10-Sep-2019 13:43:49         at org.junit.runners.Suite.runChild(Suite.java:128)
10-Sep-2019 13:43:49         at org.junit.runners.Suite.runChild(Suite.java:27)
10-Sep-2019 13:43:49         at org.junit.runners.ParentRunner$3.run(ParentRunner.java:290)
10-Sep-2019 13:43:49         at org.junit.runners.ParentRunner$1.schedule(ParentRunner.java:71)
10-Sep-2019 13:43:49         at org.junit.runners.ParentRunner.runChildren(ParentRunner.java:288)
10-Sep-2019 13:43:49         at org.junit.runners.ParentRunner.access$000(ParentRunner.java:58)
10-Sep-2019 13:43:49         at org.junit.runners.ParentRunner$2.evaluate(ParentRunner.java:268)
10-Sep-2019 13:43:49         at org.junit.runners.ParentRunner.run(ParentRunner.java:363)
10-Sep-2019 13:43:49         at org.junit.runners.Suite.runChild(Suite.java:128)
10-Sep-2019 13:43:49         at org.junit.runners.Suite.runChild(Suite.java:27)
10-Sep-2019 13:43:49         at org.junit.runners.ParentRunner$3.run(ParentRunner.java:290)
10-Sep-2019 13:43:49         at org.junit.runners.ParentRunner$1.schedule(ParentRunner.java:71)
10-Sep-2019 13:43:49         at org.junit.runners.ParentRunner.runChildren(ParentRunner.java:288)
10-Sep-2019 13:43:49         at org.junit.runners.ParentRunner.access$000(ParentRunner.java:58)
10-Sep-2019 13:43:49         at org.junit.runners.ParentRunner$2.evaluate(ParentRunner.java:268)
10-Sep-2019 13:43:49         at org.junit.runners.ParentRunner.run(ParentRunner.java:363)
10-Sep-2019 13:43:49         at org.apache.maven.surefire.junit4.JUnit4Provider.execute(JUnit4Provider.java:283)
10-Sep-2019 13:43:49         at org.apache.maven.surefire.junit4.JUnit4Provider.executeWithRerun(JUnit4Provider.java:173)
10-Sep-2019 13:43:49         at org.apache.maven.surefire.junit4.JUnit4Provider.executeTestSet(JUnit4Provider.java:153)
10-Sep-2019 13:43:49         at org.apache.maven.surefire.junit4.JUnit4Provider.invoke(JUnit4Provider.java:128)
10-Sep-2019 13:43:49         at org.apache.maven.surefire.booter.ForkedBooter.invokeProviderInSameClassLoader(ForkedBooter.java:203)
10-Sep-2019 13:43:49         at org.apache.maven.surefire.booter.ForkedBooter.runSuitesInProcess(ForkedBooter.java:155)
10-Sep-2019 13:43:49         at org.apache.maven.surefire.booter.ForkedBooter.main(ForkedBooter.java:103)
10-Sep-2019 13:43:49
10-Sep-2019 13:43:49 testInvalidPatternWithDeleteAction(io.cdap.cdap.app.etl.batch.XMLReaderTest)  Time elapsed: 601.862 sec  <<< ERROR!
10-Sep-2019 13:43:49 java.util.concurrent.TimeoutException: Unable to connect to Authentication service to obtain access token, Connection info : CLIConnectionConfig{hostname=10.210.0.169, port=11015, sslEnabled=false}
10-Sep-2019 13:43:49         at io.cdap.cdap.test.IntegrationTestBase.checkServicesWithRetry(IntegrationTestBase.java:265)
10-Sep-2019 13:43:49         at io.cdap.cdap.test.IntegrationTestBase.fetchAccessToken(IntegrationTestBase.java:233)
10-Sep-2019 13:43:49         at io.cdap.cdap.test.IntegrationTestBase.fetchAccessToken(IntegrationTestBase.java:218)
10-Sep-2019 13:43:49         at io.cdap.cdap.test.IntegrationTestBase.checkSystemServices(IntegrationTestBase.java:196)
10-Sep-2019 13:43:49         at io.cdap.cdap.test.IntegrationTestBase.setUp(IntegrationTestBase.java:97)
10-Sep-2019 13:43:49         at sun.reflect.GeneratedMethodAccessor1.invoke(Unknown Source)
10-Sep-2019 13:43:49         at sun.reflect.DelegatingMethodAccessorImpl.invoke(DelegatingMethodAccessorImpl.java:43)
10-Sep-2019 13:43:49         at java.lang.reflect.Method.invoke(Method.java:498)
10-Sep-2019 13:43:49         at org.junit.runners.model.FrameworkMethod$1.runReflectiveCall(FrameworkMethod.java:50)
10-Sep-2019 13:43:49         at org.junit.internal.runners.model.ReflectiveCallable.run(ReflectiveCallable.java:12)
10-Sep-2019 13:43:49         at org.junit.runners.model.FrameworkMethod.invokeExplosively(FrameworkMethod.java:47)
10-Sep-2019 13:43:49         at org.junit.internal.runners.statements.RunBefores.evaluate(RunBefores.java:24)
10-Sep-2019 13:43:49         at org.junit.internal.runners.statements.RunAfters.evaluate(RunAfters.java:27)
10-Sep-2019 13:43:49         at org.junit.runners.ParentRunner.runLeaf(ParentRunner.java:325)
10-Sep-2019 13:43:49         at org.junit.runners.BlockJUnit4ClassRunner.runChild(BlockJUnit4ClassRunner.java:78)
10-Sep-2019 13:43:49         at org.junit.runners.BlockJUnit4ClassRunner.runChild(BlockJUnit4ClassRunner.java:57)
10-Sep-2019 13:43:49         at org.junit.runners.ParentRunner$3.run(ParentRunner.java:290)
10-Sep-2019 13:43:49         at org.junit.runners.ParentRunner$1.schedule(ParentRunner.java:71)
10-Sep-2019 13:43:49         at org.junit.runners.ParentRunner.runChildren(ParentRunner.java:288)
10-Sep-2019 13:43:49         at org.junit.runners.ParentRunner.access$000(ParentRunner.java:58)
10-Sep-2019 13:43:49         at org.junit.runners.ParentRunner$2.evaluate(ParentRunner.java:268)
10-Sep-2019 13:43:49         at org.junit.rules.ExternalResource$1.evaluate(ExternalResource.java:48)
10-Sep-2019 13:43:49         at org.junit.rules.RunRules.evaluate(RunRules.java:20)
10-Sep-2019 13:43:49         at org.junit.runners.ParentRunner.run(ParentRunner.java:363)
10-Sep-2019 13:43:49         at org.junit.runners.Suite.runChild(Suite.java:128)
10-Sep-2019 13:43:49         at org.junit.runners.Suite.runChild(Suite.java:27)
10-Sep-2019 13:43:49         at org.junit.runners.ParentRunner$3.run(ParentRunner.java:290)
10-Sep-2019 13:43:49         at org.junit.runners.ParentRunner$1.schedule(ParentRunner.java:71)
10-Sep-2019 13:43:49         at org.junit.runners.ParentRunner.runChildren(ParentRunner.java:288)
10-Sep-2019 13:43:49         at org.junit.runners.ParentRunner.access$000(ParentRunner.java:58)
10-Sep-2019 13:43:49         at org.junit.runners.ParentRunner$2.evaluate(ParentRunner.java:268)
10-Sep-2019 13:43:49         at org.junit.runners.ParentRunner.run(ParentRunner.java:363)
10-Sep-2019 13:43:49         at org.junit.runners.Suite.runChild(Suite.java:128)
10-Sep-2019 13:43:49         at org.junit.runners.Suite.runChild(Suite.java:27)
10-Sep-2019 13:43:49         at org.junit.runners.ParentRunner$3.run(ParentRunner.java:290)
10-Sep-2019 13:43:49         at org.junit.runners.ParentRunner$1.schedule(ParentRunner.java:71)
10-Sep-2019 13:43:49         at org.junit.runners.ParentRunner.runChildren(ParentRunner.java:288)
10-Sep-2019 13:43:49         at org.junit.runners.ParentRunner.access$000(ParentRunner.java:58)
10-Sep-2019 13:43:49         at org.junit.runners.ParentRunner$2.evaluate(ParentRunner.java:268)
10-Sep-2019 13:43:49         at org.junit.runners.ParentRunner.run(ParentRunner.java:363)
10-Sep-2019 13:43:49         at org.apache.maven.surefire.junit4.JUnit4Provider.execute(JUnit4Provider.java:283)
10-Sep-2019 13:43:49         at org.apache.maven.surefire.junit4.JUnit4Provider.executeWithRerun(JUnit4Provider.java:173)
10-Sep-2019 13:43:49         at org.apache.maven.surefire.junit4.JUnit4Provider.executeTestSet(JUnit4Provider.java:153)
10-Sep-2019 13:43:49         at org.apache.maven.surefire.junit4.JUnit4Provider.invoke(JUnit4Provider.java:128)
10-Sep-2019 13:43:49         at org.apache.maven.surefire.booter.ForkedBooter.invokeProviderInSameClassLoader(ForkedBooter.java:203)
10-Sep-2019 13:43:49         at org.apache.maven.surefire.booter.ForkedBooter.runSuitesInProcess(ForkedBooter.java:155)
10-Sep-2019 13:43:49         at org.apache.maven.surefire.booter.ForkedBooter.main(ForkedBooter.java:103)
10-Sep-2019 13:43:49
10-Sep-2019 13:43:49 testPatternWithDeleteAction(io.cdap.cdap.app.etl.batch.XMLReaderTest)  Time elapsed: 601.89 sec  <<< ERROR!
10-Sep-2019 13:43:49 java.util.concurrent.TimeoutException: Unable to connect to Authentication service to obtain access token, Connection info : CLIConnectionConfig{hostname=10.210.0.169, port=11015, sslEnabled=false}
10-Sep-2019 13:43:49         at io.cdap.cdap.test.IntegrationTestBase.checkServicesWithRetry(IntegrationTestBase.java:265)
10-Sep-2019 13:43:49         at io.cdap.cdap.test.IntegrationTestBase.fetchAccessToken(IntegrationTestBase.java:233)
10-Sep-2019 13:43:49         at io.cdap.cdap.test.IntegrationTestBase.fetchAccessToken(IntegrationTestBase.java:218)
10-Sep-2019 13:43:49         at io.cdap.cdap.test.IntegrationTestBase.checkSystemServices(IntegrationTestBase.java:196)
10-Sep-2019 13:43:49         at io.cdap.cdap.test.IntegrationTestBase.setUp(IntegrationTestBase.java:97)
10-Sep-2019 13:43:49         at sun.reflect.GeneratedMethodAccessor1.invoke(Unknown Source)
10-Sep-2019 13:43:49         at sun.reflect.DelegatingMethodAccessorImpl.invoke(DelegatingMethodAccessorImpl.java:43)
10-Sep-2019 13:43:49         at java.lang.reflect.Method.invoke(Method.java:498)
10-Sep-2019 13:43:49         at org.junit.runners.model.FrameworkMethod$1.runReflectiveCall(FrameworkMethod.java:50)
10-Sep-2019 13:43:49         at org.junit.internal.runners.model.ReflectiveCallable.run(ReflectiveCallable.java:12)
10-Sep-2019 13:43:49         at org.junit.runners.model.FrameworkMethod.invokeExplosively(FrameworkMethod.java:47)
10-Sep-2019 13:43:49         at org.junit.internal.runners.statements.RunBefores.evaluate(RunBefores.java:24)
10-Sep-2019 13:43:49         at org.junit.internal.runners.statements.RunAfters.evaluate(RunAfters.java:27)
10-Sep-2019 13:43:49         at org.junit.runners.ParentRunner.runLeaf(ParentRunner.java:325)
10-Sep-2019 13:43:49         at org.junit.runners.BlockJUnit4ClassRunner.runChild(BlockJUnit4ClassRunner.java:78)
10-Sep-2019 13:43:49         at org.junit.runners.BlockJUnit4ClassRunner.runChild(BlockJUnit4ClassRunner.java:57)
10-Sep-2019 13:43:49         at org.junit.runners.ParentRunner$3.run(ParentRunner.java:290)
10-Sep-2019 13:43:49         at org.junit.runners.ParentRunner$1.schedule(ParentRunner.java:71)
10-Sep-2019 13:43:49         at org.junit.runners.ParentRunner.runChildren(ParentRunner.java:288)
10-Sep-2019 13:43:49         at org.junit.runners.ParentRunner.access$000(ParentRunner.java:58)
10-Sep-2019 13:43:49         at org.junit.runners.ParentRunner$2.evaluate(ParentRunner.java:268)
10-Sep-2019 13:43:49         at org.junit.rules.ExternalResource$1.evaluate(ExternalResource.java:48)
10-Sep-2019 13:43:49         at org.junit.rules.RunRules.evaluate(RunRules.java:20)
10-Sep-2019 13:43:49         at org.junit.runners.ParentRunner.run(ParentRunner.java:363)
10-Sep-2019 13:43:49         at org.junit.runners.Suite.runChild(Suite.java:128)
10-Sep-2019 13:43:49         at org.junit.runners.Suite.runChild(Suite.java:27)
10-Sep-2019 13:43:49         at org.junit.runners.ParentRunner$3.run(ParentRunner.java:290)
10-Sep-2019 13:43:49         at org.junit.runners.ParentRunner$1.schedule(ParentRunner.java:71)
10-Sep-2019 13:43:49         at org.junit.runners.ParentRunner.runChildren(ParentRunner.java:288)
10-Sep-2019 13:43:49         at org.junit.runners.ParentRunner.access$000(ParentRunner.java:58)
10-Sep-2019 13:43:49         at org.junit.runners.ParentRunner$2.evaluate(ParentRunner.java:268)
10-Sep-2019 13:43:49         at org.junit.runners.ParentRunner.run(ParentRunner.java:363)
10-Sep-2019 13:43:49         at org.junit.runners.Suite.runChild(Suite.java:128)
10-Sep-2019 13:43:49         at org.junit.runners.Suite.runChild(Suite.java:27)
10-Sep-2019 13:43:49         at org.junit.runners.ParentRunner$3.run(ParentRunner.java:290)
10-Sep-2019 13:43:49         at org.junit.runners.ParentRunner$1.schedule(ParentRunner.java:71)
10-Sep-2019 13:43:49         at org.junit.runners.ParentRunner.runChildren(ParentRunner.java:288)
10-Sep-2019 13:43:49         at org.junit.runners.ParentRunner.access$000(ParentRunner.java:58)
10-Sep-2019 13:43:49         at org.junit.runners.ParentRunner$2.evaluate(ParentRunner.java:268)
10-Sep-2019 13:43:49         at org.junit.runners.ParentRunner.run(ParentRunner.java:363)
10-Sep-2019 13:43:49         at org.apache.maven.surefire.junit4.JUnit4Provider.execute(JUnit4Provider.java:283)
10-Sep-2019 13:43:49         at org.apache.maven.surefire.junit4.JUnit4Provider.executeWithRerun(JUnit4Provider.java:173)
10-Sep-2019 13:43:49         at org.apache.maven.surefire.junit4.JUnit4Provider.executeTestSet(JUnit4Provider.java:153)
10-Sep-2019 13:43:49         at org.apache.maven.surefire.junit4.JUnit4Provider.invoke(JUnit4Provider.java:128)
10-Sep-2019 13:43:49         at org.apache.maven.surefire.booter.ForkedBooter.invokeProviderInSameClassLoader(ForkedBooter.java:203)
10-Sep-2019 13:43:49         at org.apache.maven.surefire.booter.ForkedBooter.runSuitesInProcess(ForkedBooter.java:155)
10-Sep-2019 13:43:49         at org.apache.maven.surefire.booter.ForkedBooter.main(ForkedBooter.java:103)
10-Sep-2019 13:43:49
10-Sep-2019 13:43:49 testPreProcessingRequired(io.cdap.cdap.app.etl.batch.XMLReaderTest)  Time elapsed: 601.871 sec  <<< ERROR!
10-Sep-2019 13:43:49 java.util.concurrent.TimeoutException: Unable to connect to Authentication service to obtain access token, Connection info : CLIConnectionConfig{hostname=10.210.0.169, port=11015, sslEnabled=false}
10-Sep-2019 13:43:49         at io.cdap.cdap.test.IntegrationTestBase.checkServicesWithRetry(IntegrationTestBase.java:265)
10-Sep-2019 13:43:49         at io.cdap.cdap.test.IntegrationTestBase.fetchAccessToken(IntegrationTestBase.java:233)
10-Sep-2019 13:43:49         at io.cdap.cdap.test.IntegrationTestBase.fetchAccessToken(IntegrationTestBase.java:218)
10-Sep-2019 13:43:49         at io.cdap.cdap.test.IntegrationTestBase.checkSystemServices(IntegrationTestBase.java:196)
10-Sep-2019 13:43:49         at io.cdap.cdap.test.IntegrationTestBase.setUp(IntegrationTestBase.java:97)
10-Sep-2019 13:43:49         at sun.reflect.GeneratedMethodAccessor1.invoke(Unknown Source)
10-Sep-2019 13:43:49         at sun.reflect.DelegatingMethodAccessorImpl.invoke(DelegatingMethodAccessorImpl.java:43)
10-Sep-2019 13:43:49         at java.lang.reflect.Method.invoke(Method.java:498)
10-Sep-2019 13:43:49         at org.junit.runners.model.FrameworkMethod$1.runReflectiveCall(FrameworkMethod.java:50)
10-Sep-2019 13:43:49         at org.junit.internal.runners.model.ReflectiveCallable.run(ReflectiveCallable.java:12)
10-Sep-2019 13:43:49         at org.junit.runners.model.FrameworkMethod.invokeExplosively(FrameworkMethod.java:47)
10-Sep-2019 13:43:49         at org.junit.internal.runners.statements.RunBefores.evaluate(RunBefores.java:24)
10-Sep-2019 13:43:49         at org.junit.internal.runners.statements.RunAfters.evaluate(RunAfters.java:27)
10-Sep-2019 13:43:49         at org.junit.runners.ParentRunner.runLeaf(ParentRunner.java:325)
10-Sep-2019 13:43:49         at org.junit.runners.BlockJUnit4ClassRunner.runChild(BlockJUnit4ClassRunner.java:78)
10-Sep-2019 13:43:49         at org.junit.runners.BlockJUnit4ClassRunner.runChild(BlockJUnit4ClassRunner.java:57)
10-Sep-2019 13:43:49         at org.junit.runners.ParentRunner$3.run(ParentRunner.java:290)
10-Sep-2019 13:43:49         at org.junit.runners.ParentRunner$1.schedule(ParentRunner.java:71)
10-Sep-2019 13:43:49         at org.junit.runners.ParentRunner.runChildren(ParentRunner.java:288)
10-Sep-2019 13:43:49         at org.junit.runners.ParentRunner.access$000(ParentRunner.java:58)
10-Sep-2019 13:43:49         at org.junit.runners.ParentRunner$2.evaluate(ParentRunner.java:268)
10-Sep-2019 13:43:49         at org.junit.rules.ExternalResource$1.evaluate(ExternalResource.java:48)
10-Sep-2019 13:43:49         at org.junit.rules.RunRules.evaluate(RunRules.java:20)
10-Sep-2019 13:43:49         at org.junit.runners.ParentRunner.run(ParentRunner.java:363)
10-Sep-2019 13:43:49         at org.junit.runners.Suite.runChild(Suite.java:128)
10-Sep-2019 13:43:49         at org.junit.runners.Suite.runChild(Suite.java:27)
10-Sep-2019 13:43:49         at org.junit.runners.ParentRunner$3.run(ParentRunner.java:290)
10-Sep-2019 13:43:49         at org.junit.runners.ParentRunner$1.schedule(ParentRunner.java:71)
10-Sep-2019 13:43:49         at org.junit.runners.ParentRunner.runChildren(ParentRunner.java:288)
10-Sep-2019 13:43:49         at org.junit.runners.ParentRunner.access$000(ParentRunner.java:58)
10-Sep-2019 13:43:49         at org.junit.runners.ParentRunner$2.evaluate(ParentRunner.java:268)
10-Sep-2019 13:43:49         at org.junit.runners.ParentRunner.run(ParentRunner.java:363)
10-Sep-2019 13:43:49         at org.junit.runners.Suite.runChild(Suite.java:128)
10-Sep-2019 13:43:49         at org.junit.runners.Suite.runChild(Suite.java:27)
10-Sep-2019 13:43:49         at org.junit.runners.ParentRunner$3.run(ParentRunner.java:290)
10-Sep-2019 13:43:49         at org.junit.runners.ParentRunner$1.schedule(ParentRunner.java:71)
10-Sep-2019 13:43:49         at org.junit.runners.ParentRunner.runChildren(ParentRunner.java:288)
10-Sep-2019 13:43:49         at org.junit.runners.ParentRunner.access$000(ParentRunner.java:58)
10-Sep-2019 13:43:49         at org.junit.runners.ParentRunner$2.evaluate(ParentRunner.java:268)
10-Sep-2019 13:43:49         at org.junit.runners.ParentRunner.run(ParentRunner.java:363)
10-Sep-2019 13:43:49         at org.apache.maven.surefire.junit4.JUnit4Provider.execute(JUnit4Provider.java:283)
10-Sep-2019 13:43:49         at org.apache.maven.surefire.junit4.JUnit4Provider.executeWithRerun(JUnit4Provider.java:173)
10-Sep-2019 13:43:49         at org.apache.maven.surefire.junit4.JUnit4Provider.executeTestSet(JUnit4Provider.java:153)
10-Sep-2019 13:43:49         at org.apache.maven.surefire.junit4.JUnit4Provider.invoke(JUnit4Provider.java:128)
10-Sep-2019 13:43:49         at org.apache.maven.surefire.booter.ForkedBooter.invokeProviderInSameClassLoader(ForkedBooter.java:203)
10-Sep-2019 13:43:49         at org.apache.maven.surefire.booter.ForkedBooter.runSuitesInProcess(ForkedBooter.java:155)
10-Sep-2019 13:43:49         at org.apache.maven.surefire.booter.ForkedBooter.main(ForkedBooter.java:103)
10-Sep-2019 13:43:49
10-Sep-2019 13:43:49 testInvalidNodePathWithMoveAction(io.cdap.cdap.app.etl.batch.XMLReaderTest)  Time elapsed: 601.869 sec  <<< ERROR!
10-Sep-2019 13:43:49 java.util.concurrent.TimeoutException: Unable to connect to Authentication service to obtain access token, Connection info : CLIConnectionConfig{hostname=10.210.0.169, port=11015, sslEnabled=false}
10-Sep-2019 13:43:49         at io.cdap.cdap.test.IntegrationTestBase.checkServicesWithRetry(IntegrationTestBase.java:265)
10-Sep-2019 13:43:49         at io.cdap.cdap.test.IntegrationTestBase.fetchAccessToken(IntegrationTestBase.java:233)
10-Sep-2019 13:43:49         at io.cdap.cdap.test.IntegrationTestBase.fetchAccessToken(IntegrationTestBase.java:218)
10-Sep-2019 13:43:49         at io.cdap.cdap.test.IntegrationTestBase.checkSystemServices(IntegrationTestBase.java:196)
10-Sep-2019 13:43:49         at io.cdap.cdap.test.IntegrationTestBase.setUp(IntegrationTestBase.java:97)
10-Sep-2019 13:43:49         at sun.reflect.GeneratedMethodAccessor1.invoke(Unknown Source)
10-Sep-2019 13:43:49         at sun.reflect.DelegatingMethodAccessorImpl.invoke(DelegatingMethodAccessorImpl.java:43)
10-Sep-2019 13:43:49         at java.lang.reflect.Method.invoke(Method.java:498)
10-Sep-2019 13:43:49         at org.junit.runners.model.FrameworkMethod$1.runReflectiveCall(FrameworkMethod.java:50)
10-Sep-2019 13:43:49         at org.junit.internal.runners.model.ReflectiveCallable.run(ReflectiveCallable.java:12)
10-Sep-2019 13:43:49         at org.junit.runners.model.FrameworkMethod.invokeExplosively(FrameworkMethod.java:47)
10-Sep-2019 13:43:49         at org.junit.internal.runners.statements.RunBefores.evaluate(RunBefores.java:24)
10-Sep-2019 13:43:49         at org.junit.internal.runners.statements.RunAfters.evaluate(RunAfters.java:27)
10-Sep-2019 13:43:49         at org.junit.runners.ParentRunner.runLeaf(ParentRunner.java:325)
10-Sep-2019 13:43:49         at org.junit.runners.BlockJUnit4ClassRunner.runChild(BlockJUnit4ClassRunner.java:78)
10-Sep-2019 13:43:49         at org.junit.runners.BlockJUnit4ClassRunner.runChild(BlockJUnit4ClassRunner.java:57)
10-Sep-2019 13:43:49         at org.junit.runners.ParentRunner$3.run(ParentRunner.java:290)
10-Sep-2019 13:43:49         at org.junit.runners.ParentRunner$1.schedule(ParentRunner.java:71)
10-Sep-2019 13:43:49         at org.junit.runners.ParentRunner.runChildren(ParentRunner.java:288)
10-Sep-2019 13:43:49         at org.junit.runners.ParentRunner.access$000(ParentRunner.java:58)
10-Sep-2019 13:43:49         at org.junit.runners.ParentRunner$2.evaluate(ParentRunner.java:268)
10-Sep-2019 13:43:49         at org.junit.rules.ExternalResource$1.evaluate(ExternalResource.java:48)
10-Sep-2019 13:43:49         at org.junit.rules.RunRules.evaluate(RunRules.java:20)
10-Sep-2019 13:43:49         at org.junit.runners.ParentRunner.run(ParentRunner.java:363)
10-Sep-2019 13:43:49         at org.junit.runners.Suite.runChild(Suite.java:128)
10-Sep-2019 13:43:49         at org.junit.runners.Suite.runChild(Suite.java:27)
10-Sep-2019 13:43:49         at org.junit.runners.ParentRunner$3.run(ParentRunner.java:290)
10-Sep-2019 13:43:49         at org.junit.runners.ParentRunner$1.schedule(ParentRunner.java:71)
10-Sep-2019 13:43:49         at org.junit.runners.ParentRunner.runChildren(ParentRunner.java:288)
10-Sep-2019 13:43:49         at org.junit.runners.ParentRunner.access$000(ParentRunner.java:58)
10-Sep-2019 13:43:49         at org.junit.runners.ParentRunner$2.evaluate(ParentRunner.java:268)
10-Sep-2019 13:43:49         at org.junit.runners.ParentRunner.run(ParentRunner.java:363)
10-Sep-2019 13:43:49         at org.junit.runners.Suite.runChild(Suite.java:128)
10-Sep-2019 13:43:49         at org.junit.runners.Suite.runChild(Suite.java:27)
10-Sep-2019 13:43:49         at org.junit.runners.ParentRunner$3.run(ParentRunner.java:290)
10-Sep-2019 13:43:49         at org.junit.runners.ParentRunner$1.schedule(ParentRunner.java:71)
10-Sep-2019 13:43:49         at org.junit.runners.ParentRunner.runChildren(ParentRunner.java:288)
10-Sep-2019 13:43:49         at org.junit.runners.ParentRunner.access$000(ParentRunner.java:58)
10-Sep-2019 13:43:49         at org.junit.runners.ParentRunner$2.evaluate(ParentRunner.java:268)
10-Sep-2019 13:43:49         at org.junit.runners.ParentRunner.run(ParentRunner.java:363)
10-Sep-2019 13:43:49         at org.apache.maven.surefire.junit4.JUnit4Provider.execute(JUnit4Provider.java:283)
10-Sep-2019 13:43:49         at org.apache.maven.surefire.junit4.JUnit4Provider.executeWithRerun(JUnit4Provider.java:173)
10-Sep-2019 13:43:49         at org.apache.maven.surefire.junit4.JUnit4Provider.executeTestSet(JUnit4Provider.java:153)
10-Sep-2019 13:43:49         at org.apache.maven.surefire.junit4.JUnit4Provider.invoke(JUnit4Provider.java:128)
10-Sep-2019 13:43:49         at org.apache.maven.surefire.booter.ForkedBooter.invokeProviderInSameClassLoader(ForkedBooter.java:203)
10-Sep-2019 13:43:49         at org.apache.maven.surefire.booter.ForkedBooter.runSuitesInProcess(ForkedBooter.java:155)
10-Sep-2019 13:43:49         at org.apache.maven.surefire.booter.ForkedBooter.main(ForkedBooter.java:103)
10-Sep-2019 13:43:49
10-Sep-2019 13:43:49
10-Sep-2019 13:43:49 Results :
10-Sep-2019 13:43:49
10-Sep-2019 13:43:49 Tests in error:
10-Sep-2019 13:43:49   KVTableWithProjectionTest>IntegrationTestBase.setUp:97->IntegrationTestBase.checkSystemServices:196->IntegrationTestBase.fetchAccessToken:218->IntegrationTestBase.fetchAccessToken:233->IntegrationTestBase.checkServicesWithRetry:265 » Timeout
10-Sep-2019 13:43:49   TPFSAvroSinkSourceTest>IntegrationTestBase.setUp:97->IntegrationTestBase.checkSystemServices:196->IntegrationTestBase.fetchAccessToken:218->IntegrationTestBase.fetchAccessToken:233->IntegrationTestBase.checkServicesWithRetry:265 » Timeout
10-Sep-2019 13:43:49   BatchAggregatorTest>IntegrationTestBase.setUp:97->IntegrationTestBase.checkSystemServices:196->IntegrationTestBase.fetchAccessToken:218->IntegrationTestBase.fetchAccessToken:233->IntegrationTestBase.checkServicesWithRetry:265 » Timeout
10-Sep-2019 13:43:49   BatchCubeSinkTest>IntegrationTestBase.setUp:97->IntegrationTestBase.checkSystemServices:196->IntegrationTestBase.fetchAccessToken:218->IntegrationTestBase.fetchAccessToken:233->IntegrationTestBase.checkServicesWithRetry:265 » Timeout
10-Sep-2019 13:43:49   BatchJoinerTest>IntegrationTestBase.setUp:97->IntegrationTestBase.checkSystemServices:196->IntegrationTestBase.fetchAccessToken:218->IntegrationTestBase.fetchAccessToken:233->IntegrationTestBase.checkServicesWithRetry:265 » Timeout
10-Sep-2019 13:43:49   BatchJoinerTest>IntegrationTestBase.setUp:97->IntegrationTestBase.checkSystemServices:196->IntegrationTestBase.fetchAccessToken:218->IntegrationTestBase.fetchAccessToken:233->IntegrationTestBase.checkServicesWithRetry:265 » Timeout
10-Sep-2019 13:43:49   ETLMapReduceTest>IntegrationTestBase.setUp:97->IntegrationTestBase.checkSystemServices:196->IntegrationTestBase.fetchAccessToken:218->IntegrationTestBase.fetchAccessToken:233->IntegrationTestBase.checkServicesWithRetry:265 » Timeout
10-Sep-2019 13:43:49   ETLMapReduceTest>IntegrationTestBase.setUp:97->IntegrationTestBase.checkSystemServices:196->IntegrationTestBase.fetchAccessToken:218->IntegrationTestBase.fetchAccessToken:233->IntegrationTestBase.checkServicesWithRetry:265 » Timeout
10-Sep-2019 13:43:49   ETLMapReduceTest>IntegrationTestBase.setUp:97->IntegrationTestBase.checkSystemServices:196->IntegrationTestBase.fetchAccessToken:218->IntegrationTestBase.fetchAccessToken:233->IntegrationTestBase.checkServicesWithRetry:265 » Timeout
10-Sep-2019 13:43:49   ETLMapReduceTest>IntegrationTestBase.setUp:97->IntegrationTestBase.checkSystemServices:196->IntegrationTestBase.fetchAccessToken:218->IntegrationTestBase.fetchAccessToken:233->IntegrationTestBase.checkServicesWithRetry:265 » Timeout
10-Sep-2019 13:43:49   ETLMapReduceTest>IntegrationTestBase.setUp:97->IntegrationTestBase.checkSystemServices:196->IntegrationTestBase.fetchAccessToken:218->IntegrationTestBase.fetchAccessToken:233->IntegrationTestBase.checkServicesWithRetry:265 » Timeout
10-Sep-2019 13:43:49   ExcelInputReaderTest>IntegrationTestBase.setUp:97->IntegrationTestBase.checkSystemServices:196->IntegrationTestBase.fetchAccessToken:218->IntegrationTestBase.fetchAccessToken:233->IntegrationTestBase.checkServicesWithRetry:265 » Timeout
10-Sep-2019 13:43:49   ExcelInputReaderTest>IntegrationTestBase.setUp:97->IntegrationTestBase.checkSystemServices:196->IntegrationTestBase.fetchAccessToken:218->IntegrationTestBase.fetchAccessToken:233->IntegrationTestBase.checkServicesWithRetry:265 » Timeout
10-Sep-2019 13:43:49   HivePluginTest>IntegrationTestBase.setUp:97->IntegrationTestBase.checkSystemServices:196->IntegrationTestBase.fetchAccessToken:218->IntegrationTestBase.fetchAccessToken:233->IntegrationTestBase.checkServicesWithRetry:265 » Timeout
10-Sep-2019 13:43:49   NormalizeTest>IntegrationTestBase.setUp:97->IntegrationTestBase.checkSystemServices:196->IntegrationTestBase.fetchAccessToken:218->IntegrationTestBase.fetchAccessToken:233->IntegrationTestBase.checkServicesWithRetry:265 » Timeout
10-Sep-2019 13:43:49   NormalizeTest>IntegrationTestBase.setUp:97->IntegrationTestBase.checkSystemServices:196->IntegrationTestBase.fetchAccessToken:218->IntegrationTestBase.fetchAccessToken:233->IntegrationTestBase.checkServicesWithRetry:265 » Timeout
10-Sep-2019 13:43:49   RowDenormalizerTest>IntegrationTestBase.setUp:97->IntegrationTestBase.checkSystemServices:196->IntegrationTestBase.fetchAccessToken:218->IntegrationTestBase.fetchAccessToken:233->IntegrationTestBase.checkServicesWithRetry:265 » Timeout
10-Sep-2019 13:43:49   TPFSParquetSinkSourceTest>IntegrationTestBase.setUp:97->IntegrationTestBase.checkSystemServices:196->IntegrationTestBase.fetchAccessToken:218->IntegrationTestBase.fetchAccessToken:233->IntegrationTestBase.checkServicesWithRetry:265 » Timeout
10-Sep-2019 13:43:49   TPFSParquetSinkSourceTest>IntegrationTestBase.setUp:97->IntegrationTestBase.checkSystemServices:196->IntegrationTestBase.fetchAccessToken:218->IntegrationTestBase.fetchAccessToken:233->IntegrationTestBase.checkServicesWithRetry:265 » Timeout
10-Sep-2019 13:43:49   ValueMapperTest>IntegrationTestBase.setUp:97->IntegrationTestBase.checkSystemServices:196->IntegrationTestBase.fetchAccessToken:218->IntegrationTestBase.fetchAccessToken:233->IntegrationTestBase.checkServicesWithRetry:265 » Timeout
10-Sep-2019 13:43:49   XMLReaderTest>IntegrationTestBase.setUp:97->IntegrationTestBase.checkSystemServices:196->IntegrationTestBase.fetchAccessToken:218->IntegrationTestBase.fetchAccessToken:233->IntegrationTestBase.checkServicesWithRetry:265 » Timeout
10-Sep-2019 13:43:49   XMLReaderTest>IntegrationTestBase.setUp:97->IntegrationTestBase.checkSystemServices:196->IntegrationTestBase.fetchAccessToken:218->IntegrationTestBase.fetchAccessToken:233->IntegrationTestBase.checkServicesWithRetry:265 » Timeout
10-Sep-2019 13:43:49   XMLReaderTest>IntegrationTestBase.setUp:97->IntegrationTestBase.checkSystemServices:196->IntegrationTestBase.fetchAccessToken:218->IntegrationTestBase.fetchAccessToken:233->IntegrationTestBase.checkServicesWithRetry:265 » Timeout
10-Sep-2019 13:43:49   XMLReaderTest>IntegrationTestBase.setUp:97->IntegrationTestBase.checkSystemServices:196->IntegrationTestBase.fetchAccessToken:218->IntegrationTestBase.fetchAccessToken:233->IntegrationTestBase.checkServicesWithRetry:265 » Timeout
10-Sep-2019 13:43:49   XMLReaderTest>IntegrationTestBase.setUp:97->IntegrationTestBase.checkSystemServices:196->IntegrationTestBase.fetchAccessToken:218->IntegrationTestBase.fetchAccessToken:233->IntegrationTestBase.checkServicesWithRetry:265 » Timeout
10-Sep-2019 13:43:49   WranglerServiceTest>IntegrationTestBase.setUp:97->IntegrationTestBase.checkSystemServices:196->IntegrationTestBase.fetchAccessToken:218->IntegrationTestBase.fetchAccessToken:233->IntegrationTestBase.checkServicesWithRetry:265 » Timeout
10-Sep-2019 13:43:49   WranglerTest>IntegrationTestBase.setUp:97->IntegrationTestBase.checkSystemServices:196->IntegrationTestBase.fetchAccessToken:218->IntegrationTestBase.fetchAccessToken:233->IntegrationTestBase.checkServicesWithRetry:265 » Timeout
10-Sep-2019 13:43:49   WranglerTest>IntegrationTestBase.setUp:97->IntegrationTestBase.checkSystemServices:196->IntegrationTestBase.fetchAccessToken:218->IntegrationTestBase.fetchAccessToken:233->IntegrationTestBase.checkServicesWithRetry:265 » Timeout
10-Sep-2019 13:43:49   PermissionTest>IntegrationTestBase.setUp:97->IntegrationTestBase.checkSystemServices:196->IntegrationTestBase.fetchAccessToken:218->IntegrationTestBase.fetchAccessToken:233->IntegrationTestBase.checkServicesWithRetry:265 » Timeout
10-Sep-2019 13:43:49   ReadlessIncrementTest>IntegrationTestBase.setUp:97->IntegrationTestBase.checkSystemServices:196->IntegrationTestBase.fetchAccessToken:218->IntegrationTestBase.fetchAccessToken:233->IntegrationTestBase.checkServicesWithRetry:265 » Timeout
10-Sep-2019 13:43:49   HangingWorkerTest>IntegrationTestBase.setUp:97->IntegrationTestBase.checkSystemServices:196->IntegrationTestBase.fetchAccessToken:218->IntegrationTestBase.fetchAccessToken:233->IntegrationTestBase.checkServicesWithRetry:265 » Timeout
10-Sep-2019 13:43:49   ServiceWorkerTest>IntegrationTestBase.setUp:97->IntegrationTestBase.checkSystemServices:196->IntegrationTestBase.fetchAccessToken:218->IntegrationTestBase.fetchAccessToken:233->IntegrationTestBase.checkServicesWithRetry:265 » Timeout
10-Sep-2019 13:43:49   ApplicationTest>IntegrationTestBase.setUp:97->IntegrationTestBase.checkSystemServices:196->IntegrationTestBase.fetchAccessToken:218->IntegrationTestBase.fetchAccessToken:233->IntegrationTestBase.checkServicesWithRetry:265 » Timeout
10-Sep-2019 13:43:49   NamespaceTest>IntegrationTestBase.setUp:97->IntegrationTestBase.checkSystemServices:196->IntegrationTestBase.fetchAccessToken:218->IntegrationTestBase.fetchAccessToken:233->IntegrationTestBase.checkServicesWithRetry:265 » Timeout
10-Sep-2019 13:43:49   DatasetTest>IntegrationTestBase.setUp:97->IntegrationTestBase.checkSystemServices:196->IntegrationTestBase.fetchAccessToken:218->IntegrationTestBase.fetchAccessToken:233->IntegrationTestBase.checkServicesWithRetry:265 » Timeout
10-Sep-2019 13:43:49   FileSetTest>IntegrationTestBase.setUp:97->IntegrationTestBase.checkSystemServices:196->IntegrationTestBase.fetchAccessToken:218->IntegrationTestBase.fetchAccessToken:233->IntegrationTestBase.checkServicesWithRetry:265 » Timeout
10-Sep-2019 13:43:49   PartitionCorrectorTest>IntegrationTestBase.setUp:97->IntegrationTestBase.checkSystemServices:196->IntegrationTestBase.fetchAccessToken:218->IntegrationTestBase.fetchAccessToken:233->IntegrationTestBase.checkServicesWithRetry:265 » Timeout
10-Sep-2019 13:43:49   PartitionedFileSetUpdateTest>IntegrationTestBase.setUp:97->IntegrationTestBase.checkSystemServices:196->IntegrationTestBase.fetchAccessToken:218->IntegrationTestBase.fetchAccessToken:233->IntegrationTestBase.checkServicesWithRetry:265 » Timeout
10-Sep-2019 13:43:49   ProgramMetadataTest>IntegrationTestBase.setUp:97->IntegrationTestBase.checkSystemServices:196->IntegrationTestBase.fetchAccessToken:218->IntegrationTestBase.fetchAccessToken:233->IntegrationTestBase.checkServicesWithRetry:265 » Timeout
10-Sep-2019 13:43:49   ProgramMetadataTest>IntegrationTestBase.setUp:97->IntegrationTestBase.checkSystemServices:196->IntegrationTestBase.fetchAccessToken:218->IntegrationTestBase.fetchAccessToken:233->IntegrationTestBase.checkServicesWithRetry:265 » Timeout
10-Sep-2019 13:43:49   WorkflowTest>IntegrationTestBase.setUp:97->IntegrationTestBase.checkSystemServices:196->IntegrationTestBase.fetchAccessToken:218->IntegrationTestBase.fetchAccessToken:233->IntegrationTestBase.checkServicesWithRetry:265 » Timeout
10-Sep-2019 13:43:49   OperationalStatsTest>IntegrationTestBase.setUp:97->IntegrationTestBase.checkSystemServices:196->IntegrationTestBase.fetchAccessToken:218->IntegrationTestBase.fetchAccessToken:233->IntegrationTestBase.checkServicesWithRetry:265 » Timeout
10-Sep-2019 13:43:49   RemoteCubeTest>IntegrationTestBase.setUp:97->IntegrationTestBase.checkSystemServices:196->IntegrationTestBase.fetchAccessToken:218->IntegrationTestBase.fetchAccessToken:233->IntegrationTestBase.checkServicesWithRetry:265 » Timeout
10-Sep-2019 13:43:49   RemoteKeyValueTest>IntegrationTestBase.setUp:97->IntegrationTestBase.checkSystemServices:196->IntegrationTestBase.fetchAccessToken:218->IntegrationTestBase.fetchAccessToken:233->IntegrationTestBase.checkServicesWithRetry:265 » Timeout
10-Sep-2019 13:43:49   RemoteTableTest>IntegrationTestBase.setUp:97->IntegrationTestBase.checkSystemServices:196->IntegrationTestBase.fetchAccessToken:218->IntegrationTestBase.fetchAccessToken:233->IntegrationTestBase.checkServicesWithRetry:265 » Timeout
10-Sep-2019 13:43:49
10-Sep-2019 13:43:49 Tests run: 45, Failures: 0, Errors: 45, Skipped: 0
10-Sep-2019 13:43:49
10-Sep-2019 13:43:49 [INFO] ------------------------------------------------------------------------
10-Sep-2019 13:43:49 [INFO] Reactor Summary:
10-Sep-2019 13:43:49 [INFO]
10-Sep-2019 13:43:49 [INFO] integration-test .................................. SUCCESS [27.732s]
10-Sep-2019 13:43:49 [INFO] integration-test-core ............................. SUCCESS [10.936s]
10-Sep-2019 13:43:49 [INFO] integration-test-remote ........................... FAILURE [7:31:53.673s]
10-Sep-2019 13:43:49 [INFO] integration-test-standalone ....................... SKIPPED
10-Sep-2019 13:43:49 [INFO] upgrade-test ...................................... SKIPPED
10-Sep-2019 13:43:49 [INFO] long-running-test ................................. SKIPPED
10-Sep-2019 13:43:49 [INFO] perf-test ......................................... SKIPPED
10-Sep-2019 13:43:49 [INFO] ------------------------------------------------------------------------
10-Sep-2019 13:43:49 [INFO] BUILD FAILURE
10-Sep-2019 13:43:49 [INFO] ------------------------------------------------------------------------
10-Sep-2019 13:43:49 [INFO] Total time: 7:32:32.769s
10-Sep-2019 13:43:49 [INFO] Finished at: Tue Sep 10 13:43:49 UTC 2019
10-Sep-2019 13:43:49 [INFO] Final Memory: 147M/1118M
10-Sep-2019 13:43:49 [INFO] ------------------------------------------------------------------------
10-Sep-2019 13:43:49 [ERROR] Failed to execute goal org.apache.maven.plugins:maven-surefire-plugin:2.18.1:test (default-test) on project integration-test-remote: There are test failures.
10-Sep-2019 13:43:49 [ERROR]
10-Sep-2019 13:43:49 [ERROR] Please refer to /var/bamboo/xml-data/build-dir/IT-ITN-DSTC54/cdap-integration-tests/integration-test-remote/target/surefire-reports for the individual test results.
10-Sep-2019 13:43:49 [ERROR] -> [Help 1]
10-Sep-2019 13:43:49 [ERROR]
10-Sep-2019 13:43:49 [ERROR] To see the full stack trace of the errors, re-run Maven with the -e switch.
10-Sep-2019 13:43:49 [ERROR] Re-run Maven using the -X switch to enable full debug logging.
10-Sep-2019 13:43:49 [ERROR]
10-Sep-2019 13:43:49 [ERROR] For more information about the errors and possible solutions, please read the following articles:
10-Sep-2019 13:43:49 [ERROR] [Help 1] http://cwiki.apache.org/confluence/display/MAVEN/MojoFailureException
10-Sep-2019 13:43:49 [ERROR]
10-Sep-2019 13:43:49 [ERROR] After correcting the problems, you can resume the build with the command
10-Sep-2019 13:43:49 [ERROR]   mvn <goals> -rf :integration-test-remote
10-Sep-2019 13:43:49 Failing task since return code of [/opt/maven/bin/mvn --batch-mode -Djava.io.tmpdir=/tmp/IT-ITN-DSTC54 clean test -U -Dtest=CDH54Suite -Dcdap.username=******** -Dcdap.password=******** -DinstanceUri=http://10.210.0.169] was 1 while expected 0
10-Sep-2019 13:43:49 Parsing test results under /var/bamboo/xml-data/build-dir/IT-ITN-DSTC54...
10-Sep-2019 13:43:50 Finished task 'Integration test - cluster' with result: Failed
10-Sep-2019 13:43:50 Running post build plugin 'Docker Container Cleanup'
10-Sep-2019 13:43:50 Running post build plugin 'NCover Results Collector'
10-Sep-2019 13:43:50 Running post build plugin 'Clover Results Collector'
10-Sep-2019 13:43:50 Running post build plugin 'npm Cache Cleanup'
10-Sep-2019 13:43:50 Running post build plugin 'Artifact Copier'
10-Sep-2019 13:43:50 Finalising the build...
10-Sep-2019 13:43:50 Stopping timer.
10-Sep-2019 13:43:50 Build IT-ITN-DSTC54-314 completed.
10-Sep-2019 13:43:50 Running on server: post build plugin 'NCover Results Collector'
10-Sep-2019 13:43:50 Running on server: post build plugin 'Build Hanging Detection Configuration'
10-Sep-2019 13:43:50 Running on server: post build plugin 'Clover Delta Calculator'
10-Sep-2019 13:43:50 Running on server: post build plugin 'Maven Dependencies Postprocessor'
10-Sep-2019 13:43:50 All post build plugins have finished
10-Sep-2019 13:43:50 Generating build results summary...
10-Sep-2019 13:43:50 Saving build results to disk...
10-Sep-2019 13:43:50 Logging substituted variables...
10-Sep-2019 13:43:50 Indexing build results...
10-Sep-2019 13:43:50 Finished building IT-ITN-DSTC54-314.