Build #169

Build: #169 failed

Job: Distro Tests - CDH 5.4 failed

Job result summary

Completed
Duration
422 minutes
Agent
bamboo-agent07
Revision
2c372e714e11b9edc4534b2ae96309431d09ba1f 2c372e714e11b9edc4534b2ae96309431d09ba1f
Total tests
54
Failing since
#168 (Scheduled – )
Fixed in
#179 (Rebuilt by Ali Anwar)

Tests

  • 54 tests in total
  • 24 tests failed
  • 24 failures are new
  • 249 minutes taken in total.
New test failures 24
Status Test Duration
Collapse Failed KVTableWithProjectionTest testKVTableWithProjection History
10 mins
java.util.concurrent.TimeoutException: Timeout occurred. Expected true but found false.
	at co.cask.cdap.common.utils.Tasks.waitFor(Tasks.java:70)
	at co.cask.cdap.common.utils.Tasks.waitFor(Tasks.java:91)
	at co.cask.cdap.common.utils.Tasks.waitFor(Tasks.java:130)
	at co.cask.cdap.test.AbstractProgramManager.waitForRuns(AbstractProgramManager.java:96)
	at co.cask.cdap.test.AbstractProgramManager.waitForRun(AbstractProgramManager.java:90)
	at co.cask.cdap.app.etl.KVTableWithProjectionTest.testKVTableWithProjection(KVTableWithProjectionTest.java:84)
Collapse Failed StreamTPFSWithProjectionTest testStreamTPFSWithProjection History
10 mins
java.util.concurrent.TimeoutException: Timeout occurred. Expected true but found false.
	at co.cask.cdap.common.utils.Tasks.waitFor(Tasks.java:70)
	at co.cask.cdap.common.utils.Tasks.waitFor(Tasks.java:91)
	at co.cask.cdap.common.utils.Tasks.waitFor(Tasks.java:130)
	at co.cask.cdap.test.AbstractProgramManager.waitForRuns(AbstractProgramManager.java:96)
	at co.cask.cdap.test.AbstractProgramManager.waitForRun(AbstractProgramManager.java:90)
	at co.cask.cdap.app.etl.StreamTPFSWithProjectionTest.testStreamTPFSWithProjection(StreamTPFSWithProjectionTest.java:89)
Collapse Failed BatchAggregatorTest test History
< 1 sec
java.util.concurrent.TimeoutException: Timeout occurred. Expected true but found false.
	at co.cask.cdap.common.utils.Tasks.waitFor(Tasks.java:70)
	at co.cask.cdap.common.utils.Tasks.waitFor(Tasks.java:91)
	at co.cask.cdap.common.utils.Tasks.waitFor(Tasks.java:130)
	at co.cask.cdap.test.AbstractProgramManager.waitForRuns(AbstractProgramManager.java:96)
	at co.cask.cdap.test.AbstractProgramManager.waitForRun(AbstractProgramManager.java:90)
	at co.cask.cdap.app.etl.batch.BatchAggregatorTest.test(BatchAggregatorTest.java:162)
Collapse Failed BatchCubeSinkTest test History
5 mins
java.util.concurrent.TimeoutException: Timeout occurred. Expected true but found false.
	at co.cask.cdap.common.utils.Tasks.waitFor(Tasks.java:70)
	at co.cask.cdap.common.utils.Tasks.waitFor(Tasks.java:91)
	at co.cask.cdap.common.utils.Tasks.waitFor(Tasks.java:130)
	at co.cask.cdap.test.AbstractProgramManager.waitForRuns(AbstractProgramManager.java:96)
	at co.cask.cdap.test.AbstractProgramManager.waitForRun(AbstractProgramManager.java:90)
	at co.cask.cdap.app.etl.batch.BatchCubeSinkTest.test(BatchCubeSinkTest.java:108)
Collapse Failed BatchJoinerTest testJoinerMR History
< 1 sec
java.util.concurrent.TimeoutException: Timeout occurred. Expected true but found false.
	at co.cask.cdap.common.utils.Tasks.waitFor(Tasks.java:70)
	at co.cask.cdap.common.utils.Tasks.waitFor(Tasks.java:91)
	at co.cask.cdap.common.utils.Tasks.waitFor(Tasks.java:130)
	at co.cask.cdap.test.AbstractProgramManager.waitForRuns(AbstractProgramManager.java:96)
	at co.cask.cdap.test.AbstractProgramManager.waitForRun(AbstractProgramManager.java:90)
	at co.cask.cdap.app.etl.batch.BatchJoinerTest.testJoiner(BatchJoinerTest.java:216)
	at co.cask.cdap.app.etl.batch.BatchJoinerTest.testJoinerMR(BatchJoinerTest.java:85)
Collapse Failed BatchJoinerTest testJoinerSpark History
< 1 sec
java.util.concurrent.TimeoutException: Timeout occurred. Expected true but found false.
	at co.cask.cdap.common.utils.Tasks.waitFor(Tasks.java:70)
	at co.cask.cdap.common.utils.Tasks.waitFor(Tasks.java:91)
	at co.cask.cdap.common.utils.Tasks.waitFor(Tasks.java:130)
	at co.cask.cdap.test.AbstractProgramManager.waitForRuns(AbstractProgramManager.java:96)
	at co.cask.cdap.test.AbstractProgramManager.waitForRun(AbstractProgramManager.java:90)
	at co.cask.cdap.app.etl.batch.BatchJoinerTest.testJoiner(BatchJoinerTest.java:216)
	at co.cask.cdap.app.etl.batch.BatchJoinerTest.testJoinerSpark(BatchJoinerTest.java:93)
Collapse Failed ETLMapReduceTest testDAG History
6 mins
java.util.concurrent.TimeoutException: Timeout occurred. Expected true but found false.
	at co.cask.cdap.common.utils.Tasks.waitFor(Tasks.java:70)
	at co.cask.cdap.common.utils.Tasks.waitFor(Tasks.java:91)
	at co.cask.cdap.common.utils.Tasks.waitFor(Tasks.java:130)
	at co.cask.cdap.test.AbstractProgramManager.waitForRuns(AbstractProgramManager.java:96)
	at co.cask.cdap.test.AbstractProgramManager.waitForRun(AbstractProgramManager.java:90)
	at co.cask.cdap.app.etl.batch.ETLMapReduceTest.testDAG(ETLMapReduceTest.java:195)
Collapse Failed ETLMapReduceTest testDAGSchemaChanges History
6 mins
java.util.concurrent.TimeoutException: Timeout occurred. Expected true but found false.
	at co.cask.cdap.common.utils.Tasks.waitFor(Tasks.java:70)
	at co.cask.cdap.common.utils.Tasks.waitFor(Tasks.java:91)
	at co.cask.cdap.common.utils.Tasks.waitFor(Tasks.java:130)
	at co.cask.cdap.test.AbstractProgramManager.waitForRuns(AbstractProgramManager.java:96)
	at co.cask.cdap.test.AbstractProgramManager.waitForRun(AbstractProgramManager.java:90)
	at co.cask.cdap.app.etl.batch.ETLMapReduceTest.testDAGSchemaChanges(ETLMapReduceTest.java:448)
Collapse Failed ETLMapReduceTest testKVToKV History
6 mins
java.util.concurrent.TimeoutException: Timeout occurred. Expected true but found false.
	at co.cask.cdap.common.utils.Tasks.waitFor(Tasks.java:70)
	at co.cask.cdap.common.utils.Tasks.waitFor(Tasks.java:91)
	at co.cask.cdap.common.utils.Tasks.waitFor(Tasks.java:130)
	at co.cask.cdap.test.AbstractProgramManager.waitForRuns(AbstractProgramManager.java:96)
	at co.cask.cdap.test.AbstractProgramManager.waitForRun(AbstractProgramManager.java:90)
	at co.cask.cdap.app.etl.batch.ETLMapReduceTest.testKVToKV(ETLMapReduceTest.java:108)
Collapse Failed ETLMapReduceTest testTableToTableWithValidations History
5 mins
java.util.concurrent.TimeoutException: Timeout occurred. Expected true but found false.
	at co.cask.cdap.common.utils.Tasks.waitFor(Tasks.java:70)
	at co.cask.cdap.common.utils.Tasks.waitFor(Tasks.java:91)
	at co.cask.cdap.common.utils.Tasks.waitFor(Tasks.java:130)
	at co.cask.cdap.test.AbstractProgramManager.waitForRuns(AbstractProgramManager.java:96)
	at co.cask.cdap.test.AbstractProgramManager.waitForRun(AbstractProgramManager.java:90)
	at co.cask.cdap.app.etl.batch.ETLMapReduceTest.testTableToTableWithValidations(ETLMapReduceTest.java:620)
Collapse Failed ExcelInputReaderTest testExcelReader History
10 mins
java.util.concurrent.TimeoutException: Timeout occurred. Expected true but found false.
	at co.cask.cdap.common.utils.Tasks.waitFor(Tasks.java:70)
	at co.cask.cdap.common.utils.Tasks.waitFor(Tasks.java:91)
	at co.cask.cdap.common.utils.Tasks.waitFor(Tasks.java:130)
	at co.cask.cdap.test.AbstractProgramManager.waitForRuns(AbstractProgramManager.java:96)
	at co.cask.cdap.test.AbstractProgramManager.waitForRun(AbstractProgramManager.java:90)
	at co.cask.cdap.app.etl.batch.ExcelInputReaderTest.testExcelReader(ExcelInputReaderTest.java:144)
Collapse Failed ExcelInputReaderTest testExcelReaderReprocessFalse History
11 mins
java.util.concurrent.TimeoutException: Timeout occurred. Expected true but found false.
	at co.cask.cdap.common.utils.Tasks.waitFor(Tasks.java:70)
	at co.cask.cdap.common.utils.Tasks.waitFor(Tasks.java:91)
	at co.cask.cdap.common.utils.Tasks.waitFor(Tasks.java:130)
	at co.cask.cdap.test.AbstractProgramManager.waitForRuns(AbstractProgramManager.java:96)
	at co.cask.cdap.test.AbstractProgramManager.waitForRun(AbstractProgramManager.java:90)
	at co.cask.cdap.app.etl.batch.ExcelInputReaderTest.testExcelReaderReprocessFalse(ExcelInputReaderTest.java:214)
Collapse Failed NormalizeTest testNormalize History
5 mins
java.util.concurrent.TimeoutException: Timeout occurred. Expected true but found false.
	at co.cask.cdap.common.utils.Tasks.waitFor(Tasks.java:70)
	at co.cask.cdap.common.utils.Tasks.waitFor(Tasks.java:91)
	at co.cask.cdap.common.utils.Tasks.waitFor(Tasks.java:130)
	at co.cask.cdap.test.AbstractProgramManager.waitForRuns(AbstractProgramManager.java:96)
	at co.cask.cdap.test.AbstractProgramManager.waitForRun(AbstractProgramManager.java:90)
	at co.cask.cdap.app.etl.batch.NormalizeTest.startWorkFlow(NormalizeTest.java:131)
	at co.cask.cdap.app.etl.batch.NormalizeTest.testNormalize(NormalizeTest.java:165)
Collapse Failed NormalizeTest testNormalizeWithEmptyAttributeValue History
5 mins
java.util.concurrent.TimeoutException: Timeout occurred. Expected true but found false.
	at co.cask.cdap.common.utils.Tasks.waitFor(Tasks.java:70)
	at co.cask.cdap.common.utils.Tasks.waitFor(Tasks.java:91)
	at co.cask.cdap.common.utils.Tasks.waitFor(Tasks.java:130)
	at co.cask.cdap.test.AbstractProgramManager.waitForRuns(AbstractProgramManager.java:96)
	at co.cask.cdap.test.AbstractProgramManager.waitForRun(AbstractProgramManager.java:90)
	at co.cask.cdap.app.etl.batch.NormalizeTest.startWorkFlow(NormalizeTest.java:131)
	at co.cask.cdap.app.etl.batch.NormalizeTest.testNormalizeWithEmptyAttributeValue(NormalizeTest.java:218)
Collapse Failed RowDenormalizerTest test History
10 mins
java.util.concurrent.TimeoutException: Timeout occurred. Expected true but found false.
	at co.cask.cdap.common.utils.Tasks.waitFor(Tasks.java:70)
	at co.cask.cdap.common.utils.Tasks.waitFor(Tasks.java:91)
	at co.cask.cdap.common.utils.Tasks.waitFor(Tasks.java:130)
	at co.cask.cdap.test.AbstractProgramManager.waitForRuns(AbstractProgramManager.java:96)
	at co.cask.cdap.test.AbstractProgramManager.waitForRun(AbstractProgramManager.java:90)
	at co.cask.cdap.app.etl.batch.RowDenormalizerTest.test(RowDenormalizerTest.java:102)
Collapse Failed TPFSSinkSourceTest testMR History
10 mins
java.util.concurrent.TimeoutException: Timeout occurred. Expected true but found false.
	at co.cask.cdap.common.utils.Tasks.waitFor(Tasks.java:70)
	at co.cask.cdap.common.utils.Tasks.waitFor(Tasks.java:91)
	at co.cask.cdap.common.utils.Tasks.waitFor(Tasks.java:130)
	at co.cask.cdap.test.AbstractProgramManager.waitForRuns(AbstractProgramManager.java:96)
	at co.cask.cdap.test.AbstractProgramManager.waitForRun(AbstractProgramManager.java:90)
	at co.cask.cdap.app.etl.batch.TPFSSinkSourceTest.testStreamTPFSWithProjection(TPFSSinkSourceTest.java:95)
	at co.cask.cdap.app.etl.batch.TPFSSinkSourceTest.testMR(TPFSSinkSourceTest.java:63)
Collapse Failed TPFSSinkSourceTest testSpark History
10 mins
java.util.concurrent.TimeoutException: Timeout occurred. Expected true but found false.
	at co.cask.cdap.common.utils.Tasks.waitFor(Tasks.java:70)
	at co.cask.cdap.common.utils.Tasks.waitFor(Tasks.java:91)
	at co.cask.cdap.common.utils.Tasks.waitFor(Tasks.java:130)
	at co.cask.cdap.test.AbstractProgramManager.waitForRuns(AbstractProgramManager.java:96)
	at co.cask.cdap.test.AbstractProgramManager.waitForRun(AbstractProgramManager.java:90)
	at co.cask.cdap.app.etl.batch.TPFSSinkSourceTest.testStreamTPFSWithProjection(TPFSSinkSourceTest.java:95)
	at co.cask.cdap.app.etl.batch.TPFSSinkSourceTest.testSpark(TPFSSinkSourceTest.java:71)
Collapse Failed ValueMapperTest test History
11 mins
java.util.concurrent.TimeoutException: Timeout occurred. Expected true but found false.
	at co.cask.cdap.common.utils.Tasks.waitFor(Tasks.java:70)
	at co.cask.cdap.common.utils.Tasks.waitFor(Tasks.java:91)
	at co.cask.cdap.common.utils.Tasks.waitFor(Tasks.java:130)
	at co.cask.cdap.test.AbstractProgramManager.waitForRuns(AbstractProgramManager.java:96)
	at co.cask.cdap.test.AbstractProgramManager.waitForRun(AbstractProgramManager.java:90)
	at co.cask.cdap.app.etl.batch.ValueMapperTest.test(ValueMapperTest.java:138)
Collapse Failed XMLReaderTest testInvalidNodePathWithMoveAction History
6 mins
java.util.concurrent.TimeoutException: Timeout occurred. Expected true but found false.
	at co.cask.cdap.common.utils.Tasks.waitFor(Tasks.java:70)
	at co.cask.cdap.common.utils.Tasks.waitFor(Tasks.java:91)
	at co.cask.cdap.common.utils.Tasks.waitFor(Tasks.java:130)
	at co.cask.cdap.test.AbstractProgramManager.waitForRuns(AbstractProgramManager.java:96)
	at co.cask.cdap.test.AbstractProgramManager.waitForRun(AbstractProgramManager.java:90)
	at co.cask.cdap.app.etl.batch.XMLReaderTest.startWorkFlow(XMLReaderTest.java:151)
	at co.cask.cdap.app.etl.batch.XMLReaderTest.testInvalidNodePathWithMoveAction(XMLReaderTest.java:304)
Collapse Failed XMLReaderTest testPatternWithDeleteAction History
5 mins
java.util.concurrent.TimeoutException: Timeout occurred. Expected true but found false.
	at co.cask.cdap.common.utils.Tasks.waitFor(Tasks.java:70)
	at co.cask.cdap.common.utils.Tasks.waitFor(Tasks.java:91)
	at co.cask.cdap.common.utils.Tasks.waitFor(Tasks.java:130)
	at co.cask.cdap.test.AbstractProgramManager.waitForRuns(AbstractProgramManager.java:96)
	at co.cask.cdap.test.AbstractProgramManager.waitForRun(AbstractProgramManager.java:90)
	at co.cask.cdap.app.etl.batch.XMLReaderTest.startWorkFlow(XMLReaderTest.java:151)
	at co.cask.cdap.app.etl.batch.XMLReaderTest.testPatternWithDeleteAction(XMLReaderTest.java:354)
Collapse Failed XMLReaderTest testPreProcessingNotRequired History
6 mins
java.util.concurrent.TimeoutException: Timeout occurred. Expected true but found false.
	at co.cask.cdap.common.utils.Tasks.waitFor(Tasks.java:70)
	at co.cask.cdap.common.utils.Tasks.waitFor(Tasks.java:91)
	at co.cask.cdap.common.utils.Tasks.waitFor(Tasks.java:130)
	at co.cask.cdap.test.AbstractProgramManager.waitForRuns(AbstractProgramManager.java:96)
	at co.cask.cdap.test.AbstractProgramManager.waitForRun(AbstractProgramManager.java:90)
	at co.cask.cdap.app.etl.batch.XMLReaderTest.startWorkFlow(XMLReaderTest.java:151)
	at co.cask.cdap.app.etl.batch.XMLReaderTest.testPreProcessingNotRequired(XMLReaderTest.java:192)
Collapse Failed XMLReaderTest testPreProcessingRequired History
6 mins
java.util.concurrent.TimeoutException: Timeout occurred. Expected true but found false.
	at co.cask.cdap.common.utils.Tasks.waitFor(Tasks.java:70)
	at co.cask.cdap.common.utils.Tasks.waitFor(Tasks.java:91)
	at co.cask.cdap.common.utils.Tasks.waitFor(Tasks.java:130)
	at co.cask.cdap.test.AbstractProgramManager.waitForRuns(AbstractProgramManager.java:96)
	at co.cask.cdap.test.AbstractProgramManager.waitForRun(AbstractProgramManager.java:90)
	at co.cask.cdap.app.etl.batch.XMLReaderTest.startWorkFlow(XMLReaderTest.java:151)
	at co.cask.cdap.app.etl.batch.XMLReaderTest.testPreProcessingRequired(XMLReaderTest.java:252)
Collapse Failed WranglerTest testWranglerMR History
11 mins
java.util.concurrent.TimeoutException: Timeout occurred. Expected true but found false.
	at co.cask.cdap.common.utils.Tasks.waitFor(Tasks.java:70)
	at co.cask.cdap.common.utils.Tasks.waitFor(Tasks.java:91)
	at co.cask.cdap.common.utils.Tasks.waitFor(Tasks.java:130)
	at co.cask.cdap.test.AbstractProgramManager.waitForRuns(AbstractProgramManager.java:96)
	at co.cask.cdap.test.AbstractProgramManager.waitForRun(AbstractProgramManager.java:90)
	at co.cask.cdap.app.etl.wrangler.WranglerTest.testWrangler(WranglerTest.java:182)
	at co.cask.cdap.app.etl.wrangler.WranglerTest.testWranglerMR(WranglerTest.java:81)
Collapse Failed WranglerTest testWranglerSpark History
11 mins
java.util.concurrent.TimeoutException: Timeout occurred. Expected true but found false.
	at co.cask.cdap.common.utils.Tasks.waitFor(Tasks.java:70)
	at co.cask.cdap.common.utils.Tasks.waitFor(Tasks.java:91)
	at co.cask.cdap.common.utils.Tasks.waitFor(Tasks.java:130)
	at co.cask.cdap.test.AbstractProgramManager.waitForRuns(AbstractProgramManager.java:96)
	at co.cask.cdap.test.AbstractProgramManager.waitForRun(AbstractProgramManager.java:90)
	at co.cask.cdap.app.etl.wrangler.WranglerTest.testWrangler(WranglerTest.java:182)
	at co.cask.cdap.app.etl.wrangler.WranglerTest.testWranglerSpark(WranglerTest.java:89)

Error summary

The build generated some errors. See the full build log for more details.

Java HotSpot(TM) 64-Bit Server VM warning: ignoring option MaxPermSize=128m; support was removed in 8.0
Warning:  org.apache.xerces.jaxp.SAXParserImpl$JAXPSAXParser: Property 'http://www.oracle.com/xml/jaxp/properties/entityExpansionLimit' is not recognized.
Compiler warnings:
  WARNING:  'org.apache.xerces.jaxp.SAXParserImpl: Property 'http://javax.xml.XMLConstants/property/accessExternalDTD' is not recognized.'
Warning:  org.apache.xerces.parsers.SAXParser: Feature 'http://javax.xml.XMLConstants/feature/secure-processing' is not recognized.
Warning:  org.apache.xerces.parsers.SAXParser: Property 'http://javax.xml.XMLConstants/property/accessExternalDTD' is not recognized.
Warning:  org.apache.xerces.parsers.SAXParser: Property 'http://www.oracle.com/xml/jaxp/properties/entityExpansionLimit' is not recognized.
Warning:  org.apache.xerces.jaxp.SAXParserImpl$JAXPSAXParser: Property 'http://www.oracle.com/xml/jaxp/properties/entityExpansionLimit' is not recognized.
Compiler warnings:
  WARNING:  'org.apache.xerces.jaxp.SAXParserImpl: Property 'http://javax.xml.XMLConstants/property/accessExternalDTD' is not recognized.'
Warning:  org.apache.xerces.parsers.SAXParser: Feature 'http://javax.xml.XMLConstants/feature/secure-processing' is not recognized.
Warning:  org.apache.xerces.parsers.SAXParser: Property 'http://javax.xml.XMLConstants/property/accessExternalDTD' is not recognized.
Warning:  org.apache.xerces.parsers.SAXParser: Property 'http://www.oracle.com/xml/jaxp/properties/entityExpansionLimit' is not recognized.
Warning:  org.apache.xerces.jaxp.SAXParserImpl$JAXPSAXParser: Property 'http://www.oracle.com/xml/jaxp/properties/entityExpansionLimit' is not recognized.
Compiler warnings:
  WARNING:  'org.apache.xerces.jaxp.SAXParserImpl: Property 'http://javax.xml.XMLConstants/property/accessExternalDTD' is not recognized.'
Warning:  org.apache.xerces.parsers.SAXParser: Feature 'http://javax.xml.XMLConstants/feature/secure-processing' is not recognized.
Warning:  org.apache.xerces.parsers.SAXParser: Property 'http://javax.xml.XMLConstants/property/accessExternalDTD' is not recognized.
Warning:  org.apache.xerces.parsers.SAXParser: Property 'http://www.oracle.com/xml/jaxp/properties/entityExpansionLimit' is not recognized.
SLF4J: Class path contains multiple SLF4J bindings.
SLF4J: Found binding in [jar:file:/home/bamboo/.m2/repository/co/cask/cdap/cdap-cli/5.1.0-SNAPSHOT/cdap-cli-5.1.0-SNAPSHOT.jar!/org/slf4j/impl/StaticLoggerBinder.class]
SLF4J: Found binding in [jar:file:/home/bamboo/.m2/repository/co/cask/cdap/cdap-explore-jdbc/5.1.0-SNAPSHOT/cdap-explore-jdbc-5.1.0-SNAPSHOT.jar!/org/slf4j/impl/StaticLoggerBinder.class]
SLF4J: Found binding in [jar:file:/home/bamboo/.m2/repository/ch/qos/logback/logback-classic/1.0.9/logback-classic-1.0.9.jar!/org/slf4j/impl/StaticLoggerBinder.class]
SLF4J: See http://www.slf4j.org/codes.html#multiple_bindings for an explanation.
SLF4J: Actual binding is of type [ch.qos.logback.classic.util.ContextSelectorStaticBinder]