Build #320

Build: #320 failed

Job: Distro Tests - CDH 5.14 failed

Test results

  • 46 tests in total
  • 1 test failed
  • 1 failure is new
  • 213 minutes taken in total.

Build 320 has the following 1 errors: 1 new failure(s) occurred since the previous build.

New test failures 1
Status Test Duration
Collapse Failed ValueMapperTest test History
1 min
java.util.concurrent.ExecutionException: java.lang.RuntimeException: java.io.IOException: 500: Connection refused (Connection refused)
	at io.cdap.cdap.client.util.RESTClient.execute(RESTClient.java:132)
	at io.cdap.cdap.client.util.RESTClient.execute(RESTClient.java:74)
	at io.cdap.cdap.client.ProgramClient.getProgramRuns(ProgramClient.java:502)
	at io.cdap.cdap.test.remote.RemoteApplicationManager.getHistory(RemoteApplicationManager.java:160)
	at io.cdap.cdap.test.AbstractProgramManager.getHistory(AbstractProgramManager.java:150)
	at io.cdap.cdap.test.AbstractProgramManager.lambda$waitForRuns$0(AbstractProgramManager.java:96)
	at io.cdap.cdap.common.utils.Tasks.waitFor(Tasks.java:58)
(8 more lines...)