Build #93

Build: #93 failed Rebuilt by Ali Anwar

Build result summary

Details

Completed
Duration
356 minutes
Labels
None
Revision
b161105f660abd4ebaf22f7aa276bc053cb5990a b161105f660abd4ebaf22f7aa276bc053cb5990a
Total tests
1074
Failing since
#91 (Scheduled – )
Number of retries
1

Responsible

This build has been failing since #91
No one has taken responsibility

Tests

New test failures 1
Status Test View job Duration
Collapse Failed ApplicationTest test History
Distro Tests - CDH 5.12 26 secs
java.io.IOException: 500: No server address listed in hbase:meta for region cdap_system:artifact.meta,,1537091046316.763994d6fe0704b3dc48bee21806f9d1. containing row r:default:
	at co.cask.cdap.client.util.RESTClient.execute(RESTClient.java:132)
	at co.cask.cdap.client.util.RESTClient.execute(RESTClient.java:74)
	at co.cask.cdap.client.ArtifactClient.list(ArtifactClient.java:122)
	at co.cask.cdap.test.IntegrationTestBase.doClear(IntegrationTestBase.java:416)
	at co.cask.cdap.test.IntegrationTestBase.setUp(IntegrationTestBase.java:109)
	at sun.reflect.NativeMethodAccessorImpl.invoke0(Native Method)
	at sun.reflect.NativeMethodAccessorImpl.invoke(NativeMethodAccessorImpl.java:62)
(33 more lines...)
Existing test failures 1
Status Test Failing since View job Duration
java.util.concurrent.ExecutionException: java.sql.SQLException: Error while processing statement: FAILED: Execution Error, return code 2 from org.apache.hadoop.hive.ql.exec.mr.MapRedTask
	at com.google.common.util.concurrent.AbstractFuture.getDoneValue(AbstractFuture.java:500)
	at com.google.common.util.concurrent.AbstractFuture.get(AbstractFuture.java:479)
	at co.cask.cdap.apps.explore.ExploreTest.testInsertQuery(ExploreTest.java:102)
	at co.cask.cdap.apps.explore.ExploreTest.test(ExploreTest.java:93)
Caused by: java.sql.SQLException: Error while processing statement: FAILED: Execution Error, return code 2 from org.apache.hadoop.hive.ql.exec.mr.MapRedTask
	at co.cask.cdap.explore.client.AbstractExploreClient$23.onSuccess(AbstractExploreClient.java:401)
	at co.cask.cdap.explore.client.AbstractExploreClient$23$1.run(AbstractExploreClient.java:395)
(11 more lines...)
Fixed tests 1
Status Test Failing since View job Duration
Successful PurchaseMetadataTest testLineage History
Failing since build #91 (Scheduled) Distro Tests - HDP 2.6 6 mins