Build #92

Build: #92 failed Scheduled

Build result summary

Details

Completed
Duration
349 minutes
Labels
None
Revision
b161105f660abd4ebaf22f7aa276bc053cb5990a b161105f660abd4ebaf22f7aa276bc053cb5990a
Total tests
1074
Failing since
#91 (Scheduled – )

Responsible

This build has been failing since #91
No one has taken responsibility

Tests

Existing test failures 2
Status Test Failing since View job Duration
java.util.concurrent.ExecutionException: java.sql.SQLException: Error while processing statement: FAILED: Execution Error, return code 2 from org.apache.hadoop.hive.ql.exec.mr.MapRedTask
	at com.google.common.util.concurrent.AbstractFuture.getDoneValue(AbstractFuture.java:500)
	at com.google.common.util.concurrent.AbstractFuture.get(AbstractFuture.java:479)
	at co.cask.cdap.apps.explore.ExploreTest.testInsertQuery(ExploreTest.java:102)
	at co.cask.cdap.apps.explore.ExploreTest.test(ExploreTest.java:93)
Caused by: java.sql.SQLException: Error while processing statement: FAILED: Execution Error, return code 2 from org.apache.hadoop.hive.ql.exec.mr.MapRedTask
	at co.cask.cdap.explore.client.AbstractExploreClient$23.onSuccess(AbstractExploreClient.java:401)
	at co.cask.cdap.explore.client.AbstractExploreClient$23$1.run(AbstractExploreClient.java:395)
(11 more lines...)
java.util.concurrent.TimeoutException: Timeout occurred. Expected [MetadataRecord{entityId=application:default.PurchaseHistory.-SNAPSHOT, scope=USER, properties={spKey1=spApp1}, tags=[]}, MetadataRecord{entityId=program:default.PurchaseHistory.-SNAPSHOT.service.PurchaseHistoryService, scope=USER, properties={spKey1=spValue1, spKey2=spValue2}, tags=[serviceTag1, serviceTag2]}, MetadataRecord{entityId=dataset:default.history, scope=USER, properties={}, tags=[dsTag1, dsTag2]}] but found [MetadataRecord{entityId=dataset:default.history, scope=USER, properties={}, tags=[dsTag1, dsTag2]}, MetadataRecord{entityId=application:default.PurchaseHistory.-SNAPSHOT, scope=USER, properties={spKey1=spApp1}, tags=[]}, MetadataRecord{entityId=program:default.PurchaseHistory.-SNAPSHOT.service.PurchaseHistoryService, scope=USER, properties={spKey1=spValue1}, tags=[serviceTag1]}].
	at co.cask.cdap.common.utils.Tasks.waitFor(Tasks.java:70)
	at co.cask.cdap.common.utils.Tasks.waitFor(Tasks.java:91)
	at co.cask.cdap.apps.metadata.PurchaseMetadataTest.waitFor(PurchaseMetadataTest.java:339)
	at co.cask.cdap.apps.metadata.PurchaseMetadataTest.testLineage(PurchaseMetadataTest.java:285)
Fixed tests 1
Status Test Failing since View job Duration
Successful ExploreTest test History
Failing since build #91 (Scheduled) Distro Tests - HDP 2.2 < 1 sec