Build #474

Build: #474 failed Scheduled

Build result summary

Details

Completed
Duration
485 minutes
Labels
None
Revision
f9f9ced42f3367d303a4e6abbbfb34f90e02f2ad f9f9ced42f3367d303a4e6abbbfb34f90e02f2ad
Total tests
495
Failing since
#450 (Scheduled – )

Responsible

This build has been failing since #450
No one has taken responsibility

Tests

Existing test failures 264
Status Test Failing since View job Duration
java.util.concurrent.TimeoutException: Timeout occurred. Expected true but found false.
	at io.cdap.cdap.common.utils.Tasks.waitFor(Tasks.java:70)
	at io.cdap.cdap.common.utils.Tasks.waitFor(Tasks.java:91)
	at io.cdap.cdap.test.AbstractProgramManager.waitForRuns(AbstractProgramManager.java:109)
	at io.cdap.cdap.test.AbstractProgramManager.startAndWaitForRun(AbstractProgramManager.java:80)
	at io.cdap.cdap.test.AudiTestBase.startAndWaitForRun(AudiTestBase.java:277)
	at io.cdap.cdap.test.AudiTestBase.startAndWaitForRun(AudiTestBase.java:271)
	at io.cdap.cdap.app.etl.KVTableWithProjectionTest.testKVTableWithProjection(KVTableWithProjectionTest.java:83)
java.util.concurrent.TimeoutException: Timeout occurred. Expected true but found false.
	at io.cdap.cdap.common.utils.Tasks.waitFor(Tasks.java:70)
	at io.cdap.cdap.common.utils.Tasks.waitFor(Tasks.java:91)
	at io.cdap.cdap.test.AbstractProgramManager.waitForRuns(AbstractProgramManager.java:109)
	at io.cdap.cdap.test.AbstractProgramManager.startAndWaitForRun(AbstractProgramManager.java:80)
	at io.cdap.cdap.test.AudiTestBase.startAndWaitForRun(AudiTestBase.java:277)
	at io.cdap.cdap.test.AudiTestBase.startAndWaitForRun(AudiTestBase.java:271)
	at io.cdap.cdap.app.etl.KVTableWithProjectionTest.testKVTableWithProjection(KVTableWithProjectionTest.java:83)
java.util.concurrent.TimeoutException: Timeout occurred. Expected true but found false.
	at io.cdap.cdap.common.utils.Tasks.waitFor(Tasks.java:70)
	at io.cdap.cdap.common.utils.Tasks.waitFor(Tasks.java:91)
	at io.cdap.cdap.test.AbstractProgramManager.waitForRuns(AbstractProgramManager.java:109)
	at io.cdap.cdap.test.AbstractProgramManager.startAndWaitForRun(AbstractProgramManager.java:80)
	at io.cdap.cdap.test.AudiTestBase.startAndWaitForRun(AudiTestBase.java:277)
	at io.cdap.cdap.test.AudiTestBase.startAndWaitForRun(AudiTestBase.java:271)
	at io.cdap.cdap.app.etl.KVTableWithProjectionTest.testKVTableWithProjection(KVTableWithProjectionTest.java:83)
java.util.concurrent.TimeoutException: Timeout occurred. Expected true but found false.
	at io.cdap.cdap.common.utils.Tasks.waitFor(Tasks.java:70)
	at io.cdap.cdap.common.utils.Tasks.waitFor(Tasks.java:91)
	at io.cdap.cdap.test.AbstractProgramManager.waitForRuns(AbstractProgramManager.java:109)
	at io.cdap.cdap.test.AbstractProgramManager.startAndWaitForRun(AbstractProgramManager.java:80)
	at io.cdap.cdap.test.AudiTestBase.startAndWaitForRun(AudiTestBase.java:277)
	at io.cdap.cdap.test.AudiTestBase.startAndWaitForRun(AudiTestBase.java:271)
	at io.cdap.cdap.app.etl.KVTableWithProjectionTest.testKVTableWithProjection(KVTableWithProjectionTest.java:83)
java.util.concurrent.TimeoutException: Timeout occurred. Expected true but found false.
	at io.cdap.cdap.common.utils.Tasks.waitFor(Tasks.java:70)
	at io.cdap.cdap.common.utils.Tasks.waitFor(Tasks.java:91)
	at io.cdap.cdap.test.AbstractProgramManager.waitForRuns(AbstractProgramManager.java:109)
	at io.cdap.cdap.test.AbstractProgramManager.startAndWaitForRun(AbstractProgramManager.java:80)
	at io.cdap.cdap.test.AudiTestBase.startAndWaitForRun(AudiTestBase.java:277)
	at io.cdap.cdap.test.AudiTestBase.startAndWaitForRun(AudiTestBase.java:271)
	at io.cdap.cdap.app.etl.KVTableWithProjectionTest.testKVTableWithProjection(KVTableWithProjectionTest.java:83)
java.util.concurrent.TimeoutException: Timeout occurred. Expected true but found false.
	at io.cdap.cdap.common.utils.Tasks.waitFor(Tasks.java:70)
	at io.cdap.cdap.common.utils.Tasks.waitFor(Tasks.java:91)
	at io.cdap.cdap.test.AbstractProgramManager.waitForRuns(AbstractProgramManager.java:109)
	at io.cdap.cdap.test.AbstractProgramManager.startAndWaitForRun(AbstractProgramManager.java:80)
	at io.cdap.cdap.test.AudiTestBase.startAndWaitForRun(AudiTestBase.java:277)
	at io.cdap.cdap.test.AudiTestBase.startAndWaitForRun(AudiTestBase.java:271)
	at io.cdap.cdap.app.etl.KVTableWithProjectionTest.testKVTableWithProjection(KVTableWithProjectionTest.java:83)
java.util.concurrent.TimeoutException: Timeout occurred. Expected true but found false.
	at io.cdap.cdap.common.utils.Tasks.waitFor(Tasks.java:70)
	at io.cdap.cdap.common.utils.Tasks.waitFor(Tasks.java:91)
	at io.cdap.cdap.test.AbstractProgramManager.waitForRuns(AbstractProgramManager.java:109)
	at io.cdap.cdap.test.AbstractProgramManager.startAndWaitForRun(AbstractProgramManager.java:80)
	at io.cdap.cdap.test.AudiTestBase.startAndWaitForRun(AudiTestBase.java:277)
	at io.cdap.cdap.test.AudiTestBase.startAndWaitForRun(AudiTestBase.java:271)
	at io.cdap.cdap.app.etl.KVTableWithProjectionTest.testKVTableWithProjection(KVTableWithProjectionTest.java:83)
java.util.concurrent.TimeoutException: Timeout occurred. Expected true but found false.
	at io.cdap.cdap.common.utils.Tasks.waitFor(Tasks.java:70)
	at io.cdap.cdap.common.utils.Tasks.waitFor(Tasks.java:91)
	at io.cdap.cdap.test.AbstractProgramManager.waitForRuns(AbstractProgramManager.java:109)
	at io.cdap.cdap.test.AbstractProgramManager.startAndWaitForRun(AbstractProgramManager.java:80)
	at io.cdap.cdap.test.AudiTestBase.startAndWaitForRun(AudiTestBase.java:277)
	at io.cdap.cdap.test.AudiTestBase.startAndWaitForRun(AudiTestBase.java:271)
	at io.cdap.cdap.app.etl.KVTableWithProjectionTest.testKVTableWithProjection(KVTableWithProjectionTest.java:83)
java.util.concurrent.TimeoutException: Timeout occurred. Expected true but found false.
	at io.cdap.cdap.common.utils.Tasks.waitFor(Tasks.java:70)
	at io.cdap.cdap.common.utils.Tasks.waitFor(Tasks.java:91)
	at io.cdap.cdap.test.AbstractProgramManager.waitForRuns(AbstractProgramManager.java:109)
	at io.cdap.cdap.test.AbstractProgramManager.startAndWaitForRun(AbstractProgramManager.java:80)
	at io.cdap.cdap.test.AudiTestBase.startAndWaitForRun(AudiTestBase.java:277)
	at io.cdap.cdap.test.AudiTestBase.startAndWaitForRun(AudiTestBase.java:271)
	at io.cdap.cdap.app.etl.KVTableWithProjectionTest.testKVTableWithProjection(KVTableWithProjectionTest.java:83)
java.util.concurrent.TimeoutException: Timeout occurred. Expected true but found false.
	at io.cdap.cdap.common.utils.Tasks.waitFor(Tasks.java:70)
	at io.cdap.cdap.common.utils.Tasks.waitFor(Tasks.java:91)
	at io.cdap.cdap.test.AbstractProgramManager.waitForRuns(AbstractProgramManager.java:109)
	at io.cdap.cdap.test.AbstractProgramManager.startAndWaitForRun(AbstractProgramManager.java:80)
	at io.cdap.cdap.test.AudiTestBase.startAndWaitForRun(AudiTestBase.java:277)
	at io.cdap.cdap.test.AudiTestBase.startAndWaitForRun(AudiTestBase.java:271)
	at io.cdap.cdap.app.etl.KVTableWithProjectionTest.testKVTableWithProjection(KVTableWithProjectionTest.java:83)
java.util.concurrent.TimeoutException: Timeout occurred. Expected true but found false.
	at io.cdap.cdap.common.utils.Tasks.waitFor(Tasks.java:70)
	at io.cdap.cdap.common.utils.Tasks.waitFor(Tasks.java:91)
	at io.cdap.cdap.test.AbstractProgramManager.waitForRuns(AbstractProgramManager.java:109)
	at io.cdap.cdap.test.AbstractProgramManager.startAndWaitForRun(AbstractProgramManager.java:80)
	at io.cdap.cdap.test.AudiTestBase.startAndWaitForRun(AudiTestBase.java:277)
	at io.cdap.cdap.test.AudiTestBase.startAndWaitForRun(AudiTestBase.java:271)
	at io.cdap.cdap.app.etl.KVTableWithProjectionTest.testKVTableWithProjection(KVTableWithProjectionTest.java:83)
java.util.concurrent.TimeoutException: Timeout occurred. Expected true but found false.
	at io.cdap.cdap.common.utils.Tasks.waitFor(Tasks.java:70)
	at io.cdap.cdap.common.utils.Tasks.waitFor(Tasks.java:91)
	at io.cdap.cdap.test.AbstractProgramManager.waitForRuns(AbstractProgramManager.java:109)
	at io.cdap.cdap.test.AbstractProgramManager.startAndWaitForRun(AbstractProgramManager.java:80)
	at io.cdap.cdap.test.AudiTestBase.startAndWaitForRun(AudiTestBase.java:277)
	at io.cdap.cdap.app.etl.TPFSAvroSinkSourceTest.testTPFSWithProjection(TPFSAvroSinkSourceTest.java:80)
java.util.concurrent.TimeoutException: Timeout occurred. Expected true but found false.
	at io.cdap.cdap.common.utils.Tasks.waitFor(Tasks.java:70)
	at io.cdap.cdap.common.utils.Tasks.waitFor(Tasks.java:91)
	at io.cdap.cdap.test.AbstractProgramManager.waitForRuns(AbstractProgramManager.java:109)
	at io.cdap.cdap.test.AbstractProgramManager.startAndWaitForRun(AbstractProgramManager.java:80)
	at io.cdap.cdap.test.AudiTestBase.startAndWaitForRun(AudiTestBase.java:277)
	at io.cdap.cdap.app.etl.TPFSAvroSinkSourceTest.testTPFSWithProjection(TPFSAvroSinkSourceTest.java:80)
java.util.concurrent.TimeoutException: Timeout occurred. Expected true but found false.
	at io.cdap.cdap.common.utils.Tasks.waitFor(Tasks.java:70)
	at io.cdap.cdap.common.utils.Tasks.waitFor(Tasks.java:91)
	at io.cdap.cdap.test.AbstractProgramManager.waitForRuns(AbstractProgramManager.java:109)
	at io.cdap.cdap.test.AbstractProgramManager.startAndWaitForRun(AbstractProgramManager.java:80)
	at io.cdap.cdap.test.AudiTestBase.startAndWaitForRun(AudiTestBase.java:277)
	at io.cdap.cdap.app.etl.TPFSAvroSinkSourceTest.testTPFSWithProjection(TPFSAvroSinkSourceTest.java:80)
java.util.concurrent.TimeoutException: Timeout occurred. Expected true but found false.
	at io.cdap.cdap.common.utils.Tasks.waitFor(Tasks.java:70)
	at io.cdap.cdap.common.utils.Tasks.waitFor(Tasks.java:91)
	at io.cdap.cdap.test.AbstractProgramManager.waitForRuns(AbstractProgramManager.java:109)
	at io.cdap.cdap.test.AbstractProgramManager.startAndWaitForRun(AbstractProgramManager.java:80)
	at io.cdap.cdap.test.AudiTestBase.startAndWaitForRun(AudiTestBase.java:277)
	at io.cdap.cdap.app.etl.TPFSAvroSinkSourceTest.testTPFSWithProjection(TPFSAvroSinkSourceTest.java:80)
java.util.concurrent.TimeoutException: Timeout occurred. Expected true but found false.
	at io.cdap.cdap.common.utils.Tasks.waitFor(Tasks.java:70)
	at io.cdap.cdap.common.utils.Tasks.waitFor(Tasks.java:91)
	at io.cdap.cdap.test.AbstractProgramManager.waitForRuns(AbstractProgramManager.java:109)
	at io.cdap.cdap.test.AbstractProgramManager.startAndWaitForRun(AbstractProgramManager.java:80)
	at io.cdap.cdap.test.AudiTestBase.startAndWaitForRun(AudiTestBase.java:277)
	at io.cdap.cdap.app.etl.TPFSAvroSinkSourceTest.testTPFSWithProjection(TPFSAvroSinkSourceTest.java:80)
java.util.concurrent.TimeoutException: Timeout occurred. Expected true but found false.
	at io.cdap.cdap.common.utils.Tasks.waitFor(Tasks.java:70)
	at io.cdap.cdap.common.utils.Tasks.waitFor(Tasks.java:91)
	at io.cdap.cdap.test.AbstractProgramManager.waitForRuns(AbstractProgramManager.java:109)
	at io.cdap.cdap.test.AbstractProgramManager.startAndWaitForRun(AbstractProgramManager.java:80)
	at io.cdap.cdap.test.AudiTestBase.startAndWaitForRun(AudiTestBase.java:277)
	at io.cdap.cdap.app.etl.TPFSAvroSinkSourceTest.testTPFSWithProjection(TPFSAvroSinkSourceTest.java:80)
java.util.concurrent.TimeoutException: Timeout occurred. Expected true but found false.
	at io.cdap.cdap.common.utils.Tasks.waitFor(Tasks.java:70)
	at io.cdap.cdap.common.utils.Tasks.waitFor(Tasks.java:91)
	at io.cdap.cdap.test.AbstractProgramManager.waitForRuns(AbstractProgramManager.java:109)
	at io.cdap.cdap.test.AbstractProgramManager.startAndWaitForRun(AbstractProgramManager.java:80)
	at io.cdap.cdap.test.AudiTestBase.startAndWaitForRun(AudiTestBase.java:277)
	at io.cdap.cdap.app.etl.TPFSAvroSinkSourceTest.testTPFSWithProjection(TPFSAvroSinkSourceTest.java:80)
java.util.concurrent.TimeoutException: Timeout occurred. Expected true but found false.
	at io.cdap.cdap.common.utils.Tasks.waitFor(Tasks.java:70)
	at io.cdap.cdap.common.utils.Tasks.waitFor(Tasks.java:91)
	at io.cdap.cdap.test.AbstractProgramManager.waitForRuns(AbstractProgramManager.java:109)
	at io.cdap.cdap.test.AbstractProgramManager.startAndWaitForRun(AbstractProgramManager.java:80)
	at io.cdap.cdap.test.AudiTestBase.startAndWaitForRun(AudiTestBase.java:277)
	at io.cdap.cdap.app.etl.TPFSAvroSinkSourceTest.testTPFSWithProjection(TPFSAvroSinkSourceTest.java:80)
java.util.concurrent.TimeoutException: Timeout occurred. Expected true but found false.
	at io.cdap.cdap.common.utils.Tasks.waitFor(Tasks.java:70)
	at io.cdap.cdap.common.utils.Tasks.waitFor(Tasks.java:91)
	at io.cdap.cdap.test.AbstractProgramManager.waitForRuns(AbstractProgramManager.java:109)
	at io.cdap.cdap.test.AbstractProgramManager.startAndWaitForRun(AbstractProgramManager.java:80)
	at io.cdap.cdap.test.AudiTestBase.startAndWaitForRun(AudiTestBase.java:277)
	at io.cdap.cdap.app.etl.TPFSAvroSinkSourceTest.testTPFSWithProjection(TPFSAvroSinkSourceTest.java:80)
java.util.concurrent.TimeoutException: Timeout occurred. Expected true but found false.
	at io.cdap.cdap.common.utils.Tasks.waitFor(Tasks.java:70)
	at io.cdap.cdap.common.utils.Tasks.waitFor(Tasks.java:91)
	at io.cdap.cdap.test.AbstractProgramManager.waitForRuns(AbstractProgramManager.java:109)
	at io.cdap.cdap.test.AbstractProgramManager.startAndWaitForRun(AbstractProgramManager.java:80)
	at io.cdap.cdap.test.AudiTestBase.startAndWaitForRun(AudiTestBase.java:277)
	at io.cdap.cdap.app.etl.TPFSAvroSinkSourceTest.testTPFSWithProjection(TPFSAvroSinkSourceTest.java:80)
java.util.concurrent.TimeoutException: Timeout occurred. Expected true but found false.
	at io.cdap.cdap.common.utils.Tasks.waitFor(Tasks.java:70)
	at io.cdap.cdap.common.utils.Tasks.waitFor(Tasks.java:91)
	at io.cdap.cdap.test.AbstractProgramManager.waitForRuns(AbstractProgramManager.java:109)
	at io.cdap.cdap.test.AbstractProgramManager.startAndWaitForRun(AbstractProgramManager.java:80)
	at io.cdap.cdap.test.AudiTestBase.startAndWaitForRun(AudiTestBase.java:277)
	at io.cdap.cdap.app.etl.TPFSAvroSinkSourceTest.testTPFSWithProjection(TPFSAvroSinkSourceTest.java:80)
java.util.concurrent.TimeoutException: Timeout occurred. Expected true but found false.
	at io.cdap.cdap.common.utils.Tasks.waitFor(Tasks.java:70)
	at io.cdap.cdap.common.utils.Tasks.waitFor(Tasks.java:91)
	at io.cdap.cdap.test.AbstractProgramManager.waitForRuns(AbstractProgramManager.java:109)
	at io.cdap.cdap.test.AbstractProgramManager.startAndWaitForRun(AbstractProgramManager.java:80)
	at io.cdap.cdap.test.AudiTestBase.startAndWaitForRun(AudiTestBase.java:277)
	at io.cdap.cdap.test.AudiTestBase.startAndWaitForRun(AudiTestBase.java:271)
	at io.cdap.cdap.app.etl.batch.BatchAggregatorTest.test(BatchAggregatorTest.java:160)
java.util.concurrent.TimeoutException: Timeout occurred. Expected true but found false.
	at io.cdap.cdap.common.utils.Tasks.waitFor(Tasks.java:70)
	at io.cdap.cdap.common.utils.Tasks.waitFor(Tasks.java:91)
	at io.cdap.cdap.test.AbstractProgramManager.waitForRuns(AbstractProgramManager.java:109)
	at io.cdap.cdap.test.AbstractProgramManager.startAndWaitForRun(AbstractProgramManager.java:80)
	at io.cdap.cdap.test.AudiTestBase.startAndWaitForRun(AudiTestBase.java:277)
	at io.cdap.cdap.test.AudiTestBase.startAndWaitForRun(AudiTestBase.java:271)
	at io.cdap.cdap.app.etl.batch.BatchAggregatorTest.test(BatchAggregatorTest.java:160)
java.util.concurrent.TimeoutException: Timeout occurred. Expected true but found false.
	at io.cdap.cdap.common.utils.Tasks.waitFor(Tasks.java:70)
	at io.cdap.cdap.common.utils.Tasks.waitFor(Tasks.java:91)
	at io.cdap.cdap.test.AbstractProgramManager.waitForRuns(AbstractProgramManager.java:109)
	at io.cdap.cdap.test.AbstractProgramManager.startAndWaitForRun(AbstractProgramManager.java:80)
	at io.cdap.cdap.test.AudiTestBase.startAndWaitForRun(AudiTestBase.java:277)
	at io.cdap.cdap.test.AudiTestBase.startAndWaitForRun(AudiTestBase.java:271)
	at io.cdap.cdap.app.etl.batch.BatchAggregatorTest.test(BatchAggregatorTest.java:160)
java.util.concurrent.TimeoutException: Timeout occurred. Expected true but found false.
	at io.cdap.cdap.common.utils.Tasks.waitFor(Tasks.java:70)
	at io.cdap.cdap.common.utils.Tasks.waitFor(Tasks.java:91)
	at io.cdap.cdap.test.AbstractProgramManager.waitForRuns(AbstractProgramManager.java:109)
	at io.cdap.cdap.test.AbstractProgramManager.startAndWaitForRun(AbstractProgramManager.java:80)
	at io.cdap.cdap.test.AudiTestBase.startAndWaitForRun(AudiTestBase.java:277)
	at io.cdap.cdap.test.AudiTestBase.startAndWaitForRun(AudiTestBase.java:271)
	at io.cdap.cdap.app.etl.batch.BatchAggregatorTest.test(BatchAggregatorTest.java:160)
java.util.concurrent.TimeoutException: Timeout occurred. Expected true but found false.
	at io.cdap.cdap.common.utils.Tasks.waitFor(Tasks.java:70)
	at io.cdap.cdap.common.utils.Tasks.waitFor(Tasks.java:91)
	at io.cdap.cdap.test.AbstractProgramManager.waitForRuns(AbstractProgramManager.java:109)
	at io.cdap.cdap.test.AbstractProgramManager.startAndWaitForRun(AbstractProgramManager.java:80)
	at io.cdap.cdap.test.AudiTestBase.startAndWaitForRun(AudiTestBase.java:277)
	at io.cdap.cdap.test.AudiTestBase.startAndWaitForRun(AudiTestBase.java:271)
	at io.cdap.cdap.app.etl.batch.BatchAggregatorTest.test(BatchAggregatorTest.java:160)
java.util.concurrent.TimeoutException: Timeout occurred. Expected true but found false.
	at io.cdap.cdap.common.utils.Tasks.waitFor(Tasks.java:70)
	at io.cdap.cdap.common.utils.Tasks.waitFor(Tasks.java:91)
	at io.cdap.cdap.test.AbstractProgramManager.waitForRuns(AbstractProgramManager.java:109)
	at io.cdap.cdap.test.AbstractProgramManager.startAndWaitForRun(AbstractProgramManager.java:80)
	at io.cdap.cdap.test.AudiTestBase.startAndWaitForRun(AudiTestBase.java:277)
	at io.cdap.cdap.test.AudiTestBase.startAndWaitForRun(AudiTestBase.java:271)
	at io.cdap.cdap.app.etl.batch.BatchAggregatorTest.test(BatchAggregatorTest.java:160)
java.util.concurrent.TimeoutException: Timeout occurred. Expected true but found false.
	at io.cdap.cdap.common.utils.Tasks.waitFor(Tasks.java:70)
	at io.cdap.cdap.common.utils.Tasks.waitFor(Tasks.java:91)
	at io.cdap.cdap.test.AbstractProgramManager.waitForRuns(AbstractProgramManager.java:109)
	at io.cdap.cdap.test.AbstractProgramManager.startAndWaitForRun(AbstractProgramManager.java:80)
	at io.cdap.cdap.test.AudiTestBase.startAndWaitForRun(AudiTestBase.java:277)
	at io.cdap.cdap.test.AudiTestBase.startAndWaitForRun(AudiTestBase.java:271)
	at io.cdap.cdap.app.etl.batch.BatchAggregatorTest.test(BatchAggregatorTest.java:160)
java.util.concurrent.TimeoutException: Timeout occurred. Expected true but found false.
	at io.cdap.cdap.common.utils.Tasks.waitFor(Tasks.java:70)
	at io.cdap.cdap.common.utils.Tasks.waitFor(Tasks.java:91)
	at io.cdap.cdap.test.AbstractProgramManager.waitForRuns(AbstractProgramManager.java:109)
	at io.cdap.cdap.test.AbstractProgramManager.startAndWaitForRun(AbstractProgramManager.java:80)
	at io.cdap.cdap.test.AudiTestBase.startAndWaitForRun(AudiTestBase.java:277)
	at io.cdap.cdap.test.AudiTestBase.startAndWaitForRun(AudiTestBase.java:271)
	at io.cdap.cdap.app.etl.batch.BatchAggregatorTest.test(BatchAggregatorTest.java:160)
java.util.concurrent.TimeoutException: Timeout occurred. Expected true but found false.
	at io.cdap.cdap.common.utils.Tasks.waitFor(Tasks.java:70)
	at io.cdap.cdap.common.utils.Tasks.waitFor(Tasks.java:91)
	at io.cdap.cdap.test.AbstractProgramManager.waitForRuns(AbstractProgramManager.java:109)
	at io.cdap.cdap.test.AbstractProgramManager.startAndWaitForRun(AbstractProgramManager.java:80)
	at io.cdap.cdap.test.AudiTestBase.startAndWaitForRun(AudiTestBase.java:277)
	at io.cdap.cdap.test.AudiTestBase.startAndWaitForRun(AudiTestBase.java:271)
	at io.cdap.cdap.app.etl.batch.BatchAggregatorTest.test(BatchAggregatorTest.java:160)
java.util.concurrent.TimeoutException: Timeout occurred. Expected true but found false.
	at io.cdap.cdap.common.utils.Tasks.waitFor(Tasks.java:70)
	at io.cdap.cdap.common.utils.Tasks.waitFor(Tasks.java:91)
	at io.cdap.cdap.test.AbstractProgramManager.waitForRuns(AbstractProgramManager.java:109)
	at io.cdap.cdap.test.AbstractProgramManager.startAndWaitForRun(AbstractProgramManager.java:80)
	at io.cdap.cdap.test.AudiTestBase.startAndWaitForRun(AudiTestBase.java:277)
	at io.cdap.cdap.test.AudiTestBase.startAndWaitForRun(AudiTestBase.java:271)
	at io.cdap.cdap.app.etl.batch.BatchAggregatorTest.test(BatchAggregatorTest.java:160)
java.util.concurrent.TimeoutException: Timeout occurred. Expected true but found false.
	at io.cdap.cdap.common.utils.Tasks.waitFor(Tasks.java:70)
	at io.cdap.cdap.common.utils.Tasks.waitFor(Tasks.java:91)
	at io.cdap.cdap.test.AbstractProgramManager.waitForRuns(AbstractProgramManager.java:109)
	at io.cdap.cdap.test.AbstractProgramManager.startAndWaitForRun(AbstractProgramManager.java:80)
	at io.cdap.cdap.test.AudiTestBase.startAndWaitForRun(AudiTestBase.java:277)
	at io.cdap.cdap.test.AudiTestBase.startAndWaitForRun(AudiTestBase.java:271)
	at io.cdap.cdap.app.etl.batch.BatchAggregatorTest.test(BatchAggregatorTest.java:160)
java.util.concurrent.TimeoutException: Timeout occurred. Expected true but found false.
	at io.cdap.cdap.common.utils.Tasks.waitFor(Tasks.java:70)
	at io.cdap.cdap.common.utils.Tasks.waitFor(Tasks.java:91)
	at io.cdap.cdap.test.AbstractProgramManager.waitForRuns(AbstractProgramManager.java:109)
	at io.cdap.cdap.test.AbstractProgramManager.startAndWaitForRun(AbstractProgramManager.java:80)
	at io.cdap.cdap.test.AudiTestBase.startAndWaitForRun(AudiTestBase.java:277)
	at io.cdap.cdap.test.AudiTestBase.startAndWaitForRun(AudiTestBase.java:271)
	at io.cdap.cdap.app.etl.batch.BatchCubeSinkTest.test(BatchCubeSinkTest.java:107)
java.util.concurrent.TimeoutException: Timeout occurred. Expected true but found false.
	at io.cdap.cdap.common.utils.Tasks.waitFor(Tasks.java:70)
	at io.cdap.cdap.common.utils.Tasks.waitFor(Tasks.java:91)
	at io.cdap.cdap.test.AbstractProgramManager.waitForRuns(AbstractProgramManager.java:109)
	at io.cdap.cdap.test.AbstractProgramManager.startAndWaitForRun(AbstractProgramManager.java:80)
	at io.cdap.cdap.test.AudiTestBase.startAndWaitForRun(AudiTestBase.java:277)
	at io.cdap.cdap.test.AudiTestBase.startAndWaitForRun(AudiTestBase.java:271)
	at io.cdap.cdap.app.etl.batch.BatchCubeSinkTest.test(BatchCubeSinkTest.java:107)
java.util.concurrent.TimeoutException: Timeout occurred. Expected true but found false.
	at io.cdap.cdap.common.utils.Tasks.waitFor(Tasks.java:70)
	at io.cdap.cdap.common.utils.Tasks.waitFor(Tasks.java:91)
	at io.cdap.cdap.test.AbstractProgramManager.waitForRuns(AbstractProgramManager.java:109)
	at io.cdap.cdap.test.AbstractProgramManager.startAndWaitForRun(AbstractProgramManager.java:80)
	at io.cdap.cdap.test.AudiTestBase.startAndWaitForRun(AudiTestBase.java:277)
	at io.cdap.cdap.test.AudiTestBase.startAndWaitForRun(AudiTestBase.java:271)
	at io.cdap.cdap.app.etl.batch.BatchCubeSinkTest.test(BatchCubeSinkTest.java:107)
java.util.concurrent.TimeoutException: Timeout occurred. Expected true but found false.
	at io.cdap.cdap.common.utils.Tasks.waitFor(Tasks.java:70)
	at io.cdap.cdap.common.utils.Tasks.waitFor(Tasks.java:91)
	at io.cdap.cdap.test.AbstractProgramManager.waitForRuns(AbstractProgramManager.java:109)
	at io.cdap.cdap.test.AbstractProgramManager.startAndWaitForRun(AbstractProgramManager.java:80)
	at io.cdap.cdap.test.AudiTestBase.startAndWaitForRun(AudiTestBase.java:277)
	at io.cdap.cdap.test.AudiTestBase.startAndWaitForRun(AudiTestBase.java:271)
	at io.cdap.cdap.app.etl.batch.BatchCubeSinkTest.test(BatchCubeSinkTest.java:107)
java.util.concurrent.TimeoutException: Timeout occurred. Expected true but found false.
	at io.cdap.cdap.common.utils.Tasks.waitFor(Tasks.java:70)
	at io.cdap.cdap.common.utils.Tasks.waitFor(Tasks.java:91)
	at io.cdap.cdap.test.AbstractProgramManager.waitForRuns(AbstractProgramManager.java:109)
	at io.cdap.cdap.test.AbstractProgramManager.startAndWaitForRun(AbstractProgramManager.java:80)
	at io.cdap.cdap.test.AudiTestBase.startAndWaitForRun(AudiTestBase.java:277)
	at io.cdap.cdap.test.AudiTestBase.startAndWaitForRun(AudiTestBase.java:271)
	at io.cdap.cdap.app.etl.batch.BatchCubeSinkTest.test(BatchCubeSinkTest.java:107)
java.util.concurrent.TimeoutException: Timeout occurred. Expected true but found false.
	at io.cdap.cdap.common.utils.Tasks.waitFor(Tasks.java:70)
	at io.cdap.cdap.common.utils.Tasks.waitFor(Tasks.java:91)
	at io.cdap.cdap.test.AbstractProgramManager.waitForRuns(AbstractProgramManager.java:109)
	at io.cdap.cdap.test.AbstractProgramManager.startAndWaitForRun(AbstractProgramManager.java:80)
	at io.cdap.cdap.test.AudiTestBase.startAndWaitForRun(AudiTestBase.java:277)
	at io.cdap.cdap.test.AudiTestBase.startAndWaitForRun(AudiTestBase.java:271)
	at io.cdap.cdap.app.etl.batch.BatchCubeSinkTest.test(BatchCubeSinkTest.java:107)
java.util.concurrent.TimeoutException: Timeout occurred. Expected true but found false.
	at io.cdap.cdap.common.utils.Tasks.waitFor(Tasks.java:70)
	at io.cdap.cdap.common.utils.Tasks.waitFor(Tasks.java:91)
	at io.cdap.cdap.test.AbstractProgramManager.waitForRuns(AbstractProgramManager.java:109)
	at io.cdap.cdap.test.AbstractProgramManager.startAndWaitForRun(AbstractProgramManager.java:80)
	at io.cdap.cdap.test.AudiTestBase.startAndWaitForRun(AudiTestBase.java:277)
	at io.cdap.cdap.test.AudiTestBase.startAndWaitForRun(AudiTestBase.java:271)
	at io.cdap.cdap.app.etl.batch.BatchCubeSinkTest.test(BatchCubeSinkTest.java:107)
java.util.concurrent.TimeoutException: Timeout occurred. Expected true but found false.
	at io.cdap.cdap.common.utils.Tasks.waitFor(Tasks.java:70)
	at io.cdap.cdap.common.utils.Tasks.waitFor(Tasks.java:91)
	at io.cdap.cdap.test.AbstractProgramManager.waitForRuns(AbstractProgramManager.java:109)
	at io.cdap.cdap.test.AbstractProgramManager.startAndWaitForRun(AbstractProgramManager.java:80)
	at io.cdap.cdap.test.AudiTestBase.startAndWaitForRun(AudiTestBase.java:277)
	at io.cdap.cdap.test.AudiTestBase.startAndWaitForRun(AudiTestBase.java:271)
	at io.cdap.cdap.app.etl.batch.BatchCubeSinkTest.test(BatchCubeSinkTest.java:107)
java.util.concurrent.TimeoutException: Timeout occurred. Expected true but found false.
	at io.cdap.cdap.common.utils.Tasks.waitFor(Tasks.java:70)
	at io.cdap.cdap.common.utils.Tasks.waitFor(Tasks.java:91)
	at io.cdap.cdap.test.AbstractProgramManager.waitForRuns(AbstractProgramManager.java:109)
	at io.cdap.cdap.test.AbstractProgramManager.startAndWaitForRun(AbstractProgramManager.java:80)
	at io.cdap.cdap.test.AudiTestBase.startAndWaitForRun(AudiTestBase.java:277)
	at io.cdap.cdap.test.AudiTestBase.startAndWaitForRun(AudiTestBase.java:271)
	at io.cdap.cdap.app.etl.batch.BatchCubeSinkTest.test(BatchCubeSinkTest.java:107)
java.util.concurrent.TimeoutException: Timeout occurred. Expected true but found false.
	at io.cdap.cdap.common.utils.Tasks.waitFor(Tasks.java:70)
	at io.cdap.cdap.common.utils.Tasks.waitFor(Tasks.java:91)
	at io.cdap.cdap.test.AbstractProgramManager.waitForRuns(AbstractProgramManager.java:109)
	at io.cdap.cdap.test.AbstractProgramManager.startAndWaitForRun(AbstractProgramManager.java:80)
	at io.cdap.cdap.test.AudiTestBase.startAndWaitForRun(AudiTestBase.java:277)
	at io.cdap.cdap.test.AudiTestBase.startAndWaitForRun(AudiTestBase.java:271)
	at io.cdap.cdap.app.etl.batch.BatchCubeSinkTest.test(BatchCubeSinkTest.java:107)
java.util.concurrent.TimeoutException: Timeout occurred. Expected true but found false.
	at io.cdap.cdap.common.utils.Tasks.waitFor(Tasks.java:70)
	at io.cdap.cdap.common.utils.Tasks.waitFor(Tasks.java:91)
	at io.cdap.cdap.test.AbstractProgramManager.waitForRuns(AbstractProgramManager.java:109)
	at io.cdap.cdap.test.AbstractProgramManager.startAndWaitForRun(AbstractProgramManager.java:80)
	at io.cdap.cdap.test.AudiTestBase.startAndWaitForRun(AudiTestBase.java:277)
	at io.cdap.cdap.test.AudiTestBase.startAndWaitForRun(AudiTestBase.java:271)
	at io.cdap.cdap.app.etl.batch.BatchCubeSinkTest.test(BatchCubeSinkTest.java:107)
java.util.concurrent.TimeoutException: Timeout occurred. Expected true but found false.
	at io.cdap.cdap.common.utils.Tasks.waitFor(Tasks.java:70)
	at io.cdap.cdap.common.utils.Tasks.waitFor(Tasks.java:91)
	at io.cdap.cdap.test.AbstractProgramManager.waitForRuns(AbstractProgramManager.java:109)
	at io.cdap.cdap.test.AbstractProgramManager.startAndWaitForRun(AbstractProgramManager.java:80)
	at io.cdap.cdap.test.AudiTestBase.startAndWaitForRun(AudiTestBase.java:277)
	at io.cdap.cdap.test.AudiTestBase.startAndWaitForRun(AudiTestBase.java:271)
	at io.cdap.cdap.app.etl.batch.BatchJoinerTest.testJoiner(BatchJoinerTest.java:215)
(1 more lines...)
java.util.concurrent.TimeoutException: Timeout occurred. Expected true but found false.
	at io.cdap.cdap.common.utils.Tasks.waitFor(Tasks.java:70)
	at io.cdap.cdap.common.utils.Tasks.waitFor(Tasks.java:91)
	at io.cdap.cdap.test.AbstractProgramManager.waitForRuns(AbstractProgramManager.java:109)
	at io.cdap.cdap.test.AbstractProgramManager.startAndWaitForRun(AbstractProgramManager.java:80)
	at io.cdap.cdap.test.AudiTestBase.startAndWaitForRun(AudiTestBase.java:277)
	at io.cdap.cdap.test.AudiTestBase.startAndWaitForRun(AudiTestBase.java:271)
	at io.cdap.cdap.app.etl.batch.BatchJoinerTest.testJoiner(BatchJoinerTest.java:215)
(1 more lines...)
java.util.concurrent.TimeoutException: Timeout occurred. Expected true but found false.
	at io.cdap.cdap.common.utils.Tasks.waitFor(Tasks.java:70)
	at io.cdap.cdap.common.utils.Tasks.waitFor(Tasks.java:91)
	at io.cdap.cdap.test.AbstractProgramManager.waitForRuns(AbstractProgramManager.java:109)
	at io.cdap.cdap.test.AbstractProgramManager.startAndWaitForRun(AbstractProgramManager.java:80)
	at io.cdap.cdap.test.AudiTestBase.startAndWaitForRun(AudiTestBase.java:277)
	at io.cdap.cdap.test.AudiTestBase.startAndWaitForRun(AudiTestBase.java:271)
	at io.cdap.cdap.app.etl.batch.BatchJoinerTest.testJoiner(BatchJoinerTest.java:215)
(1 more lines...)
java.util.concurrent.TimeoutException: Timeout occurred. Expected true but found false.
	at io.cdap.cdap.common.utils.Tasks.waitFor(Tasks.java:70)
	at io.cdap.cdap.common.utils.Tasks.waitFor(Tasks.java:91)
	at io.cdap.cdap.test.AbstractProgramManager.waitForRuns(AbstractProgramManager.java:109)
	at io.cdap.cdap.test.AbstractProgramManager.startAndWaitForRun(AbstractProgramManager.java:80)
	at io.cdap.cdap.test.AudiTestBase.startAndWaitForRun(AudiTestBase.java:277)
	at io.cdap.cdap.test.AudiTestBase.startAndWaitForRun(AudiTestBase.java:271)
	at io.cdap.cdap.app.etl.batch.BatchJoinerTest.testJoiner(BatchJoinerTest.java:215)
(1 more lines...)
java.util.concurrent.TimeoutException: Timeout occurred. Expected true but found false.
	at io.cdap.cdap.common.utils.Tasks.waitFor(Tasks.java:70)
	at io.cdap.cdap.common.utils.Tasks.waitFor(Tasks.java:91)
	at io.cdap.cdap.test.AbstractProgramManager.waitForRuns(AbstractProgramManager.java:109)
	at io.cdap.cdap.test.AbstractProgramManager.startAndWaitForRun(AbstractProgramManager.java:80)
	at io.cdap.cdap.test.AudiTestBase.startAndWaitForRun(AudiTestBase.java:277)
	at io.cdap.cdap.test.AudiTestBase.startAndWaitForRun(AudiTestBase.java:271)
	at io.cdap.cdap.app.etl.batch.BatchJoinerTest.testJoiner(BatchJoinerTest.java:215)
(1 more lines...)
java.util.concurrent.TimeoutException: Timeout occurred. Expected true but found false.
	at io.cdap.cdap.common.utils.Tasks.waitFor(Tasks.java:70)
	at io.cdap.cdap.common.utils.Tasks.waitFor(Tasks.java:91)
	at io.cdap.cdap.test.AbstractProgramManager.waitForRuns(AbstractProgramManager.java:109)
	at io.cdap.cdap.test.AbstractProgramManager.startAndWaitForRun(AbstractProgramManager.java:80)
	at io.cdap.cdap.test.AudiTestBase.startAndWaitForRun(AudiTestBase.java:277)
	at io.cdap.cdap.test.AudiTestBase.startAndWaitForRun(AudiTestBase.java:271)
	at io.cdap.cdap.app.etl.batch.BatchJoinerTest.testJoiner(BatchJoinerTest.java:215)
(1 more lines...)