Build #473

Build: #473 failed Scheduled

Build result summary

Details

Completed
Duration
518 minutes
Labels
None
Revision
f9f9ced42f3367d303a4e6abbbfb34f90e02f2ad f9f9ced42f3367d303a4e6abbbfb34f90e02f2ad
Total tests
540
Failing since
#450 (Scheduled – )

Responsible

This build has been failing since #450
No one has taken responsibility

Tests

Existing test failures 288
Status Test Failing since View job Duration
java.util.concurrent.TimeoutException: Timeout occurred. Expected true but found false.
	at io.cdap.cdap.common.utils.Tasks.waitFor(Tasks.java:70)
	at io.cdap.cdap.common.utils.Tasks.waitFor(Tasks.java:91)
	at io.cdap.cdap.test.AbstractProgramManager.waitForRuns(AbstractProgramManager.java:109)
	at io.cdap.cdap.test.AbstractProgramManager.startAndWaitForRun(AbstractProgramManager.java:80)
	at io.cdap.cdap.test.AudiTestBase.startAndWaitForRun(AudiTestBase.java:277)
	at io.cdap.cdap.test.AudiTestBase.startAndWaitForRun(AudiTestBase.java:271)
	at io.cdap.cdap.app.etl.KVTableWithProjectionTest.testKVTableWithProjection(KVTableWithProjectionTest.java:83)
java.util.concurrent.TimeoutException: Timeout occurred. Expected true but found false.
	at io.cdap.cdap.common.utils.Tasks.waitFor(Tasks.java:70)
	at io.cdap.cdap.common.utils.Tasks.waitFor(Tasks.java:91)
	at io.cdap.cdap.test.AbstractProgramManager.waitForRuns(AbstractProgramManager.java:109)
	at io.cdap.cdap.test.AbstractProgramManager.startAndWaitForRun(AbstractProgramManager.java:80)
	at io.cdap.cdap.test.AudiTestBase.startAndWaitForRun(AudiTestBase.java:277)
	at io.cdap.cdap.test.AudiTestBase.startAndWaitForRun(AudiTestBase.java:271)
	at io.cdap.cdap.app.etl.KVTableWithProjectionTest.testKVTableWithProjection(KVTableWithProjectionTest.java:83)
java.util.concurrent.TimeoutException: Timeout occurred. Expected true but found false.
	at io.cdap.cdap.common.utils.Tasks.waitFor(Tasks.java:70)
	at io.cdap.cdap.common.utils.Tasks.waitFor(Tasks.java:91)
	at io.cdap.cdap.test.AbstractProgramManager.waitForRuns(AbstractProgramManager.java:109)
	at io.cdap.cdap.test.AbstractProgramManager.startAndWaitForRun(AbstractProgramManager.java:80)
	at io.cdap.cdap.test.AudiTestBase.startAndWaitForRun(AudiTestBase.java:277)
	at io.cdap.cdap.test.AudiTestBase.startAndWaitForRun(AudiTestBase.java:271)
	at io.cdap.cdap.app.etl.KVTableWithProjectionTest.testKVTableWithProjection(KVTableWithProjectionTest.java:83)
java.util.concurrent.TimeoutException: Timeout occurred. Expected true but found false.
	at io.cdap.cdap.common.utils.Tasks.waitFor(Tasks.java:70)
	at io.cdap.cdap.common.utils.Tasks.waitFor(Tasks.java:91)
	at io.cdap.cdap.test.AbstractProgramManager.waitForRuns(AbstractProgramManager.java:109)
	at io.cdap.cdap.test.AbstractProgramManager.startAndWaitForRun(AbstractProgramManager.java:80)
	at io.cdap.cdap.test.AudiTestBase.startAndWaitForRun(AudiTestBase.java:277)
	at io.cdap.cdap.test.AudiTestBase.startAndWaitForRun(AudiTestBase.java:271)
	at io.cdap.cdap.app.etl.KVTableWithProjectionTest.testKVTableWithProjection(KVTableWithProjectionTest.java:83)
java.util.concurrent.TimeoutException: Timeout occurred. Expected true but found false.
	at io.cdap.cdap.common.utils.Tasks.waitFor(Tasks.java:70)
	at io.cdap.cdap.common.utils.Tasks.waitFor(Tasks.java:91)
	at io.cdap.cdap.test.AbstractProgramManager.waitForRuns(AbstractProgramManager.java:109)
	at io.cdap.cdap.test.AbstractProgramManager.startAndWaitForRun(AbstractProgramManager.java:80)
	at io.cdap.cdap.test.AudiTestBase.startAndWaitForRun(AudiTestBase.java:277)
	at io.cdap.cdap.test.AudiTestBase.startAndWaitForRun(AudiTestBase.java:271)
	at io.cdap.cdap.app.etl.KVTableWithProjectionTest.testKVTableWithProjection(KVTableWithProjectionTest.java:83)
java.util.concurrent.TimeoutException: Timeout occurred. Expected true but found false.
	at io.cdap.cdap.common.utils.Tasks.waitFor(Tasks.java:70)
	at io.cdap.cdap.common.utils.Tasks.waitFor(Tasks.java:91)
	at io.cdap.cdap.test.AbstractProgramManager.waitForRuns(AbstractProgramManager.java:109)
	at io.cdap.cdap.test.AbstractProgramManager.startAndWaitForRun(AbstractProgramManager.java:80)
	at io.cdap.cdap.test.AudiTestBase.startAndWaitForRun(AudiTestBase.java:277)
	at io.cdap.cdap.test.AudiTestBase.startAndWaitForRun(AudiTestBase.java:271)
	at io.cdap.cdap.app.etl.KVTableWithProjectionTest.testKVTableWithProjection(KVTableWithProjectionTest.java:83)
java.util.concurrent.TimeoutException: Timeout occurred. Expected true but found false.
	at io.cdap.cdap.common.utils.Tasks.waitFor(Tasks.java:70)
	at io.cdap.cdap.common.utils.Tasks.waitFor(Tasks.java:91)
	at io.cdap.cdap.test.AbstractProgramManager.waitForRuns(AbstractProgramManager.java:109)
	at io.cdap.cdap.test.AbstractProgramManager.startAndWaitForRun(AbstractProgramManager.java:80)
	at io.cdap.cdap.test.AudiTestBase.startAndWaitForRun(AudiTestBase.java:277)
	at io.cdap.cdap.test.AudiTestBase.startAndWaitForRun(AudiTestBase.java:271)
	at io.cdap.cdap.app.etl.KVTableWithProjectionTest.testKVTableWithProjection(KVTableWithProjectionTest.java:83)
java.util.concurrent.TimeoutException: Timeout occurred. Expected true but found false.
	at io.cdap.cdap.common.utils.Tasks.waitFor(Tasks.java:70)
	at io.cdap.cdap.common.utils.Tasks.waitFor(Tasks.java:91)
	at io.cdap.cdap.test.AbstractProgramManager.waitForRuns(AbstractProgramManager.java:109)
	at io.cdap.cdap.test.AbstractProgramManager.startAndWaitForRun(AbstractProgramManager.java:80)
	at io.cdap.cdap.test.AudiTestBase.startAndWaitForRun(AudiTestBase.java:277)
	at io.cdap.cdap.test.AudiTestBase.startAndWaitForRun(AudiTestBase.java:271)
	at io.cdap.cdap.app.etl.KVTableWithProjectionTest.testKVTableWithProjection(KVTableWithProjectionTest.java:83)
java.util.concurrent.TimeoutException: Timeout occurred. Expected true but found false.
	at io.cdap.cdap.common.utils.Tasks.waitFor(Tasks.java:70)
	at io.cdap.cdap.common.utils.Tasks.waitFor(Tasks.java:91)
	at io.cdap.cdap.test.AbstractProgramManager.waitForRuns(AbstractProgramManager.java:109)
	at io.cdap.cdap.test.AbstractProgramManager.startAndWaitForRun(AbstractProgramManager.java:80)
	at io.cdap.cdap.test.AudiTestBase.startAndWaitForRun(AudiTestBase.java:277)
	at io.cdap.cdap.test.AudiTestBase.startAndWaitForRun(AudiTestBase.java:271)
	at io.cdap.cdap.app.etl.KVTableWithProjectionTest.testKVTableWithProjection(KVTableWithProjectionTest.java:83)
java.util.concurrent.TimeoutException: Timeout occurred. Expected true but found false.
	at io.cdap.cdap.common.utils.Tasks.waitFor(Tasks.java:70)
	at io.cdap.cdap.common.utils.Tasks.waitFor(Tasks.java:91)
	at io.cdap.cdap.test.AbstractProgramManager.waitForRuns(AbstractProgramManager.java:109)
	at io.cdap.cdap.test.AbstractProgramManager.startAndWaitForRun(AbstractProgramManager.java:80)
	at io.cdap.cdap.test.AudiTestBase.startAndWaitForRun(AudiTestBase.java:277)
	at io.cdap.cdap.test.AudiTestBase.startAndWaitForRun(AudiTestBase.java:271)
	at io.cdap.cdap.app.etl.KVTableWithProjectionTest.testKVTableWithProjection(KVTableWithProjectionTest.java:83)
java.util.concurrent.TimeoutException: Timeout occurred. Expected true but found false.
	at io.cdap.cdap.common.utils.Tasks.waitFor(Tasks.java:70)
	at io.cdap.cdap.common.utils.Tasks.waitFor(Tasks.java:91)
	at io.cdap.cdap.test.AbstractProgramManager.waitForRuns(AbstractProgramManager.java:109)
	at io.cdap.cdap.test.AbstractProgramManager.startAndWaitForRun(AbstractProgramManager.java:80)
	at io.cdap.cdap.test.AudiTestBase.startAndWaitForRun(AudiTestBase.java:277)
	at io.cdap.cdap.test.AudiTestBase.startAndWaitForRun(AudiTestBase.java:271)
	at io.cdap.cdap.app.etl.KVTableWithProjectionTest.testKVTableWithProjection(KVTableWithProjectionTest.java:83)
java.util.concurrent.TimeoutException: Timeout occurred. Expected true but found false.
	at io.cdap.cdap.common.utils.Tasks.waitFor(Tasks.java:70)
	at io.cdap.cdap.common.utils.Tasks.waitFor(Tasks.java:91)
	at io.cdap.cdap.test.AbstractProgramManager.waitForRuns(AbstractProgramManager.java:109)
	at io.cdap.cdap.test.AbstractProgramManager.startAndWaitForRun(AbstractProgramManager.java:80)
	at io.cdap.cdap.test.AudiTestBase.startAndWaitForRun(AudiTestBase.java:277)
	at io.cdap.cdap.test.AudiTestBase.startAndWaitForRun(AudiTestBase.java:271)
	at io.cdap.cdap.app.etl.KVTableWithProjectionTest.testKVTableWithProjection(KVTableWithProjectionTest.java:83)
java.util.concurrent.TimeoutException: Timeout occurred. Expected true but found false.
	at io.cdap.cdap.common.utils.Tasks.waitFor(Tasks.java:70)
	at io.cdap.cdap.common.utils.Tasks.waitFor(Tasks.java:91)
	at io.cdap.cdap.test.AbstractProgramManager.waitForRuns(AbstractProgramManager.java:109)
	at io.cdap.cdap.test.AbstractProgramManager.startAndWaitForRun(AbstractProgramManager.java:80)
	at io.cdap.cdap.test.AudiTestBase.startAndWaitForRun(AudiTestBase.java:277)
	at io.cdap.cdap.app.etl.TPFSAvroSinkSourceTest.testTPFSWithProjection(TPFSAvroSinkSourceTest.java:80)
java.util.concurrent.TimeoutException: Timeout occurred. Expected true but found false.
	at io.cdap.cdap.common.utils.Tasks.waitFor(Tasks.java:70)
	at io.cdap.cdap.common.utils.Tasks.waitFor(Tasks.java:91)
	at io.cdap.cdap.test.AbstractProgramManager.waitForRuns(AbstractProgramManager.java:109)
	at io.cdap.cdap.test.AbstractProgramManager.startAndWaitForRun(AbstractProgramManager.java:80)
	at io.cdap.cdap.test.AudiTestBase.startAndWaitForRun(AudiTestBase.java:277)
	at io.cdap.cdap.app.etl.TPFSAvroSinkSourceTest.testTPFSWithProjection(TPFSAvroSinkSourceTest.java:80)
java.util.concurrent.TimeoutException: Timeout occurred. Expected true but found false.
	at io.cdap.cdap.common.utils.Tasks.waitFor(Tasks.java:70)
	at io.cdap.cdap.common.utils.Tasks.waitFor(Tasks.java:91)
	at io.cdap.cdap.test.AbstractProgramManager.waitForRuns(AbstractProgramManager.java:109)
	at io.cdap.cdap.test.AbstractProgramManager.startAndWaitForRun(AbstractProgramManager.java:80)
	at io.cdap.cdap.test.AudiTestBase.startAndWaitForRun(AudiTestBase.java:277)
	at io.cdap.cdap.app.etl.TPFSAvroSinkSourceTest.testTPFSWithProjection(TPFSAvroSinkSourceTest.java:80)
java.util.concurrent.TimeoutException: Timeout occurred. Expected true but found false.
	at io.cdap.cdap.common.utils.Tasks.waitFor(Tasks.java:70)
	at io.cdap.cdap.common.utils.Tasks.waitFor(Tasks.java:91)
	at io.cdap.cdap.test.AbstractProgramManager.waitForRuns(AbstractProgramManager.java:109)
	at io.cdap.cdap.test.AbstractProgramManager.startAndWaitForRun(AbstractProgramManager.java:80)
	at io.cdap.cdap.test.AudiTestBase.startAndWaitForRun(AudiTestBase.java:277)
	at io.cdap.cdap.app.etl.TPFSAvroSinkSourceTest.testTPFSWithProjection(TPFSAvroSinkSourceTest.java:80)
java.util.concurrent.TimeoutException: Timeout occurred. Expected true but found false.
	at io.cdap.cdap.common.utils.Tasks.waitFor(Tasks.java:70)
	at io.cdap.cdap.common.utils.Tasks.waitFor(Tasks.java:91)
	at io.cdap.cdap.test.AbstractProgramManager.waitForRuns(AbstractProgramManager.java:109)
	at io.cdap.cdap.test.AbstractProgramManager.startAndWaitForRun(AbstractProgramManager.java:80)
	at io.cdap.cdap.test.AudiTestBase.startAndWaitForRun(AudiTestBase.java:277)
	at io.cdap.cdap.app.etl.TPFSAvroSinkSourceTest.testTPFSWithProjection(TPFSAvroSinkSourceTest.java:80)
java.util.concurrent.TimeoutException: Timeout occurred. Expected true but found false.
	at io.cdap.cdap.common.utils.Tasks.waitFor(Tasks.java:70)
	at io.cdap.cdap.common.utils.Tasks.waitFor(Tasks.java:91)
	at io.cdap.cdap.test.AbstractProgramManager.waitForRuns(AbstractProgramManager.java:109)
	at io.cdap.cdap.test.AbstractProgramManager.startAndWaitForRun(AbstractProgramManager.java:80)
	at io.cdap.cdap.test.AudiTestBase.startAndWaitForRun(AudiTestBase.java:277)
	at io.cdap.cdap.app.etl.TPFSAvroSinkSourceTest.testTPFSWithProjection(TPFSAvroSinkSourceTest.java:80)
java.util.concurrent.TimeoutException: Timeout occurred. Expected true but found false.
	at io.cdap.cdap.common.utils.Tasks.waitFor(Tasks.java:70)
	at io.cdap.cdap.common.utils.Tasks.waitFor(Tasks.java:91)
	at io.cdap.cdap.test.AbstractProgramManager.waitForRuns(AbstractProgramManager.java:109)
	at io.cdap.cdap.test.AbstractProgramManager.startAndWaitForRun(AbstractProgramManager.java:80)
	at io.cdap.cdap.test.AudiTestBase.startAndWaitForRun(AudiTestBase.java:277)
	at io.cdap.cdap.app.etl.TPFSAvroSinkSourceTest.testTPFSWithProjection(TPFSAvroSinkSourceTest.java:80)
java.util.concurrent.TimeoutException: Timeout occurred. Expected true but found false.
	at io.cdap.cdap.common.utils.Tasks.waitFor(Tasks.java:70)
	at io.cdap.cdap.common.utils.Tasks.waitFor(Tasks.java:91)
	at io.cdap.cdap.test.AbstractProgramManager.waitForRuns(AbstractProgramManager.java:109)
	at io.cdap.cdap.test.AbstractProgramManager.startAndWaitForRun(AbstractProgramManager.java:80)
	at io.cdap.cdap.test.AudiTestBase.startAndWaitForRun(AudiTestBase.java:277)
	at io.cdap.cdap.app.etl.TPFSAvroSinkSourceTest.testTPFSWithProjection(TPFSAvroSinkSourceTest.java:80)
java.util.concurrent.TimeoutException: Timeout occurred. Expected true but found false.
	at io.cdap.cdap.common.utils.Tasks.waitFor(Tasks.java:70)
	at io.cdap.cdap.common.utils.Tasks.waitFor(Tasks.java:91)
	at io.cdap.cdap.test.AbstractProgramManager.waitForRuns(AbstractProgramManager.java:109)
	at io.cdap.cdap.test.AbstractProgramManager.startAndWaitForRun(AbstractProgramManager.java:80)
	at io.cdap.cdap.test.AudiTestBase.startAndWaitForRun(AudiTestBase.java:277)
	at io.cdap.cdap.app.etl.TPFSAvroSinkSourceTest.testTPFSWithProjection(TPFSAvroSinkSourceTest.java:80)
java.util.concurrent.TimeoutException: Timeout occurred. Expected true but found false.
	at io.cdap.cdap.common.utils.Tasks.waitFor(Tasks.java:70)
	at io.cdap.cdap.common.utils.Tasks.waitFor(Tasks.java:91)
	at io.cdap.cdap.test.AbstractProgramManager.waitForRuns(AbstractProgramManager.java:109)
	at io.cdap.cdap.test.AbstractProgramManager.startAndWaitForRun(AbstractProgramManager.java:80)
	at io.cdap.cdap.test.AudiTestBase.startAndWaitForRun(AudiTestBase.java:277)
	at io.cdap.cdap.app.etl.TPFSAvroSinkSourceTest.testTPFSWithProjection(TPFSAvroSinkSourceTest.java:80)
java.util.concurrent.TimeoutException: Timeout occurred. Expected true but found false.
	at io.cdap.cdap.common.utils.Tasks.waitFor(Tasks.java:70)
	at io.cdap.cdap.common.utils.Tasks.waitFor(Tasks.java:91)
	at io.cdap.cdap.test.AbstractProgramManager.waitForRuns(AbstractProgramManager.java:109)
	at io.cdap.cdap.test.AbstractProgramManager.startAndWaitForRun(AbstractProgramManager.java:80)
	at io.cdap.cdap.test.AudiTestBase.startAndWaitForRun(AudiTestBase.java:277)
	at io.cdap.cdap.app.etl.TPFSAvroSinkSourceTest.testTPFSWithProjection(TPFSAvroSinkSourceTest.java:80)
java.util.concurrent.TimeoutException: Timeout occurred. Expected true but found false.
	at io.cdap.cdap.common.utils.Tasks.waitFor(Tasks.java:70)
	at io.cdap.cdap.common.utils.Tasks.waitFor(Tasks.java:91)
	at io.cdap.cdap.test.AbstractProgramManager.waitForRuns(AbstractProgramManager.java:109)
	at io.cdap.cdap.test.AbstractProgramManager.startAndWaitForRun(AbstractProgramManager.java:80)
	at io.cdap.cdap.test.AudiTestBase.startAndWaitForRun(AudiTestBase.java:277)
	at io.cdap.cdap.app.etl.TPFSAvroSinkSourceTest.testTPFSWithProjection(TPFSAvroSinkSourceTest.java:80)
java.util.concurrent.TimeoutException: Timeout occurred. Expected true but found false.
	at io.cdap.cdap.common.utils.Tasks.waitFor(Tasks.java:70)
	at io.cdap.cdap.common.utils.Tasks.waitFor(Tasks.java:91)
	at io.cdap.cdap.test.AbstractProgramManager.waitForRuns(AbstractProgramManager.java:109)
	at io.cdap.cdap.test.AbstractProgramManager.startAndWaitForRun(AbstractProgramManager.java:80)
	at io.cdap.cdap.test.AudiTestBase.startAndWaitForRun(AudiTestBase.java:277)
	at io.cdap.cdap.test.AudiTestBase.startAndWaitForRun(AudiTestBase.java:271)
	at io.cdap.cdap.app.etl.batch.BatchAggregatorTest.test(BatchAggregatorTest.java:160)
java.util.concurrent.TimeoutException: Timeout occurred. Expected true but found false.
	at io.cdap.cdap.common.utils.Tasks.waitFor(Tasks.java:70)
	at io.cdap.cdap.common.utils.Tasks.waitFor(Tasks.java:91)
	at io.cdap.cdap.test.AbstractProgramManager.waitForRuns(AbstractProgramManager.java:109)
	at io.cdap.cdap.test.AbstractProgramManager.startAndWaitForRun(AbstractProgramManager.java:80)
	at io.cdap.cdap.test.AudiTestBase.startAndWaitForRun(AudiTestBase.java:277)
	at io.cdap.cdap.test.AudiTestBase.startAndWaitForRun(AudiTestBase.java:271)
	at io.cdap.cdap.app.etl.batch.BatchAggregatorTest.test(BatchAggregatorTest.java:160)
java.util.concurrent.TimeoutException: Timeout occurred. Expected true but found false.
	at io.cdap.cdap.common.utils.Tasks.waitFor(Tasks.java:70)
	at io.cdap.cdap.common.utils.Tasks.waitFor(Tasks.java:91)
	at io.cdap.cdap.test.AbstractProgramManager.waitForRuns(AbstractProgramManager.java:109)
	at io.cdap.cdap.test.AbstractProgramManager.startAndWaitForRun(AbstractProgramManager.java:80)
	at io.cdap.cdap.test.AudiTestBase.startAndWaitForRun(AudiTestBase.java:277)
	at io.cdap.cdap.test.AudiTestBase.startAndWaitForRun(AudiTestBase.java:271)
	at io.cdap.cdap.app.etl.batch.BatchAggregatorTest.test(BatchAggregatorTest.java:160)
java.util.concurrent.TimeoutException: Timeout occurred. Expected true but found false.
	at io.cdap.cdap.common.utils.Tasks.waitFor(Tasks.java:70)
	at io.cdap.cdap.common.utils.Tasks.waitFor(Tasks.java:91)
	at io.cdap.cdap.test.AbstractProgramManager.waitForRuns(AbstractProgramManager.java:109)
	at io.cdap.cdap.test.AbstractProgramManager.startAndWaitForRun(AbstractProgramManager.java:80)
	at io.cdap.cdap.test.AudiTestBase.startAndWaitForRun(AudiTestBase.java:277)
	at io.cdap.cdap.test.AudiTestBase.startAndWaitForRun(AudiTestBase.java:271)
	at io.cdap.cdap.app.etl.batch.BatchAggregatorTest.test(BatchAggregatorTest.java:160)
java.util.concurrent.TimeoutException: Timeout occurred. Expected true but found false.
	at io.cdap.cdap.common.utils.Tasks.waitFor(Tasks.java:70)
	at io.cdap.cdap.common.utils.Tasks.waitFor(Tasks.java:91)
	at io.cdap.cdap.test.AbstractProgramManager.waitForRuns(AbstractProgramManager.java:109)
	at io.cdap.cdap.test.AbstractProgramManager.startAndWaitForRun(AbstractProgramManager.java:80)
	at io.cdap.cdap.test.AudiTestBase.startAndWaitForRun(AudiTestBase.java:277)
	at io.cdap.cdap.test.AudiTestBase.startAndWaitForRun(AudiTestBase.java:271)
	at io.cdap.cdap.app.etl.batch.BatchAggregatorTest.test(BatchAggregatorTest.java:160)
java.util.concurrent.TimeoutException: Timeout occurred. Expected true but found false.
	at io.cdap.cdap.common.utils.Tasks.waitFor(Tasks.java:70)
	at io.cdap.cdap.common.utils.Tasks.waitFor(Tasks.java:91)
	at io.cdap.cdap.test.AbstractProgramManager.waitForRuns(AbstractProgramManager.java:109)
	at io.cdap.cdap.test.AbstractProgramManager.startAndWaitForRun(AbstractProgramManager.java:80)
	at io.cdap.cdap.test.AudiTestBase.startAndWaitForRun(AudiTestBase.java:277)
	at io.cdap.cdap.test.AudiTestBase.startAndWaitForRun(AudiTestBase.java:271)
	at io.cdap.cdap.app.etl.batch.BatchAggregatorTest.test(BatchAggregatorTest.java:160)
java.util.concurrent.TimeoutException: Timeout occurred. Expected true but found false.
	at io.cdap.cdap.common.utils.Tasks.waitFor(Tasks.java:70)
	at io.cdap.cdap.common.utils.Tasks.waitFor(Tasks.java:91)
	at io.cdap.cdap.test.AbstractProgramManager.waitForRuns(AbstractProgramManager.java:109)
	at io.cdap.cdap.test.AbstractProgramManager.startAndWaitForRun(AbstractProgramManager.java:80)
	at io.cdap.cdap.test.AudiTestBase.startAndWaitForRun(AudiTestBase.java:277)
	at io.cdap.cdap.test.AudiTestBase.startAndWaitForRun(AudiTestBase.java:271)
	at io.cdap.cdap.app.etl.batch.BatchAggregatorTest.test(BatchAggregatorTest.java:160)
java.util.concurrent.TimeoutException: Timeout occurred. Expected true but found false.
	at io.cdap.cdap.common.utils.Tasks.waitFor(Tasks.java:70)
	at io.cdap.cdap.common.utils.Tasks.waitFor(Tasks.java:91)
	at io.cdap.cdap.test.AbstractProgramManager.waitForRuns(AbstractProgramManager.java:109)
	at io.cdap.cdap.test.AbstractProgramManager.startAndWaitForRun(AbstractProgramManager.java:80)
	at io.cdap.cdap.test.AudiTestBase.startAndWaitForRun(AudiTestBase.java:277)
	at io.cdap.cdap.test.AudiTestBase.startAndWaitForRun(AudiTestBase.java:271)
	at io.cdap.cdap.app.etl.batch.BatchAggregatorTest.test(BatchAggregatorTest.java:160)
java.util.concurrent.TimeoutException: Timeout occurred. Expected true but found false.
	at io.cdap.cdap.common.utils.Tasks.waitFor(Tasks.java:70)
	at io.cdap.cdap.common.utils.Tasks.waitFor(Tasks.java:91)
	at io.cdap.cdap.test.AbstractProgramManager.waitForRuns(AbstractProgramManager.java:109)
	at io.cdap.cdap.test.AbstractProgramManager.startAndWaitForRun(AbstractProgramManager.java:80)
	at io.cdap.cdap.test.AudiTestBase.startAndWaitForRun(AudiTestBase.java:277)
	at io.cdap.cdap.test.AudiTestBase.startAndWaitForRun(AudiTestBase.java:271)
	at io.cdap.cdap.app.etl.batch.BatchAggregatorTest.test(BatchAggregatorTest.java:160)
java.util.concurrent.TimeoutException: Timeout occurred. Expected true but found false.
	at io.cdap.cdap.common.utils.Tasks.waitFor(Tasks.java:70)
	at io.cdap.cdap.common.utils.Tasks.waitFor(Tasks.java:91)
	at io.cdap.cdap.test.AbstractProgramManager.waitForRuns(AbstractProgramManager.java:109)
	at io.cdap.cdap.test.AbstractProgramManager.startAndWaitForRun(AbstractProgramManager.java:80)
	at io.cdap.cdap.test.AudiTestBase.startAndWaitForRun(AudiTestBase.java:277)
	at io.cdap.cdap.test.AudiTestBase.startAndWaitForRun(AudiTestBase.java:271)
	at io.cdap.cdap.app.etl.batch.BatchAggregatorTest.test(BatchAggregatorTest.java:160)
java.util.concurrent.TimeoutException: Timeout occurred. Expected true but found false.
	at io.cdap.cdap.common.utils.Tasks.waitFor(Tasks.java:70)
	at io.cdap.cdap.common.utils.Tasks.waitFor(Tasks.java:91)
	at io.cdap.cdap.test.AbstractProgramManager.waitForRuns(AbstractProgramManager.java:109)
	at io.cdap.cdap.test.AbstractProgramManager.startAndWaitForRun(AbstractProgramManager.java:80)
	at io.cdap.cdap.test.AudiTestBase.startAndWaitForRun(AudiTestBase.java:277)
	at io.cdap.cdap.test.AudiTestBase.startAndWaitForRun(AudiTestBase.java:271)
	at io.cdap.cdap.app.etl.batch.BatchAggregatorTest.test(BatchAggregatorTest.java:160)
java.util.concurrent.TimeoutException: Timeout occurred. Expected true but found false.
	at io.cdap.cdap.common.utils.Tasks.waitFor(Tasks.java:70)
	at io.cdap.cdap.common.utils.Tasks.waitFor(Tasks.java:91)
	at io.cdap.cdap.test.AbstractProgramManager.waitForRuns(AbstractProgramManager.java:109)
	at io.cdap.cdap.test.AbstractProgramManager.startAndWaitForRun(AbstractProgramManager.java:80)
	at io.cdap.cdap.test.AudiTestBase.startAndWaitForRun(AudiTestBase.java:277)
	at io.cdap.cdap.test.AudiTestBase.startAndWaitForRun(AudiTestBase.java:271)
	at io.cdap.cdap.app.etl.batch.BatchAggregatorTest.test(BatchAggregatorTest.java:160)
java.util.concurrent.TimeoutException: Timeout occurred. Expected true but found false.
	at io.cdap.cdap.common.utils.Tasks.waitFor(Tasks.java:70)
	at io.cdap.cdap.common.utils.Tasks.waitFor(Tasks.java:91)
	at io.cdap.cdap.test.AbstractProgramManager.waitForRuns(AbstractProgramManager.java:109)
	at io.cdap.cdap.test.AbstractProgramManager.startAndWaitForRun(AbstractProgramManager.java:80)
	at io.cdap.cdap.test.AudiTestBase.startAndWaitForRun(AudiTestBase.java:277)
	at io.cdap.cdap.test.AudiTestBase.startAndWaitForRun(AudiTestBase.java:271)
	at io.cdap.cdap.app.etl.batch.BatchCubeSinkTest.test(BatchCubeSinkTest.java:107)
java.util.concurrent.TimeoutException: Timeout occurred. Expected true but found false.
	at io.cdap.cdap.common.utils.Tasks.waitFor(Tasks.java:70)
	at io.cdap.cdap.common.utils.Tasks.waitFor(Tasks.java:91)
	at io.cdap.cdap.test.AbstractProgramManager.waitForRuns(AbstractProgramManager.java:109)
	at io.cdap.cdap.test.AbstractProgramManager.startAndWaitForRun(AbstractProgramManager.java:80)
	at io.cdap.cdap.test.AudiTestBase.startAndWaitForRun(AudiTestBase.java:277)
	at io.cdap.cdap.test.AudiTestBase.startAndWaitForRun(AudiTestBase.java:271)
	at io.cdap.cdap.app.etl.batch.BatchCubeSinkTest.test(BatchCubeSinkTest.java:107)
java.util.concurrent.TimeoutException: Timeout occurred. Expected true but found false.
	at io.cdap.cdap.common.utils.Tasks.waitFor(Tasks.java:70)
	at io.cdap.cdap.common.utils.Tasks.waitFor(Tasks.java:91)
	at io.cdap.cdap.test.AbstractProgramManager.waitForRuns(AbstractProgramManager.java:109)
	at io.cdap.cdap.test.AbstractProgramManager.startAndWaitForRun(AbstractProgramManager.java:80)
	at io.cdap.cdap.test.AudiTestBase.startAndWaitForRun(AudiTestBase.java:277)
	at io.cdap.cdap.test.AudiTestBase.startAndWaitForRun(AudiTestBase.java:271)
	at io.cdap.cdap.app.etl.batch.BatchCubeSinkTest.test(BatchCubeSinkTest.java:107)
java.util.concurrent.TimeoutException: Timeout occurred. Expected true but found false.
	at io.cdap.cdap.common.utils.Tasks.waitFor(Tasks.java:70)
	at io.cdap.cdap.common.utils.Tasks.waitFor(Tasks.java:91)
	at io.cdap.cdap.test.AbstractProgramManager.waitForRuns(AbstractProgramManager.java:109)
	at io.cdap.cdap.test.AbstractProgramManager.startAndWaitForRun(AbstractProgramManager.java:80)
	at io.cdap.cdap.test.AudiTestBase.startAndWaitForRun(AudiTestBase.java:277)
	at io.cdap.cdap.test.AudiTestBase.startAndWaitForRun(AudiTestBase.java:271)
	at io.cdap.cdap.app.etl.batch.BatchCubeSinkTest.test(BatchCubeSinkTest.java:107)
java.util.concurrent.TimeoutException: Timeout occurred. Expected true but found false.
	at io.cdap.cdap.common.utils.Tasks.waitFor(Tasks.java:70)
	at io.cdap.cdap.common.utils.Tasks.waitFor(Tasks.java:91)
	at io.cdap.cdap.test.AbstractProgramManager.waitForRuns(AbstractProgramManager.java:109)
	at io.cdap.cdap.test.AbstractProgramManager.startAndWaitForRun(AbstractProgramManager.java:80)
	at io.cdap.cdap.test.AudiTestBase.startAndWaitForRun(AudiTestBase.java:277)
	at io.cdap.cdap.test.AudiTestBase.startAndWaitForRun(AudiTestBase.java:271)
	at io.cdap.cdap.app.etl.batch.BatchCubeSinkTest.test(BatchCubeSinkTest.java:107)
java.util.concurrent.TimeoutException: Timeout occurred. Expected true but found false.
	at io.cdap.cdap.common.utils.Tasks.waitFor(Tasks.java:70)
	at io.cdap.cdap.common.utils.Tasks.waitFor(Tasks.java:91)
	at io.cdap.cdap.test.AbstractProgramManager.waitForRuns(AbstractProgramManager.java:109)
	at io.cdap.cdap.test.AbstractProgramManager.startAndWaitForRun(AbstractProgramManager.java:80)
	at io.cdap.cdap.test.AudiTestBase.startAndWaitForRun(AudiTestBase.java:277)
	at io.cdap.cdap.test.AudiTestBase.startAndWaitForRun(AudiTestBase.java:271)
	at io.cdap.cdap.app.etl.batch.BatchCubeSinkTest.test(BatchCubeSinkTest.java:107)
java.util.concurrent.TimeoutException: Timeout occurred. Expected true but found false.
	at io.cdap.cdap.common.utils.Tasks.waitFor(Tasks.java:70)
	at io.cdap.cdap.common.utils.Tasks.waitFor(Tasks.java:91)
	at io.cdap.cdap.test.AbstractProgramManager.waitForRuns(AbstractProgramManager.java:109)
	at io.cdap.cdap.test.AbstractProgramManager.startAndWaitForRun(AbstractProgramManager.java:80)
	at io.cdap.cdap.test.AudiTestBase.startAndWaitForRun(AudiTestBase.java:277)
	at io.cdap.cdap.test.AudiTestBase.startAndWaitForRun(AudiTestBase.java:271)
	at io.cdap.cdap.app.etl.batch.BatchCubeSinkTest.test(BatchCubeSinkTest.java:107)
java.util.concurrent.TimeoutException: Timeout occurred. Expected true but found false.
	at io.cdap.cdap.common.utils.Tasks.waitFor(Tasks.java:70)
	at io.cdap.cdap.common.utils.Tasks.waitFor(Tasks.java:91)
	at io.cdap.cdap.test.AbstractProgramManager.waitForRuns(AbstractProgramManager.java:109)
	at io.cdap.cdap.test.AbstractProgramManager.startAndWaitForRun(AbstractProgramManager.java:80)
	at io.cdap.cdap.test.AudiTestBase.startAndWaitForRun(AudiTestBase.java:277)
	at io.cdap.cdap.test.AudiTestBase.startAndWaitForRun(AudiTestBase.java:271)
	at io.cdap.cdap.app.etl.batch.BatchCubeSinkTest.test(BatchCubeSinkTest.java:107)
java.util.concurrent.TimeoutException: Timeout occurred. Expected true but found false.
	at io.cdap.cdap.common.utils.Tasks.waitFor(Tasks.java:70)
	at io.cdap.cdap.common.utils.Tasks.waitFor(Tasks.java:91)
	at io.cdap.cdap.test.AbstractProgramManager.waitForRuns(AbstractProgramManager.java:109)
	at io.cdap.cdap.test.AbstractProgramManager.startAndWaitForRun(AbstractProgramManager.java:80)
	at io.cdap.cdap.test.AudiTestBase.startAndWaitForRun(AudiTestBase.java:277)
	at io.cdap.cdap.test.AudiTestBase.startAndWaitForRun(AudiTestBase.java:271)
	at io.cdap.cdap.app.etl.batch.BatchCubeSinkTest.test(BatchCubeSinkTest.java:107)
java.util.concurrent.TimeoutException: Timeout occurred. Expected true but found false.
	at io.cdap.cdap.common.utils.Tasks.waitFor(Tasks.java:70)
	at io.cdap.cdap.common.utils.Tasks.waitFor(Tasks.java:91)
	at io.cdap.cdap.test.AbstractProgramManager.waitForRuns(AbstractProgramManager.java:109)
	at io.cdap.cdap.test.AbstractProgramManager.startAndWaitForRun(AbstractProgramManager.java:80)
	at io.cdap.cdap.test.AudiTestBase.startAndWaitForRun(AudiTestBase.java:277)
	at io.cdap.cdap.test.AudiTestBase.startAndWaitForRun(AudiTestBase.java:271)
	at io.cdap.cdap.app.etl.batch.BatchCubeSinkTest.test(BatchCubeSinkTest.java:107)
java.util.concurrent.TimeoutException: Timeout occurred. Expected true but found false.
	at io.cdap.cdap.common.utils.Tasks.waitFor(Tasks.java:70)
	at io.cdap.cdap.common.utils.Tasks.waitFor(Tasks.java:91)
	at io.cdap.cdap.test.AbstractProgramManager.waitForRuns(AbstractProgramManager.java:109)
	at io.cdap.cdap.test.AbstractProgramManager.startAndWaitForRun(AbstractProgramManager.java:80)
	at io.cdap.cdap.test.AudiTestBase.startAndWaitForRun(AudiTestBase.java:277)
	at io.cdap.cdap.test.AudiTestBase.startAndWaitForRun(AudiTestBase.java:271)
	at io.cdap.cdap.app.etl.batch.BatchCubeSinkTest.test(BatchCubeSinkTest.java:107)
java.util.concurrent.TimeoutException: Timeout occurred. Expected true but found false.
	at io.cdap.cdap.common.utils.Tasks.waitFor(Tasks.java:70)
	at io.cdap.cdap.common.utils.Tasks.waitFor(Tasks.java:91)
	at io.cdap.cdap.test.AbstractProgramManager.waitForRuns(AbstractProgramManager.java:109)
	at io.cdap.cdap.test.AbstractProgramManager.startAndWaitForRun(AbstractProgramManager.java:80)
	at io.cdap.cdap.test.AudiTestBase.startAndWaitForRun(AudiTestBase.java:277)
	at io.cdap.cdap.test.AudiTestBase.startAndWaitForRun(AudiTestBase.java:271)
	at io.cdap.cdap.app.etl.batch.BatchCubeSinkTest.test(BatchCubeSinkTest.java:107)
java.util.concurrent.TimeoutException: Timeout occurred. Expected true but found false.
	at io.cdap.cdap.common.utils.Tasks.waitFor(Tasks.java:70)
	at io.cdap.cdap.common.utils.Tasks.waitFor(Tasks.java:91)
	at io.cdap.cdap.test.AbstractProgramManager.waitForRuns(AbstractProgramManager.java:109)
	at io.cdap.cdap.test.AbstractProgramManager.startAndWaitForRun(AbstractProgramManager.java:80)
	at io.cdap.cdap.test.AudiTestBase.startAndWaitForRun(AudiTestBase.java:277)
	at io.cdap.cdap.test.AudiTestBase.startAndWaitForRun(AudiTestBase.java:271)
	at io.cdap.cdap.app.etl.batch.BatchJoinerTest.testJoiner(BatchJoinerTest.java:215)
(1 more lines...)
java.util.concurrent.TimeoutException: Timeout occurred. Expected true but found false.
	at io.cdap.cdap.common.utils.Tasks.waitFor(Tasks.java:70)
	at io.cdap.cdap.common.utils.Tasks.waitFor(Tasks.java:91)
	at io.cdap.cdap.test.AbstractProgramManager.waitForRuns(AbstractProgramManager.java:109)
	at io.cdap.cdap.test.AbstractProgramManager.startAndWaitForRun(AbstractProgramManager.java:80)
	at io.cdap.cdap.test.AudiTestBase.startAndWaitForRun(AudiTestBase.java:277)
	at io.cdap.cdap.test.AudiTestBase.startAndWaitForRun(AudiTestBase.java:271)
	at io.cdap.cdap.app.etl.batch.BatchJoinerTest.testJoiner(BatchJoinerTest.java:215)
(1 more lines...)
Fixed tests 252
Status Test Failing since View job Duration
Successful BatchJoinerTest testJoinerSpark History
Failing since build #456 (Scheduled) Distro Tests - CDH 5.10 7 mins
Successful BatchJoinerTest testJoinerSpark History
Failing since build #456 (Scheduled) Distro Tests - CDH 5.11 7 mins
Successful BatchJoinerTest testJoinerSpark History
Failing since build #456 (Scheduled) Distro Tests - CDH 5.12 7 mins
Successful BatchJoinerTest testJoinerSpark History
Failing since build #457 (Scheduled) Distro Tests - CDH 5.13 7 mins
Successful BatchJoinerTest testJoinerSpark History
Failing since build #456 (Scheduled) Distro Tests - CDH 5.14 7 mins
Successful BatchJoinerTest testJoinerSpark History
Failing since build #456 (Scheduled) Distro Tests - CDH 5.15 6 mins
Successful BatchJoinerTest testJoinerSpark History
Failing since build #456 (Scheduled) Distro Tests - CDH 5.7 7 mins
Successful BatchJoinerTest testJoinerSpark History
Failing since build #456 (Scheduled) Distro Tests - CDH 5.8 7 mins
Successful BatchJoinerTest testJoinerSpark History
Failing since build #457 (Scheduled) Distro Tests - CDH 5.9 7 mins
Successful BatchJoinerTest testJoinerSpark History
Failing since build #456 (Scheduled) Distro Tests - HDP 2.4 8 mins
Successful BatchJoinerTest testJoinerSpark History
Failing since build #456 (Scheduled) Distro Tests - HDP 2.5 7 mins
Successful BatchJoinerTest testJoinerSpark History
Failing since build #457 (Scheduled) Distro Tests - HDP 2.6 7 mins
Successful ETLMapReduceTest testDAGInvalidSchema History
Failing since build #456 (Scheduled) Distro Tests - CDH 5.10 5 secs
Successful ETLMapReduceTest testDAGInvalidSchema History
Failing since build #456 (Scheduled) Distro Tests - CDH 5.11 3 secs
Successful ETLMapReduceTest testDAGInvalidSchema History
Failing since build #456 (Scheduled) Distro Tests - CDH 5.12 3 secs
Successful ETLMapReduceTest testDAGInvalidSchema History
Failing since build #457 (Scheduled) Distro Tests - CDH 5.13 3 secs
Successful ETLMapReduceTest testDAGInvalidSchema History
Failing since build #456 (Scheduled) Distro Tests - CDH 5.14 5 secs
Successful ETLMapReduceTest testDAGInvalidSchema History
Failing since build #456 (Scheduled) Distro Tests - CDH 5.15 3 secs
Successful ETLMapReduceTest testDAGInvalidSchema History
Failing since build #456 (Scheduled) Distro Tests - CDH 5.7 3 secs
Successful ETLMapReduceTest testDAGInvalidSchema History
Failing since build #456 (Scheduled) Distro Tests - CDH 5.8 4 secs
Successful ETLMapReduceTest testDAGInvalidSchema History
Failing since build #457 (Scheduled) Distro Tests - CDH 5.9 3 secs
Successful ETLMapReduceTest testDAGInvalidSchema History
Failing since build #456 (Scheduled) Distro Tests - HDP 2.4 4 secs
Successful ETLMapReduceTest testDAGInvalidSchema History
Failing since build #456 (Scheduled) Distro Tests - HDP 2.5 3 secs
Successful ETLMapReduceTest testDAGInvalidSchema History
Failing since build #457 (Scheduled) Distro Tests - HDP 2.6 3 secs
Successful HivePluginTest testHivePlugins History
Failing since build #456 (Scheduled) Distro Tests - CDH 5.10 3 mins
Successful HivePluginTest testHivePlugins History
Failing since build #456 (Scheduled) Distro Tests - CDH 5.11 3 mins
Successful HivePluginTest testHivePlugins History
Failing since build #456 (Scheduled) Distro Tests - CDH 5.12 3 mins
Successful HivePluginTest testHivePlugins History
Failing since build #457 (Scheduled) Distro Tests - CDH 5.13 3 mins
Successful HivePluginTest testHivePlugins History
Failing since build #456 (Scheduled) Distro Tests - CDH 5.14 3 mins
Successful HivePluginTest testHivePlugins History
Failing since build #456 (Scheduled) Distro Tests - CDH 5.15 2 mins
Successful HivePluginTest testHivePlugins History
Failing since build #456 (Scheduled) Distro Tests - CDH 5.7 2 mins
Successful HivePluginTest testHivePlugins History
Failing since build #456 (Scheduled) Distro Tests - CDH 5.8 3 mins
Successful HivePluginTest testHivePlugins History
Failing since build #457 (Scheduled) Distro Tests - CDH 5.9 3 mins
Successful HivePluginTest testHivePlugins History
Failing since build #456 (Scheduled) Distro Tests - HDP 2.4 3 mins
Successful HivePluginTest testHivePlugins History
Failing since build #456 (Scheduled) Distro Tests - HDP 2.5 3 mins
Successful HivePluginTest testHivePlugins History
Failing since build #457 (Scheduled) Distro Tests - HDP 2.6 3 mins
Successful TPFSParquetSinkSourceTest testSpark History
Failing since build #456 (Scheduled) Distro Tests - CDH 5.10 6 mins
Successful TPFSParquetSinkSourceTest testSpark History
Failing since build #456 (Scheduled) Distro Tests - CDH 5.11 6 mins
Successful TPFSParquetSinkSourceTest testSpark History
Failing since build #456 (Scheduled) Distro Tests - CDH 5.12 6 mins
Successful TPFSParquetSinkSourceTest testSpark History
Failing since build #457 (Scheduled) Distro Tests - CDH 5.13 6 mins
Successful TPFSParquetSinkSourceTest testSpark History
Failing since build #456 (Scheduled) Distro Tests - CDH 5.14 6 mins
Successful TPFSParquetSinkSourceTest testSpark History
Failing since build #456 (Scheduled) Distro Tests - CDH 5.15 5 mins
Successful TPFSParquetSinkSourceTest testSpark History
Failing since build #456 (Scheduled) Distro Tests - CDH 5.7 6 mins
Successful TPFSParquetSinkSourceTest testSpark History
Failing since build #456 (Scheduled) Distro Tests - CDH 5.8 6 mins
Successful TPFSParquetSinkSourceTest testSpark History
Failing since build #457 (Scheduled) Distro Tests - CDH 5.9 6 mins
Successful TPFSParquetSinkSourceTest testSpark History
Failing since build #456 (Scheduled) Distro Tests - HDP 2.4 7 mins
Successful TPFSParquetSinkSourceTest testSpark History
Failing since build #456 (Scheduled) Distro Tests - HDP 2.5 6 mins
Successful TPFSParquetSinkSourceTest testSpark History
Failing since build #457 (Scheduled) Distro Tests - HDP 2.6 6 mins
Successful XMLReaderTest testInvalidPatternWithDeleteAction History
Failing since build #456 (Scheduled) Distro Tests - CDH 5.10 4 mins
Successful XMLReaderTest testInvalidPatternWithDeleteAction History
Failing since build #456 (Scheduled) Distro Tests - CDH 5.11 4 mins