Build #320

Build: #320 failed Scheduled with changes by albertshau <ashau@google.com>

Build result summary

Details

Completed
Duration
331 minutes
Labels
None
Revision
fcfec769e9c31b9bb146700e0c07e75c044ab4c4 fcfec769e9c31b9bb146700e0c07e75c044ab4c4
Total tests
815
Failing since
#314 (Scheduled with changes by albertshau <ashau@google.com>)

Responsible

This build has been failing since #314
No one has taken responsibility

Code commits

Author Commit Message Commit date
albertshau <ashau@google.com> albertshau <ashau@google.com> fcfec769e9c31b9bb146700e0c07e75c044ab4c4 fcfec769e9c31b9bb146700e0c07e75c044ab4c4 Merge pull request #1031 from cdapio/feature/CDAP-15879-gcs-formats-test
CDAP-15879 test GCS formats
albertshau <ashau@google.com> albertshau <ashau@google.com> c5257419f917eac4a2f22b4d2fa7fe0bb0ce18ad c5257419f917eac4a2f22b4d2fa7fe0bb0ce18ad CDAP-15879 test GCS formats
Modified the existing GCS test to test that all the formats can
be used, and to also test the usage of regex.

Tests

New test failures 50
Status Test View job Duration
Collapse Failed TPFSAvroSinkSourceTest testTPFSWithProjection History
Distro Tests - MapR 5.1 2 mins
java.util.concurrent.TimeoutException: Timeout occurred. Expected STOPPED but found RUNNING.
	at io.cdap.cdap.common.utils.Tasks.waitFor(Tasks.java:70)
	at io.cdap.cdap.common.utils.Tasks.waitFor(Tasks.java:91)
	at io.cdap.cdap.client.ProgramClient.waitForStatus(ProgramClient.java:347)
	at io.cdap.cdap.client.ProgramClient.stopAll(ProgramClient.java:278)
	at io.cdap.cdap.test.IntegrationTestBase.doClear(IntegrationTestBase.java:390)
	at io.cdap.cdap.test.IntegrationTestBase.setUp(IntegrationTestBase.java:107)
	at sun.reflect.GeneratedMethodAccessor2.invoke(Unknown Source)
(41 more lines...)
Collapse Failed TPFSAvroSinkSourceTest testTPFSWithProjection History
Distro Tests - MapR 5.2 MEP 1.1 2 mins
java.util.concurrent.TimeoutException: Timeout occurred. Expected STOPPED but found RUNNING.
	at io.cdap.cdap.common.utils.Tasks.waitFor(Tasks.java:70)
	at io.cdap.cdap.common.utils.Tasks.waitFor(Tasks.java:91)
	at io.cdap.cdap.client.ProgramClient.waitForStatus(ProgramClient.java:347)
	at io.cdap.cdap.client.ProgramClient.stopAll(ProgramClient.java:278)
	at io.cdap.cdap.test.IntegrationTestBase.doClear(IntegrationTestBase.java:390)
	at io.cdap.cdap.test.IntegrationTestBase.setUp(IntegrationTestBase.java:107)
	at sun.reflect.GeneratedMethodAccessor2.invoke(Unknown Source)
(41 more lines...)
Collapse Failed ETLMapReduceTest testKVToKV History
Distro Tests - MapR 5.1 2 mins
java.lang.RuntimeException: java.io.IOException: 500: Exception occurred while handling request: KeeperErrorCode = ConnectionLoss for /hbase
	at io.cdap.cdap.client.util.RESTClient.execute(RESTClient.java:132)
	at io.cdap.cdap.client.util.RESTClient.execute(RESTClient.java:91)
	at io.cdap.cdap.remote.dataset.kvtable.RemoteKeyValueTable.doPost(RemoteKeyValueTable.java:170)
	at io.cdap.cdap.remote.dataset.kvtable.RemoteKeyValueTable.write(RemoteKeyValueTable.java:96)
	at io.cdap.cdap.remote.dataset.kvtable.RemoteKeyValueTable.write(RemoteKeyValueTable.java:101)
	at io.cdap.cdap.app.etl.batch.ETLMapReduceTest.testKVToKV(ETLMapReduceTest.java:102)
Collapse Failed ETLMapReduceTest testKVToKV History
Distro Tests - MapR 5.2 MEP 1.1 2 mins
java.lang.RuntimeException: java.io.IOException: 500: Exception occurred while handling request: KeeperErrorCode = ConnectionLoss for /hbase
	at io.cdap.cdap.client.util.RESTClient.execute(RESTClient.java:132)
	at io.cdap.cdap.client.util.RESTClient.execute(RESTClient.java:91)
	at io.cdap.cdap.remote.dataset.kvtable.RemoteKeyValueTable.doPost(RemoteKeyValueTable.java:170)
	at io.cdap.cdap.remote.dataset.kvtable.RemoteKeyValueTable.write(RemoteKeyValueTable.java:96)
	at io.cdap.cdap.remote.dataset.kvtable.RemoteKeyValueTable.write(RemoteKeyValueTable.java:101)
	at io.cdap.cdap.app.etl.batch.ETLMapReduceTest.testKVToKV(ETLMapReduceTest.java:102)
Collapse Failed RowDenormalizerTest test History
Distro Tests - MapR 5.2 MEP 1.1 2 mins
java.util.concurrent.TimeoutException: Timeout occurred. Expected STOPPED but found RUNNING.
	at io.cdap.cdap.common.utils.Tasks.waitFor(Tasks.java:70)
	at io.cdap.cdap.common.utils.Tasks.waitFor(Tasks.java:91)
	at io.cdap.cdap.client.ProgramClient.waitForStatus(ProgramClient.java:347)
	at io.cdap.cdap.client.ProgramClient.stopAll(ProgramClient.java:278)
	at io.cdap.cdap.test.IntegrationTestBase.doClear(IntegrationTestBase.java:390)
	at io.cdap.cdap.test.IntegrationTestBase.setUp(IntegrationTestBase.java:107)
	at sun.reflect.GeneratedMethodAccessor2.invoke(Unknown Source)
(41 more lines...)
Collapse Failed TPFSParquetSinkSourceTest testSpark History
Distro Tests - CDH 5.10 4 mins
java.util.concurrent.ExecutionException: java.lang.RuntimeException: java.io.IOException: 500: Connection refused (Connection refused)
	at io.cdap.cdap.client.util.RESTClient.execute(RESTClient.java:132)
	at io.cdap.cdap.client.util.RESTClient.execute(RESTClient.java:74)
	at io.cdap.cdap.client.ProgramClient.getProgramRuns(ProgramClient.java:502)
	at io.cdap.cdap.test.remote.RemoteApplicationManager.getHistory(RemoteApplicationManager.java:160)
	at io.cdap.cdap.test.AbstractProgramManager.getHistory(AbstractProgramManager.java:150)
	at io.cdap.cdap.test.AbstractProgramManager.lambda$waitForRuns$0(AbstractProgramManager.java:96)
	at io.cdap.cdap.common.utils.Tasks.waitFor(Tasks.java:58)
(6 more lines...)
Collapse Failed TPFSParquetSinkSourceTest testMR History
Distro Tests - CDH 5.11 2 mins
java.lang.RuntimeException: java.io.IOException: 500: Connection refused (Connection refused)
	at io.cdap.cdap.client.util.RESTClient.execute(RESTClient.java:132)
	at io.cdap.cdap.client.util.RESTClient.execute(RESTClient.java:69)
	at io.cdap.cdap.client.ProgramClient.start(ProgramClient.java:131)
	at io.cdap.cdap.test.remote.RemoteApplicationManager.startProgram(RemoteApplicationManager.java:132)
	at io.cdap.cdap.test.AbstractProgramManager.start(AbstractProgramManager.java:56)
	at io.cdap.cdap.app.etl.batch.TPFSParquetSinkSourceTest.testTPFSWithProjection(TPFSParquetSinkSourceTest.java:90)
	at io.cdap.cdap.app.etl.batch.TPFSParquetSinkSourceTest.testMR(TPFSParquetSinkSourceTest.java:61)
Collapse Failed TPFSParquetSinkSourceTest testMR History
Distro Tests - CDH 5.13 9 mins
java.util.concurrent.ExecutionException: java.lang.RuntimeException: java.io.IOException: 500: Connection refused (Connection refused)
	at io.cdap.cdap.client.util.RESTClient.execute(RESTClient.java:132)
	at io.cdap.cdap.client.util.RESTClient.execute(RESTClient.java:74)
	at io.cdap.cdap.client.ProgramClient.getProgramRuns(ProgramClient.java:502)
	at io.cdap.cdap.test.remote.RemoteApplicationManager.getHistory(RemoteApplicationManager.java:160)
	at io.cdap.cdap.test.AbstractProgramManager.getHistory(AbstractProgramManager.java:150)
	at io.cdap.cdap.test.AbstractProgramManager.lambda$waitForRuns$0(AbstractProgramManager.java:96)
	at io.cdap.cdap.common.utils.Tasks.waitFor(Tasks.java:58)
(6 more lines...)
Collapse Failed TPFSParquetSinkSourceTest testMR History
Distro Tests - CDH 5.6 3 mins
java.util.concurrent.ExecutionException: java.lang.RuntimeException: java.io.IOException: 500: Connection refused (Connection refused)
	at io.cdap.cdap.client.util.RESTClient.execute(RESTClient.java:132)
	at io.cdap.cdap.client.util.RESTClient.execute(RESTClient.java:74)
	at io.cdap.cdap.client.ProgramClient.getProgramRuns(ProgramClient.java:502)
	at io.cdap.cdap.test.remote.RemoteApplicationManager.getHistory(RemoteApplicationManager.java:160)
	at io.cdap.cdap.test.AbstractProgramManager.getHistory(AbstractProgramManager.java:150)
	at io.cdap.cdap.test.AbstractProgramManager.lambda$waitForRuns$0(AbstractProgramManager.java:96)
	at io.cdap.cdap.common.utils.Tasks.waitFor(Tasks.java:58)
(6 more lines...)
Collapse Failed TPFSParquetSinkSourceTest testMR History
Distro Tests - CDH 5.8 9 mins
java.util.concurrent.ExecutionException: java.lang.RuntimeException: java.io.IOException: 500: Connection refused (Connection refused)
	at io.cdap.cdap.client.util.RESTClient.execute(RESTClient.java:132)
	at io.cdap.cdap.client.util.RESTClient.execute(RESTClient.java:74)
	at io.cdap.cdap.client.ProgramClient.getProgramRuns(ProgramClient.java:502)
	at io.cdap.cdap.test.remote.RemoteApplicationManager.getHistory(RemoteApplicationManager.java:160)
	at io.cdap.cdap.test.AbstractProgramManager.getHistory(AbstractProgramManager.java:150)
	at io.cdap.cdap.test.AbstractProgramManager.lambda$waitForRuns$0(AbstractProgramManager.java:96)
	at io.cdap.cdap.common.utils.Tasks.waitFor(Tasks.java:58)
(6 more lines...)
Collapse Failed TPFSParquetSinkSourceTest testMR History
Distro Tests - HDP 2.5 11 mins
java.util.concurrent.ExecutionException: java.lang.RuntimeException: java.io.IOException: 500: Connection refused (Connection refused)
	at io.cdap.cdap.client.util.RESTClient.execute(RESTClient.java:132)
	at io.cdap.cdap.client.util.RESTClient.execute(RESTClient.java:74)
	at io.cdap.cdap.client.ProgramClient.getProgramRuns(ProgramClient.java:502)
	at io.cdap.cdap.test.remote.RemoteApplicationManager.getHistory(RemoteApplicationManager.java:160)
	at io.cdap.cdap.test.AbstractProgramManager.getHistory(AbstractProgramManager.java:150)
	at io.cdap.cdap.test.AbstractProgramManager.lambda$waitForRuns$0(AbstractProgramManager.java:96)
	at io.cdap.cdap.common.utils.Tasks.waitFor(Tasks.java:58)
(6 more lines...)
Collapse Failed TPFSParquetSinkSourceTest testMR History
Distro Tests - MapR 5.1 2 mins
java.util.concurrent.TimeoutException: Timeout occurred. Expected STOPPED but found RUNNING.
	at io.cdap.cdap.common.utils.Tasks.waitFor(Tasks.java:70)
	at io.cdap.cdap.common.utils.Tasks.waitFor(Tasks.java:91)
	at io.cdap.cdap.client.ProgramClient.waitForStatus(ProgramClient.java:347)
	at io.cdap.cdap.client.ProgramClient.stopAll(ProgramClient.java:278)
	at io.cdap.cdap.test.IntegrationTestBase.doClear(IntegrationTestBase.java:390)
	at io.cdap.cdap.test.IntegrationTestBase.setUp(IntegrationTestBase.java:107)
	at sun.reflect.GeneratedMethodAccessor2.invoke(Unknown Source)
(41 more lines...)
Collapse Failed TPFSParquetSinkSourceTest testMR History
Distro Tests - MapR 5.2 MEP 1.1 2 mins
java.util.concurrent.TimeoutException: Timeout occurred. Expected STOPPED but found RUNNING.
	at io.cdap.cdap.common.utils.Tasks.waitFor(Tasks.java:70)
	at io.cdap.cdap.common.utils.Tasks.waitFor(Tasks.java:91)
	at io.cdap.cdap.client.ProgramClient.waitForStatus(ProgramClient.java:347)
	at io.cdap.cdap.client.ProgramClient.stopAll(ProgramClient.java:278)
	at io.cdap.cdap.test.IntegrationTestBase.doClear(IntegrationTestBase.java:390)
	at io.cdap.cdap.test.IntegrationTestBase.setUp(IntegrationTestBase.java:107)
	at sun.reflect.GeneratedMethodAccessor2.invoke(Unknown Source)
(41 more lines...)
Collapse Failed ValueMapperTest test History
Distro Tests - CDH 5.14 1 min
java.util.concurrent.ExecutionException: java.lang.RuntimeException: java.io.IOException: 500: Connection refused (Connection refused)
	at io.cdap.cdap.client.util.RESTClient.execute(RESTClient.java:132)
	at io.cdap.cdap.client.util.RESTClient.execute(RESTClient.java:74)
	at io.cdap.cdap.client.ProgramClient.getProgramRuns(ProgramClient.java:502)
	at io.cdap.cdap.test.remote.RemoteApplicationManager.getHistory(RemoteApplicationManager.java:160)
	at io.cdap.cdap.test.AbstractProgramManager.getHistory(AbstractProgramManager.java:150)
	at io.cdap.cdap.test.AbstractProgramManager.lambda$waitForRuns$0(AbstractProgramManager.java:96)
	at io.cdap.cdap.common.utils.Tasks.waitFor(Tasks.java:58)
(8 more lines...)
Collapse Failed ValueMapperTest test History
Distro Tests - CDH 5.6 2 mins
java.util.concurrent.TimeoutException: Timeout occurred. Expected STOPPED but found STARTING.
	at io.cdap.cdap.common.utils.Tasks.waitFor(Tasks.java:70)
	at io.cdap.cdap.common.utils.Tasks.waitFor(Tasks.java:91)
	at io.cdap.cdap.client.ProgramClient.waitForStatus(ProgramClient.java:347)
	at io.cdap.cdap.client.ProgramClient.stopAll(ProgramClient.java:278)
	at io.cdap.cdap.test.IntegrationTestBase.doClear(IntegrationTestBase.java:390)
	at io.cdap.cdap.test.IntegrationTestBase.setUp(IntegrationTestBase.java:107)
	at sun.reflect.GeneratedMethodAccessor2.invoke(Unknown Source)
(41 more lines...)
Collapse Failed ValueMapperTest test History
Distro Tests - MapR 5.1 2 mins
java.util.concurrent.TimeoutException: Timeout occurred. Expected STOPPED but found RUNNING.
	at io.cdap.cdap.common.utils.Tasks.waitFor(Tasks.java:70)
	at io.cdap.cdap.common.utils.Tasks.waitFor(Tasks.java:91)
	at io.cdap.cdap.client.ProgramClient.waitForStatus(ProgramClient.java:347)
	at io.cdap.cdap.client.ProgramClient.stopAll(ProgramClient.java:278)
	at io.cdap.cdap.test.IntegrationTestBase.doClear(IntegrationTestBase.java:390)
	at io.cdap.cdap.test.IntegrationTestBase.setUp(IntegrationTestBase.java:107)
	at sun.reflect.GeneratedMethodAccessor2.invoke(Unknown Source)
(41 more lines...)
Collapse Failed ValueMapperTest test History
Distro Tests - MapR 5.2 MEP 1.1 11 mins
java.util.concurrent.TimeoutException: CDAP Services are not available. Retried for 600 seconds.
	at io.cdap.cdap.test.IntegrationTestBase.checkServicesWithRetry(IntegrationTestBase.java:265)
	at io.cdap.cdap.test.IntegrationTestBase.checkSystemServices(IntegrationTestBase.java:200)
	at io.cdap.cdap.test.IntegrationTestBase.setUp(IntegrationTestBase.java:97)
	at sun.reflect.GeneratedMethodAccessor2.invoke(Unknown Source)
	at sun.reflect.DelegatingMethodAccessorImpl.invoke(DelegatingMethodAccessorImpl.java:43)
	at java.lang.reflect.Method.invoke(Method.java:498)
	at org.junit.runners.model.FrameworkMethod$1.runReflectiveCall(FrameworkMethod.java:50)
(38 more lines...)
Collapse Failed XMLReaderTest testPreProcessingNotRequired History
Distro Tests - CDH 5.15 5 mins
java.io.IOException: 500: Exception encountered while processing request : java.lang.RuntimeException: org.apache.thrift.transport.TTransportException
	at io.cdap.cdap.client.util.RESTClient.execute(RESTClient.java:132)
	at io.cdap.cdap.client.util.RESTClient.execute(RESTClient.java:74)
	at io.cdap.cdap.app.etl.batch.XMLReaderTest.testPreProcessingNotRequired(XMLReaderTest.java:206)
Collapse Failed XMLReaderTest testInvalidNodePathWithMoveAction History
Distro Tests - MapR 5.1 2 mins
java.util.concurrent.TimeoutException: Timeout occurred. Expected STOPPED but found RUNNING.
	at io.cdap.cdap.common.utils.Tasks.waitFor(Tasks.java:70)
	at io.cdap.cdap.common.utils.Tasks.waitFor(Tasks.java:91)
	at io.cdap.cdap.client.ProgramClient.waitForStatus(ProgramClient.java:347)
	at io.cdap.cdap.client.ProgramClient.stopAll(ProgramClient.java:278)
	at io.cdap.cdap.test.IntegrationTestBase.doClear(IntegrationTestBase.java:390)
	at io.cdap.cdap.test.IntegrationTestBase.setUp(IntegrationTestBase.java:107)
	at sun.reflect.GeneratedMethodAccessor2.invoke(Unknown Source)
(41 more lines...)
Collapse Failed XMLReaderTest testPatternWithDeleteAction History
Distro Tests - MapR 5.1 3 mins
java.util.concurrent.TimeoutException: Timeout occurred. Expected STOPPED but found RUNNING.
	at io.cdap.cdap.common.utils.Tasks.waitFor(Tasks.java:70)
	at io.cdap.cdap.common.utils.Tasks.waitFor(Tasks.java:91)
	at io.cdap.cdap.client.ProgramClient.waitForStatus(ProgramClient.java:347)
	at io.cdap.cdap.client.ProgramClient.stopAll(ProgramClient.java:278)
	at io.cdap.cdap.test.IntegrationTestBase.doClear(IntegrationTestBase.java:390)
	at io.cdap.cdap.test.IntegrationTestBase.setUp(IntegrationTestBase.java:107)
	at sun.reflect.GeneratedMethodAccessor2.invoke(Unknown Source)
(41 more lines...)
Collapse Failed XMLReaderTest testPreProcessingRequired History
Distro Tests - MapR 5.1 2 mins
java.util.concurrent.TimeoutException: Timeout occurred. Expected STOPPED but found RUNNING.
	at io.cdap.cdap.common.utils.Tasks.waitFor(Tasks.java:70)
	at io.cdap.cdap.common.utils.Tasks.waitFor(Tasks.java:91)
	at io.cdap.cdap.client.ProgramClient.waitForStatus(ProgramClient.java:347)
	at io.cdap.cdap.client.ProgramClient.stopAll(ProgramClient.java:278)
	at io.cdap.cdap.test.IntegrationTestBase.doClear(IntegrationTestBase.java:390)
	at io.cdap.cdap.test.IntegrationTestBase.setUp(IntegrationTestBase.java:107)
	at sun.reflect.GeneratedMethodAccessor2.invoke(Unknown Source)
(41 more lines...)
Collapse Failed XMLReaderTest testPreProcessingNotRequired History
Distro Tests - MapR 5.1 2 mins
java.util.concurrent.TimeoutException: Timeout occurred. Expected STOPPED but found RUNNING.
	at io.cdap.cdap.common.utils.Tasks.waitFor(Tasks.java:70)
	at io.cdap.cdap.common.utils.Tasks.waitFor(Tasks.java:91)
	at io.cdap.cdap.client.ProgramClient.waitForStatus(ProgramClient.java:347)
	at io.cdap.cdap.client.ProgramClient.stopAll(ProgramClient.java:278)
	at io.cdap.cdap.test.IntegrationTestBase.doClear(IntegrationTestBase.java:390)
	at io.cdap.cdap.test.IntegrationTestBase.setUp(IntegrationTestBase.java:107)
	at sun.reflect.GeneratedMethodAccessor2.invoke(Unknown Source)
(41 more lines...)
Collapse Failed XMLReaderTest testInvalidPatternWithDeleteAction History
Distro Tests - MapR 5.1 2 mins
java.util.concurrent.TimeoutException: Timeout occurred. Expected STOPPED but found RUNNING.
	at io.cdap.cdap.common.utils.Tasks.waitFor(Tasks.java:70)
	at io.cdap.cdap.common.utils.Tasks.waitFor(Tasks.java:91)
	at io.cdap.cdap.client.ProgramClient.waitForStatus(ProgramClient.java:347)
	at io.cdap.cdap.client.ProgramClient.stopAll(ProgramClient.java:278)
	at io.cdap.cdap.test.IntegrationTestBase.doClear(IntegrationTestBase.java:390)
	at io.cdap.cdap.test.IntegrationTestBase.setUp(IntegrationTestBase.java:107)
	at sun.reflect.GeneratedMethodAccessor2.invoke(Unknown Source)
(41 more lines...)
Collapse Failed XMLReaderTest testInvalidNodePathWithMoveAction History
Distro Tests - MapR 5.2 MEP 1.1 11 mins
java.util.concurrent.TimeoutException: CDAP Services are not available. Retried for 600 seconds.
	at io.cdap.cdap.test.IntegrationTestBase.checkServicesWithRetry(IntegrationTestBase.java:265)
	at io.cdap.cdap.test.IntegrationTestBase.checkSystemServices(IntegrationTestBase.java:200)
	at io.cdap.cdap.test.IntegrationTestBase.setUp(IntegrationTestBase.java:97)
	at sun.reflect.GeneratedMethodAccessor2.invoke(Unknown Source)
	at sun.reflect.DelegatingMethodAccessorImpl.invoke(DelegatingMethodAccessorImpl.java:43)
	at java.lang.reflect.Method.invoke(Method.java:498)
	at org.junit.runners.model.FrameworkMethod$1.runReflectiveCall(FrameworkMethod.java:50)
(38 more lines...)
Collapse Failed XMLReaderTest testPatternWithDeleteAction History
Distro Tests - MapR 5.2 MEP 1.1 11 mins
java.util.concurrent.TimeoutException: CDAP Services are not available. Retried for 600 seconds.
	at io.cdap.cdap.test.IntegrationTestBase.checkServicesWithRetry(IntegrationTestBase.java:265)
	at io.cdap.cdap.test.IntegrationTestBase.checkSystemServices(IntegrationTestBase.java:200)
	at io.cdap.cdap.test.IntegrationTestBase.setUp(IntegrationTestBase.java:97)
	at sun.reflect.GeneratedMethodAccessor2.invoke(Unknown Source)
	at sun.reflect.DelegatingMethodAccessorImpl.invoke(DelegatingMethodAccessorImpl.java:43)
	at java.lang.reflect.Method.invoke(Method.java:498)
	at org.junit.runners.model.FrameworkMethod$1.runReflectiveCall(FrameworkMethod.java:50)
(38 more lines...)
Collapse Failed XMLReaderTest testPreProcessingRequired History
Distro Tests - MapR 5.2 MEP 1.1 11 mins
java.util.concurrent.TimeoutException: CDAP Services are not available. Retried for 600 seconds.
	at io.cdap.cdap.test.IntegrationTestBase.checkServicesWithRetry(IntegrationTestBase.java:265)
	at io.cdap.cdap.test.IntegrationTestBase.checkSystemServices(IntegrationTestBase.java:200)
	at io.cdap.cdap.test.IntegrationTestBase.setUp(IntegrationTestBase.java:97)
	at sun.reflect.GeneratedMethodAccessor2.invoke(Unknown Source)
	at sun.reflect.DelegatingMethodAccessorImpl.invoke(DelegatingMethodAccessorImpl.java:43)
	at java.lang.reflect.Method.invoke(Method.java:498)
	at org.junit.runners.model.FrameworkMethod$1.runReflectiveCall(FrameworkMethod.java:50)
(38 more lines...)
Collapse Failed XMLReaderTest testPreProcessingNotRequired History
Distro Tests - MapR 5.2 MEP 1.1 11 mins
java.util.concurrent.TimeoutException: CDAP Services are not available. Retried for 600 seconds.
	at io.cdap.cdap.test.IntegrationTestBase.checkServicesWithRetry(IntegrationTestBase.java:265)
	at io.cdap.cdap.test.IntegrationTestBase.checkSystemServices(IntegrationTestBase.java:200)
	at io.cdap.cdap.test.IntegrationTestBase.setUp(IntegrationTestBase.java:97)
	at sun.reflect.GeneratedMethodAccessor2.invoke(Unknown Source)
	at sun.reflect.DelegatingMethodAccessorImpl.invoke(DelegatingMethodAccessorImpl.java:43)
	at java.lang.reflect.Method.invoke(Method.java:498)
	at org.junit.runners.model.FrameworkMethod$1.runReflectiveCall(FrameworkMethod.java:50)
(38 more lines...)
Collapse Failed XMLReaderTest testInvalidPatternWithDeleteAction History
Distro Tests - MapR 5.2 MEP 1.1 11 mins
java.util.concurrent.TimeoutException: CDAP Services are not available. Retried for 600 seconds.
	at io.cdap.cdap.test.IntegrationTestBase.checkServicesWithRetry(IntegrationTestBase.java:265)
	at io.cdap.cdap.test.IntegrationTestBase.checkSystemServices(IntegrationTestBase.java:200)
	at io.cdap.cdap.test.IntegrationTestBase.setUp(IntegrationTestBase.java:97)
	at sun.reflect.GeneratedMethodAccessor2.invoke(Unknown Source)
	at sun.reflect.DelegatingMethodAccessorImpl.invoke(DelegatingMethodAccessorImpl.java:43)
	at java.lang.reflect.Method.invoke(Method.java:498)
	at org.junit.runners.model.FrameworkMethod$1.runReflectiveCall(FrameworkMethod.java:50)
(38 more lines...)
Collapse Failed WranglerServiceTest test History
Distro Tests - CDH 5.6 2 mins
java.util.concurrent.TimeoutException: Timeout occurred. Expected STOPPED but found STARTING.
	at io.cdap.cdap.common.utils.Tasks.waitFor(Tasks.java:70)
	at io.cdap.cdap.common.utils.Tasks.waitFor(Tasks.java:91)
	at io.cdap.cdap.client.ProgramClient.waitForStatus(ProgramClient.java:347)
	at io.cdap.cdap.client.ProgramClient.stopAll(ProgramClient.java:278)
	at io.cdap.cdap.test.IntegrationTestBase.doClear(IntegrationTestBase.java:390)
	at io.cdap.cdap.test.IntegrationTestBase.setUp(IntegrationTestBase.java:107)
	at sun.reflect.GeneratedMethodAccessor2.invoke(Unknown Source)
(41 more lines...)
Collapse Failed WranglerServiceTest test History
Distro Tests - MapR 5.1 2 mins
java.util.concurrent.TimeoutException: Timeout occurred. Expected STOPPED but found RUNNING.
	at io.cdap.cdap.common.utils.Tasks.waitFor(Tasks.java:70)
	at io.cdap.cdap.common.utils.Tasks.waitFor(Tasks.java:91)
	at io.cdap.cdap.client.ProgramClient.waitForStatus(ProgramClient.java:347)
	at io.cdap.cdap.client.ProgramClient.stopAll(ProgramClient.java:278)
	at io.cdap.cdap.test.IntegrationTestBase.doClear(IntegrationTestBase.java:390)
	at io.cdap.cdap.test.IntegrationTestBase.setUp(IntegrationTestBase.java:107)
	at sun.reflect.GeneratedMethodAccessor2.invoke(Unknown Source)
(41 more lines...)
Collapse Failed WranglerServiceTest test History
Distro Tests - MapR 5.2 MEP 1.1 11 mins
java.util.concurrent.TimeoutException: CDAP Services are not available. Retried for 600 seconds.
	at io.cdap.cdap.test.IntegrationTestBase.checkServicesWithRetry(IntegrationTestBase.java:265)
	at io.cdap.cdap.test.IntegrationTestBase.checkSystemServices(IntegrationTestBase.java:200)
	at io.cdap.cdap.test.IntegrationTestBase.setUp(IntegrationTestBase.java:97)
	at sun.reflect.GeneratedMethodAccessor2.invoke(Unknown Source)
	at sun.reflect.DelegatingMethodAccessorImpl.invoke(DelegatingMethodAccessorImpl.java:43)
	at java.lang.reflect.Method.invoke(Method.java:498)
	at org.junit.runners.model.FrameworkMethod$1.runReflectiveCall(FrameworkMethod.java:50)
(38 more lines...)
Collapse Failed WranglerTest testWranglerSpark History
Distro Tests - CDH 5.4 3 mins
java.util.concurrent.ExecutionException: java.lang.RuntimeException: java.io.IOException: 500: Connection refused (Connection refused)
	at io.cdap.cdap.client.util.RESTClient.execute(RESTClient.java:132)
	at io.cdap.cdap.client.util.RESTClient.execute(RESTClient.java:74)
	at io.cdap.cdap.client.ProgramClient.getProgramRuns(ProgramClient.java:502)
	at io.cdap.cdap.test.remote.RemoteApplicationManager.getHistory(RemoteApplicationManager.java:160)
	at io.cdap.cdap.test.AbstractProgramManager.getHistory(AbstractProgramManager.java:150)
	at io.cdap.cdap.test.AbstractProgramManager.lambda$waitForRuns$0(AbstractProgramManager.java:96)
	at io.cdap.cdap.common.utils.Tasks.waitFor(Tasks.java:58)
(6 more lines...)
Collapse Failed WranglerTest testWranglerSpark History
Distro Tests - CDH 5.6 2 mins
java.util.concurrent.TimeoutException: Timeout occurred. Expected STOPPED but found STARTING.
	at io.cdap.cdap.common.utils.Tasks.waitFor(Tasks.java:70)
	at io.cdap.cdap.common.utils.Tasks.waitFor(Tasks.java:91)
	at io.cdap.cdap.client.ProgramClient.waitForStatus(ProgramClient.java:347)
	at io.cdap.cdap.client.ProgramClient.stopAll(ProgramClient.java:278)
	at io.cdap.cdap.test.IntegrationTestBase.doClear(IntegrationTestBase.java:390)
	at io.cdap.cdap.test.IntegrationTestBase.setUp(IntegrationTestBase.java:107)
	at sun.reflect.GeneratedMethodAccessor2.invoke(Unknown Source)
(41 more lines...)
Collapse Failed WranglerTest testWranglerMR History
Distro Tests - CDH 5.6 2 mins
java.util.concurrent.TimeoutException: Timeout occurred. Expected STOPPED but found STARTING.
	at io.cdap.cdap.common.utils.Tasks.waitFor(Tasks.java:70)
	at io.cdap.cdap.common.utils.Tasks.waitFor(Tasks.java:91)
	at io.cdap.cdap.client.ProgramClient.waitForStatus(ProgramClient.java:347)
	at io.cdap.cdap.client.ProgramClient.stopAll(ProgramClient.java:278)
	at io.cdap.cdap.test.IntegrationTestBase.doClear(IntegrationTestBase.java:390)
	at io.cdap.cdap.test.IntegrationTestBase.setUp(IntegrationTestBase.java:107)
	at sun.reflect.GeneratedMethodAccessor2.invoke(Unknown Source)
(41 more lines...)
Collapse Failed WranglerTest testWranglerMR History
Distro Tests - CDH 5.9 4 mins
java.util.concurrent.ExecutionException: java.lang.RuntimeException: java.io.IOException: 500: Connection refused (Connection refused)
	at io.cdap.cdap.client.util.RESTClient.execute(RESTClient.java:132)
	at io.cdap.cdap.client.util.RESTClient.execute(RESTClient.java:74)
	at io.cdap.cdap.client.ProgramClient.getProgramRuns(ProgramClient.java:502)
	at io.cdap.cdap.test.remote.RemoteApplicationManager.getHistory(RemoteApplicationManager.java:160)
	at io.cdap.cdap.test.AbstractProgramManager.getHistory(AbstractProgramManager.java:150)
	at io.cdap.cdap.test.AbstractProgramManager.lambda$waitForRuns$0(AbstractProgramManager.java:96)
	at io.cdap.cdap.common.utils.Tasks.waitFor(Tasks.java:58)
(6 more lines...)
Collapse Failed WranglerTest testWranglerMR History
Distro Tests - MapR 5.1 2 mins
java.util.concurrent.TimeoutException: Timeout occurred. Expected STOPPED but found RUNNING.
	at io.cdap.cdap.common.utils.Tasks.waitFor(Tasks.java:70)
	at io.cdap.cdap.common.utils.Tasks.waitFor(Tasks.java:91)
	at io.cdap.cdap.client.ProgramClient.waitForStatus(ProgramClient.java:347)
	at io.cdap.cdap.client.ProgramClient.stopAll(ProgramClient.java:278)
	at io.cdap.cdap.test.IntegrationTestBase.doClear(IntegrationTestBase.java:390)
	at io.cdap.cdap.test.IntegrationTestBase.setUp(IntegrationTestBase.java:107)
	at sun.reflect.GeneratedMethodAccessor2.invoke(Unknown Source)
(41 more lines...)
Collapse Failed WranglerTest testWranglerMR History
Distro Tests - MapR 5.2 MEP 1.1 11 mins
java.util.concurrent.TimeoutException: CDAP Services are not available. Retried for 600 seconds.
	at io.cdap.cdap.test.IntegrationTestBase.checkServicesWithRetry(IntegrationTestBase.java:265)
	at io.cdap.cdap.test.IntegrationTestBase.checkSystemServices(IntegrationTestBase.java:200)
	at io.cdap.cdap.test.IntegrationTestBase.setUp(IntegrationTestBase.java:97)
	at sun.reflect.GeneratedMethodAccessor2.invoke(Unknown Source)
	at sun.reflect.DelegatingMethodAccessorImpl.invoke(DelegatingMethodAccessorImpl.java:43)
	at java.lang.reflect.Method.invoke(Method.java:498)
	at org.junit.runners.model.FrameworkMethod$1.runReflectiveCall(FrameworkMethod.java:50)
(38 more lines...)
Collapse Failed ReadlessIncrementTest testReadlessIncrementsInMapReduce History
Distro Tests - MapR 5.1 2 mins
java.util.concurrent.TimeoutException: Timeout occurred. Expected STOPPED but found RUNNING.
	at io.cdap.cdap.common.utils.Tasks.waitFor(Tasks.java:70)
	at io.cdap.cdap.common.utils.Tasks.waitFor(Tasks.java:91)
	at io.cdap.cdap.client.ProgramClient.waitForStatus(ProgramClient.java:347)
	at io.cdap.cdap.client.ProgramClient.stopAll(ProgramClient.java:278)
	at io.cdap.cdap.test.IntegrationTestBase.doClear(IntegrationTestBase.java:390)
	at io.cdap.cdap.test.IntegrationTestBase.setUp(IntegrationTestBase.java:107)
	at sun.reflect.GeneratedMethodAccessor2.invoke(Unknown Source)
(41 more lines...)
Collapse Failed ServiceWorkerTest test History
Distro Tests - MapR 5.1 2 mins
java.util.concurrent.TimeoutException: Timeout occurred. Expected STOPPED but found RUNNING.
	at io.cdap.cdap.common.utils.Tasks.waitFor(Tasks.java:70)
	at io.cdap.cdap.common.utils.Tasks.waitFor(Tasks.java:91)
	at io.cdap.cdap.client.ProgramClient.waitForStatus(ProgramClient.java:347)
	at io.cdap.cdap.client.ProgramClient.stopAll(ProgramClient.java:278)
	at io.cdap.cdap.test.IntegrationTestBase.doClear(IntegrationTestBase.java:390)
	at io.cdap.cdap.test.IntegrationTestBase.setUp(IntegrationTestBase.java:107)
	at sun.reflect.GeneratedMethodAccessor2.invoke(Unknown Source)
(41 more lines...)
Collapse Failed ServiceWorkerTest test History
Distro Tests - MapR 5.2 MEP 1.1 2 mins
java.util.concurrent.TimeoutException: Timeout occurred. Expected STOPPED but found RUNNING.
	at io.cdap.cdap.common.utils.Tasks.waitFor(Tasks.java:70)
	at io.cdap.cdap.common.utils.Tasks.waitFor(Tasks.java:91)
	at io.cdap.cdap.client.ProgramClient.waitForStatus(ProgramClient.java:347)
	at io.cdap.cdap.client.ProgramClient.stopAll(ProgramClient.java:278)
	at io.cdap.cdap.test.IntegrationTestBase.doClear(IntegrationTestBase.java:390)
	at io.cdap.cdap.test.IntegrationTestBase.setUp(IntegrationTestBase.java:107)
	at sun.reflect.GeneratedMethodAccessor2.invoke(Unknown Source)
(41 more lines...)
Collapse Failed ProgramMetadataTest testWithLineage History
Distro Tests - MapR 5.1 6 mins
java.util.concurrent.TimeoutException: Timeout occurred. Expected true but found false.
	at io.cdap.cdap.common.utils.Tasks.waitFor(Tasks.java:70)
	at io.cdap.cdap.common.utils.Tasks.waitFor(Tasks.java:91)
	at io.cdap.cdap.common.utils.Tasks.waitFor(Tasks.java:130)
	at io.cdap.cdap.test.AbstractProgramManager.waitForRuns(AbstractProgramManager.java:96)
	at io.cdap.cdap.test.AbstractProgramManager.waitForRun(AbstractProgramManager.java:90)
	at io.cdap.cdap.apps.metadata.ProgramMetadataTest.testWithLineage(ProgramMetadataTest.java:96)
Collapse Failed WorkflowTest test History
Distro Tests - CDH 5.6 2 mins
java.util.concurrent.TimeoutException: Timeout occurred. Expected STOPPED but found STARTING.
	at io.cdap.cdap.common.utils.Tasks.waitFor(Tasks.java:70)
	at io.cdap.cdap.common.utils.Tasks.waitFor(Tasks.java:91)
	at io.cdap.cdap.client.ProgramClient.waitForStatus(ProgramClient.java:347)
	at io.cdap.cdap.client.ProgramClient.stopAll(ProgramClient.java:278)
	at io.cdap.cdap.test.IntegrationTestBase.doClear(IntegrationTestBase.java:390)
	at io.cdap.cdap.test.IntegrationTestBase.setUp(IntegrationTestBase.java:107)
	at sun.reflect.GeneratedMethodAccessor2.invoke(Unknown Source)
(41 more lines...)
Collapse Failed WorkflowTest test History
Distro Tests - MapR 5.1 2 mins
java.util.concurrent.TimeoutException: Timeout occurred. Expected STOPPED but found RUNNING.
	at io.cdap.cdap.common.utils.Tasks.waitFor(Tasks.java:70)
	at io.cdap.cdap.common.utils.Tasks.waitFor(Tasks.java:91)
	at io.cdap.cdap.client.ProgramClient.waitForStatus(ProgramClient.java:347)
	at io.cdap.cdap.client.ProgramClient.stopAll(ProgramClient.java:278)
	at io.cdap.cdap.test.IntegrationTestBase.doClear(IntegrationTestBase.java:390)
	at io.cdap.cdap.test.IntegrationTestBase.setUp(IntegrationTestBase.java:107)
	at sun.reflect.GeneratedMethodAccessor2.invoke(Unknown Source)
(41 more lines...)
Collapse Failed WorkflowTest test History
Distro Tests - MapR 5.2 MEP 1.1 11 mins
java.util.concurrent.TimeoutException: CDAP Services are not available. Retried for 600 seconds.
	at io.cdap.cdap.test.IntegrationTestBase.checkServicesWithRetry(IntegrationTestBase.java:265)
	at io.cdap.cdap.test.IntegrationTestBase.checkSystemServices(IntegrationTestBase.java:200)
	at io.cdap.cdap.test.IntegrationTestBase.setUp(IntegrationTestBase.java:97)
	at sun.reflect.GeneratedMethodAccessor2.invoke(Unknown Source)
	at sun.reflect.DelegatingMethodAccessorImpl.invoke(DelegatingMethodAccessorImpl.java:43)
	at java.lang.reflect.Method.invoke(Method.java:498)
	at org.junit.runners.model.FrameworkMethod$1.runReflectiveCall(FrameworkMethod.java:50)
(38 more lines...)
Collapse Failed RemoteCubeTest test History
Distro Tests - MapR 5.1 2 mins
java.util.concurrent.TimeoutException: Timeout occurred. Expected STOPPED but found RUNNING.
	at io.cdap.cdap.common.utils.Tasks.waitFor(Tasks.java:70)
	at io.cdap.cdap.common.utils.Tasks.waitFor(Tasks.java:91)
	at io.cdap.cdap.client.ProgramClient.waitForStatus(ProgramClient.java:347)
	at io.cdap.cdap.client.ProgramClient.stopAll(ProgramClient.java:278)
	at io.cdap.cdap.test.IntegrationTestBase.doClear(IntegrationTestBase.java:390)
	at io.cdap.cdap.test.IntegrationTestBase.setUp(IntegrationTestBase.java:107)
	at sun.reflect.GeneratedMethodAccessor2.invoke(Unknown Source)
(41 more lines...)
Collapse Failed RemoteCubeTest test History
Distro Tests - MapR 5.2 MEP 1.1 2 mins
java.lang.RuntimeException: java.io.IOException: 500: Exception occurred while handling request: canCommit() is called for transaction 1568445796396000000 that is not in progress (it is known to be invalid)
	at io.cdap.cdap.client.util.RESTClient.execute(RESTClient.java:132)
	at io.cdap.cdap.client.util.RESTClient.execute(RESTClient.java:91)
	at io.cdap.cdap.remote.dataset.cube.RemoteCube.doPost(RemoteCube.java:116)
	at io.cdap.cdap.remote.dataset.cube.RemoteCube.doPost(RemoteCube.java:109)
	at io.cdap.cdap.remote.dataset.cube.RemoteCube.query(RemoteCube.java:78)
	at io.cdap.cdap.remote.dataset.test.RemoteCubeTest.test(RemoteCubeTest.java:118)
Collapse Failed RemoteKeyValueTest test History
Distro Tests - MapR 5.1 2 mins
java.util.concurrent.TimeoutException: Timeout occurred. Expected STOPPED but found RUNNING.
	at io.cdap.cdap.common.utils.Tasks.waitFor(Tasks.java:70)
	at io.cdap.cdap.common.utils.Tasks.waitFor(Tasks.java:91)
	at io.cdap.cdap.client.ProgramClient.waitForStatus(ProgramClient.java:347)
	at io.cdap.cdap.client.ProgramClient.stopAll(ProgramClient.java:278)
	at io.cdap.cdap.test.IntegrationTestBase.doClear(IntegrationTestBase.java:390)
	at io.cdap.cdap.test.IntegrationTestBase.setUp(IntegrationTestBase.java:107)
	at sun.reflect.GeneratedMethodAccessor2.invoke(Unknown Source)
(41 more lines...)
Collapse Failed RemoteKeyValueTest test History
Distro Tests - MapR 5.2 MEP 1.1 2 mins
java.lang.RuntimeException: java.io.IOException: 500: Exception occurred while handling request: KeeperErrorCode = ConnectionLoss for /hbase
	at io.cdap.cdap.client.util.RESTClient.execute(RESTClient.java:132)
	at io.cdap.cdap.client.util.RESTClient.execute(RESTClient.java:91)
	at io.cdap.cdap.remote.dataset.kvtable.RemoteKeyValueTable.doPost(RemoteKeyValueTable.java:170)
	at io.cdap.cdap.remote.dataset.kvtable.RemoteKeyValueTable.doPost(RemoteKeyValueTable.java:163)
	at io.cdap.cdap.remote.dataset.kvtable.RemoteKeyValueTable.read(RemoteKeyValueTable.java:77)
	at io.cdap.cdap.remote.dataset.test.RemoteKeyValueTest.test(RemoteKeyValueTest.java:40)
Collapse Failed RemoteTableTest test History
Distro Tests - MapR 5.1 2 mins
java.util.concurrent.TimeoutException: Timeout occurred. Expected STOPPED but found RUNNING.
	at io.cdap.cdap.common.utils.Tasks.waitFor(Tasks.java:70)
	at io.cdap.cdap.common.utils.Tasks.waitFor(Tasks.java:91)
	at io.cdap.cdap.client.ProgramClient.waitForStatus(ProgramClient.java:347)
	at io.cdap.cdap.client.ProgramClient.stopAll(ProgramClient.java:278)
	at io.cdap.cdap.test.IntegrationTestBase.doClear(IntegrationTestBase.java:390)
	at io.cdap.cdap.test.IntegrationTestBase.setUp(IntegrationTestBase.java:107)
	at sun.reflect.GeneratedMethodAccessor2.invoke(Unknown Source)
(41 more lines...)
Collapse Failed RemoteTableTest test History
Distro Tests - MapR 5.2 MEP 1.1 2 mins
java.util.concurrent.TimeoutException: Timeout occurred. Expected STOPPED but found RUNNING.
	at io.cdap.cdap.common.utils.Tasks.waitFor(Tasks.java:70)
	at io.cdap.cdap.common.utils.Tasks.waitFor(Tasks.java:91)
	at io.cdap.cdap.client.ProgramClient.waitForStatus(ProgramClient.java:347)
	at io.cdap.cdap.client.ProgramClient.stopAll(ProgramClient.java:278)
	at io.cdap.cdap.test.IntegrationTestBase.doClear(IntegrationTestBase.java:390)
	at io.cdap.cdap.test.IntegrationTestBase.setUp(IntegrationTestBase.java:107)
	at sun.reflect.GeneratedMethodAccessor2.invoke(Unknown Source)
(41 more lines...)
Existing test failures 3
Status Test Failing since View job Duration
java.util.concurrent.TimeoutException: Timeout occurred. Expected STOPPED but found RUNNING.
	at io.cdap.cdap.common.utils.Tasks.waitFor(Tasks.java:70)
	at io.cdap.cdap.common.utils.Tasks.waitFor(Tasks.java:91)
	at io.cdap.cdap.client.ProgramClient.waitForStatus(ProgramClient.java:347)
	at io.cdap.cdap.client.ProgramClient.stopAll(ProgramClient.java:278)
	at io.cdap.cdap.test.IntegrationTestBase.doClear(IntegrationTestBase.java:390)
	at io.cdap.cdap.test.IntegrationTestBase.setUp(IntegrationTestBase.java:107)
	at sun.reflect.GeneratedMethodAccessor2.invoke(Unknown Source)
(41 more lines...)
java.io.IOException: 500: Exception occurred while handling request: Timeout waiting for task.
	at io.cdap.cdap.client.util.RESTClient.execute(RESTClient.java:132)
	at io.cdap.cdap.client.util.RESTClient.execute(RESTClient.java:69)
	at io.cdap.cdap.apps.fileset.PartitionCorrectorTest.test(PartitionCorrectorTest.java:56)
java.io.IOException: 500: Exception occurred while handling request: KeeperErrorCode = ConnectionLoss for /hbase
	at io.cdap.cdap.client.util.RESTClient.execute(RESTClient.java:132)
	at io.cdap.cdap.client.util.RESTClient.execute(RESTClient.java:69)
	at io.cdap.cdap.apps.fileset.PartitionCorrectorTest.test(PartitionCorrectorTest.java:56)

JIRA issues

IssueDescriptionStatus
Unknown Issue TypeCDAP-15879Could not obtain issue details from JIRA