Build #314

Build: #314 failed Scheduled with changes by albertshau <ashau@google.com>

Build result summary

Details

Completed
Duration
535 minutes
Labels
None
Revision
0ff7d962a4c4f954a2f17dbc4feb2a2277d137d1 0ff7d962a4c4f954a2f17dbc4feb2a2277d137d1
Total tests
722

Responsible

No one has taken responsibility for this failure

Code commits

Author Commit Message Commit date
albertshau <ashau@google.com> albertshau <ashau@google.com> 0ff7d962a4c4f954a2f17dbc4feb2a2277d137d1 0ff7d962a4c4f954a2f17dbc4feb2a2277d137d1 Merge pull request #1030 from cdapio/set-dataproc-network
Add ability to configure the network used for tests
albertshau <ashau@google.com> albertshau <ashau@google.com> 6ce027035f91712b6672c9c5402f9562304e5c30 6ce027035f91712b6672c9c5402f9562304e5c30 Add ability to configure the network used for tests

Tests

New test failures 654
Status Test View job Duration
Collapse Failed KVTableWithProjectionTest testKVTableWithProjection History
Distro Tests - CDH 5.10 10 mins
java.util.concurrent.TimeoutException: Unable to connect to Authentication service to obtain access token, Connection info : CLIConnectionConfig{hostname=10.210.0.10, port=11015, sslEnabled=false}
	at io.cdap.cdap.test.IntegrationTestBase.checkServicesWithRetry(IntegrationTestBase.java:265)
	at io.cdap.cdap.test.IntegrationTestBase.fetchAccessToken(IntegrationTestBase.java:233)
	at io.cdap.cdap.test.IntegrationTestBase.fetchAccessToken(IntegrationTestBase.java:218)
	at io.cdap.cdap.test.IntegrationTestBase.checkSystemServices(IntegrationTestBase.java:196)
	at io.cdap.cdap.test.IntegrationTestBase.setUp(IntegrationTestBase.java:97)
	at sun.reflect.GeneratedMethodAccessor1.invoke(Unknown Source)
	at sun.reflect.DelegatingMethodAccessorImpl.invoke(DelegatingMethodAccessorImpl.java:43)
(32 more lines...)
Collapse Failed KVTableWithProjectionTest testKVTableWithProjection History
Distro Tests - CDH 5.11 10 mins
java.util.concurrent.TimeoutException: Unable to connect to Authentication service to obtain access token, Connection info : CLIConnectionConfig{hostname=10.210.0.58, port=11015, sslEnabled=false}
	at io.cdap.cdap.test.IntegrationTestBase.checkServicesWithRetry(IntegrationTestBase.java:265)
	at io.cdap.cdap.test.IntegrationTestBase.fetchAccessToken(IntegrationTestBase.java:233)
	at io.cdap.cdap.test.IntegrationTestBase.fetchAccessToken(IntegrationTestBase.java:218)
	at io.cdap.cdap.test.IntegrationTestBase.checkSystemServices(IntegrationTestBase.java:196)
	at io.cdap.cdap.test.IntegrationTestBase.setUp(IntegrationTestBase.java:97)
	at sun.reflect.GeneratedMethodAccessor1.invoke(Unknown Source)
	at sun.reflect.DelegatingMethodAccessorImpl.invoke(DelegatingMethodAccessorImpl.java:43)
(32 more lines...)
Collapse Failed KVTableWithProjectionTest initializationError History
Distro Tests - CDH 5.12 < 1 sec
java.lang.SecurityException: Invalid signature file digest for Manifest main attributes
	at sun.security.util.SignatureFileVerifier.processImpl(SignatureFileVerifier.java:284)
	at sun.security.util.SignatureFileVerifier.process(SignatureFileVerifier.java:238)
	at java.util.jar.JarVerifier.processEntry(JarVerifier.java:316)
	at java.util.jar.JarVerifier.update(JarVerifier.java:228)
	at java.util.jar.JarFile.initializeVerifier(JarFile.java:383)
	at java.util.jar.JarFile.getInputStream(JarFile.java:450)
	at sun.misc.URLClassPath$JarLoader$2.getInputStream(URLClassPath.java:940)
(42 more lines...)
Collapse Failed KVTableWithProjectionTest testKVTableWithProjection History
Distro Tests - CDH 5.13 10 mins
java.util.concurrent.TimeoutException: Unable to connect to Authentication service to obtain access token, Connection info : CLIConnectionConfig{hostname=10.210.0.166, port=11015, sslEnabled=false}
	at io.cdap.cdap.test.IntegrationTestBase.checkServicesWithRetry(IntegrationTestBase.java:265)
	at io.cdap.cdap.test.IntegrationTestBase.fetchAccessToken(IntegrationTestBase.java:233)
	at io.cdap.cdap.test.IntegrationTestBase.fetchAccessToken(IntegrationTestBase.java:218)
	at io.cdap.cdap.test.IntegrationTestBase.checkSystemServices(IntegrationTestBase.java:196)
	at io.cdap.cdap.test.IntegrationTestBase.setUp(IntegrationTestBase.java:97)
	at sun.reflect.GeneratedMethodAccessor1.invoke(Unknown Source)
	at sun.reflect.DelegatingMethodAccessorImpl.invoke(DelegatingMethodAccessorImpl.java:43)
(32 more lines...)
Collapse Failed KVTableWithProjectionTest testKVTableWithProjection History
Distro Tests - CDH 5.4 10 mins
java.util.concurrent.TimeoutException: Unable to connect to Authentication service to obtain access token, Connection info : CLIConnectionConfig{hostname=10.210.0.169, port=11015, sslEnabled=false}
	at io.cdap.cdap.test.IntegrationTestBase.checkServicesWithRetry(IntegrationTestBase.java:265)
	at io.cdap.cdap.test.IntegrationTestBase.fetchAccessToken(IntegrationTestBase.java:233)
	at io.cdap.cdap.test.IntegrationTestBase.fetchAccessToken(IntegrationTestBase.java:218)
	at io.cdap.cdap.test.IntegrationTestBase.checkSystemServices(IntegrationTestBase.java:196)
	at io.cdap.cdap.test.IntegrationTestBase.setUp(IntegrationTestBase.java:97)
	at sun.reflect.GeneratedMethodAccessor1.invoke(Unknown Source)
	at sun.reflect.DelegatingMethodAccessorImpl.invoke(DelegatingMethodAccessorImpl.java:43)
(40 more lines...)
Collapse Failed KVTableWithProjectionTest testKVTableWithProjection History
Distro Tests - CDH 5.5 10 mins
java.util.concurrent.TimeoutException: Unable to connect to Authentication service to obtain access token, Connection info : CLIConnectionConfig{hostname=10.210.0.163, port=11015, sslEnabled=false}
	at io.cdap.cdap.test.IntegrationTestBase.checkServicesWithRetry(IntegrationTestBase.java:265)
	at io.cdap.cdap.test.IntegrationTestBase.fetchAccessToken(IntegrationTestBase.java:233)
	at io.cdap.cdap.test.IntegrationTestBase.fetchAccessToken(IntegrationTestBase.java:218)
	at io.cdap.cdap.test.IntegrationTestBase.checkSystemServices(IntegrationTestBase.java:196)
	at io.cdap.cdap.test.IntegrationTestBase.setUp(IntegrationTestBase.java:97)
	at sun.reflect.GeneratedMethodAccessor1.invoke(Unknown Source)
	at sun.reflect.DelegatingMethodAccessorImpl.invoke(DelegatingMethodAccessorImpl.java:43)
(40 more lines...)
Collapse Failed KVTableWithProjectionTest testKVTableWithProjection History
Distro Tests - CDH 5.6 10 mins
java.util.concurrent.TimeoutException: Unable to connect to Authentication service to obtain access token, Connection info : CLIConnectionConfig{hostname=10.210.0.16, port=11015, sslEnabled=false}
	at io.cdap.cdap.test.IntegrationTestBase.checkServicesWithRetry(IntegrationTestBase.java:265)
	at io.cdap.cdap.test.IntegrationTestBase.fetchAccessToken(IntegrationTestBase.java:233)
	at io.cdap.cdap.test.IntegrationTestBase.fetchAccessToken(IntegrationTestBase.java:218)
	at io.cdap.cdap.test.IntegrationTestBase.checkSystemServices(IntegrationTestBase.java:196)
	at io.cdap.cdap.test.IntegrationTestBase.setUp(IntegrationTestBase.java:97)
	at sun.reflect.GeneratedMethodAccessor1.invoke(Unknown Source)
	at sun.reflect.DelegatingMethodAccessorImpl.invoke(DelegatingMethodAccessorImpl.java:43)
(40 more lines...)
Collapse Failed KVTableWithProjectionTest testKVTableWithProjection History
Distro Tests - CDH 5.7 10 mins
java.util.concurrent.TimeoutException: Unable to connect to Authentication service to obtain access token, Connection info : CLIConnectionConfig{hostname=10.210.0.160, port=11015, sslEnabled=false}
	at io.cdap.cdap.test.IntegrationTestBase.checkServicesWithRetry(IntegrationTestBase.java:265)
	at io.cdap.cdap.test.IntegrationTestBase.fetchAccessToken(IntegrationTestBase.java:233)
	at io.cdap.cdap.test.IntegrationTestBase.fetchAccessToken(IntegrationTestBase.java:218)
	at io.cdap.cdap.test.IntegrationTestBase.checkSystemServices(IntegrationTestBase.java:196)
	at io.cdap.cdap.test.IntegrationTestBase.setUp(IntegrationTestBase.java:97)
	at sun.reflect.GeneratedMethodAccessor1.invoke(Unknown Source)
	at sun.reflect.DelegatingMethodAccessorImpl.invoke(DelegatingMethodAccessorImpl.java:43)
(32 more lines...)
Collapse Failed KVTableWithProjectionTest testKVTableWithProjection History
Distro Tests - CDH 5.8 10 mins
java.util.concurrent.TimeoutException: Unable to connect to Authentication service to obtain access token, Connection info : CLIConnectionConfig{hostname=10.210.0.167, port=11015, sslEnabled=false}
	at io.cdap.cdap.test.IntegrationTestBase.checkServicesWithRetry(IntegrationTestBase.java:265)
	at io.cdap.cdap.test.IntegrationTestBase.fetchAccessToken(IntegrationTestBase.java:233)
	at io.cdap.cdap.test.IntegrationTestBase.fetchAccessToken(IntegrationTestBase.java:218)
	at io.cdap.cdap.test.IntegrationTestBase.checkSystemServices(IntegrationTestBase.java:196)
	at io.cdap.cdap.test.IntegrationTestBase.setUp(IntegrationTestBase.java:97)
	at sun.reflect.GeneratedMethodAccessor1.invoke(Unknown Source)
	at sun.reflect.DelegatingMethodAccessorImpl.invoke(DelegatingMethodAccessorImpl.java:43)
(32 more lines...)
Collapse Failed KVTableWithProjectionTest testKVTableWithProjection History
Distro Tests - CDH 5.9 10 mins
java.util.concurrent.TimeoutException: Unable to connect to Authentication service to obtain access token, Connection info : CLIConnectionConfig{hostname=10.210.0.156, port=11015, sslEnabled=false}
	at io.cdap.cdap.test.IntegrationTestBase.checkServicesWithRetry(IntegrationTestBase.java:265)
	at io.cdap.cdap.test.IntegrationTestBase.fetchAccessToken(IntegrationTestBase.java:233)
	at io.cdap.cdap.test.IntegrationTestBase.fetchAccessToken(IntegrationTestBase.java:218)
	at io.cdap.cdap.test.IntegrationTestBase.checkSystemServices(IntegrationTestBase.java:196)
	at io.cdap.cdap.test.IntegrationTestBase.setUp(IntegrationTestBase.java:97)
	at sun.reflect.GeneratedMethodAccessor1.invoke(Unknown Source)
	at sun.reflect.DelegatingMethodAccessorImpl.invoke(DelegatingMethodAccessorImpl.java:43)
(32 more lines...)
Collapse Failed KVTableWithProjectionTest testKVTableWithProjection History
Distro Tests - HDP 2.3 10 mins
java.util.concurrent.TimeoutException: Unable to connect to Authentication service to obtain access token, Connection info : CLIConnectionConfig{hostname=10.210.0.45, port=11015, sslEnabled=false}
	at io.cdap.cdap.test.IntegrationTestBase.checkServicesWithRetry(IntegrationTestBase.java:265)
	at io.cdap.cdap.test.IntegrationTestBase.fetchAccessToken(IntegrationTestBase.java:233)
	at io.cdap.cdap.test.IntegrationTestBase.fetchAccessToken(IntegrationTestBase.java:218)
	at io.cdap.cdap.test.IntegrationTestBase.checkSystemServices(IntegrationTestBase.java:196)
	at io.cdap.cdap.test.IntegrationTestBase.setUp(IntegrationTestBase.java:97)
	at sun.reflect.GeneratedMethodAccessor1.invoke(Unknown Source)
	at sun.reflect.DelegatingMethodAccessorImpl.invoke(DelegatingMethodAccessorImpl.java:43)
(40 more lines...)
Collapse Failed KVTableWithProjectionTest initializationError History
Distro Tests - HDP 2.4 < 1 sec
java.lang.SecurityException: Invalid signature file digest for Manifest main attributes
	at sun.security.util.SignatureFileVerifier.processImpl(SignatureFileVerifier.java:284)
	at sun.security.util.SignatureFileVerifier.process(SignatureFileVerifier.java:238)
	at java.util.jar.JarVerifier.processEntry(JarVerifier.java:316)
	at java.util.jar.JarVerifier.update(JarVerifier.java:228)
	at java.util.jar.JarFile.initializeVerifier(JarFile.java:383)
	at java.util.jar.JarFile.getInputStream(JarFile.java:450)
	at sun.misc.URLClassPath$JarLoader$2.getInputStream(URLClassPath.java:940)
(42 more lines...)
Collapse Failed KVTableWithProjectionTest initializationError History
Distro Tests - HDP 2.5 < 1 sec
java.lang.SecurityException: Invalid signature file digest for Manifest main attributes
	at sun.security.util.SignatureFileVerifier.processImpl(SignatureFileVerifier.java:284)
	at sun.security.util.SignatureFileVerifier.process(SignatureFileVerifier.java:238)
	at java.util.jar.JarVerifier.processEntry(JarVerifier.java:316)
	at java.util.jar.JarVerifier.update(JarVerifier.java:228)
	at java.util.jar.JarFile.initializeVerifier(JarFile.java:383)
	at java.util.jar.JarFile.getInputStream(JarFile.java:450)
	at sun.misc.URLClassPath$JarLoader$2.getInputStream(URLClassPath.java:940)
(42 more lines...)
Collapse Failed KVTableWithProjectionTest initializationError History
Distro Tests - HDP 2.6 < 1 sec
java.lang.SecurityException: Invalid signature file digest for Manifest main attributes
	at sun.security.util.SignatureFileVerifier.processImpl(SignatureFileVerifier.java:284)
	at sun.security.util.SignatureFileVerifier.process(SignatureFileVerifier.java:238)
	at java.util.jar.JarVerifier.processEntry(JarVerifier.java:316)
	at java.util.jar.JarVerifier.update(JarVerifier.java:228)
	at java.util.jar.JarFile.initializeVerifier(JarFile.java:383)
	at java.util.jar.JarFile.getInputStream(JarFile.java:450)
	at sun.misc.URLClassPath$JarLoader$2.getInputStream(URLClassPath.java:940)
(42 more lines...)
Collapse Failed KVTableWithProjectionTest initializationError History
Distro Tests - MapR 5.1 < 1 sec
java.lang.SecurityException: Invalid signature file digest for Manifest main attributes
	at sun.security.util.SignatureFileVerifier.processImpl(SignatureFileVerifier.java:284)
	at sun.security.util.SignatureFileVerifier.process(SignatureFileVerifier.java:238)
	at java.util.jar.JarVerifier.processEntry(JarVerifier.java:316)
	at java.util.jar.JarVerifier.update(JarVerifier.java:228)
	at java.util.jar.JarFile.initializeVerifier(JarFile.java:383)
	at java.util.jar.JarFile.getInputStream(JarFile.java:450)
	at sun.misc.URLClassPath$JarLoader$2.getInputStream(URLClassPath.java:940)
(56 more lines...)
Collapse Failed KVTableWithProjectionTest testKVTableWithProjection History
Distro Tests - MapR 5.2 MEP 1.1 10 mins
java.util.concurrent.TimeoutException: Unable to connect to Authentication service to obtain access token, Connection info : CLIConnectionConfig{hostname=10.210.0.165, port=11015, sslEnabled=false}
	at io.cdap.cdap.test.IntegrationTestBase.checkServicesWithRetry(IntegrationTestBase.java:265)
	at io.cdap.cdap.test.IntegrationTestBase.fetchAccessToken(IntegrationTestBase.java:233)
	at io.cdap.cdap.test.IntegrationTestBase.fetchAccessToken(IntegrationTestBase.java:218)
	at io.cdap.cdap.test.IntegrationTestBase.checkSystemServices(IntegrationTestBase.java:196)
	at io.cdap.cdap.test.IntegrationTestBase.setUp(IntegrationTestBase.java:97)
	at sun.reflect.NativeMethodAccessorImpl.invoke0(Native Method)
	at sun.reflect.NativeMethodAccessorImpl.invoke(NativeMethodAccessorImpl.java:62)
(41 more lines...)
Collapse Failed TPFSAvroSinkSourceTest testTPFSWithProjection History
Distro Tests - CDH 5.10 10 mins
java.util.concurrent.TimeoutException: Unable to connect to Authentication service to obtain access token, Connection info : CLIConnectionConfig{hostname=10.210.0.10, port=11015, sslEnabled=false}
	at io.cdap.cdap.test.IntegrationTestBase.checkServicesWithRetry(IntegrationTestBase.java:265)
	at io.cdap.cdap.test.IntegrationTestBase.fetchAccessToken(IntegrationTestBase.java:233)
	at io.cdap.cdap.test.IntegrationTestBase.fetchAccessToken(IntegrationTestBase.java:218)
	at io.cdap.cdap.test.IntegrationTestBase.checkSystemServices(IntegrationTestBase.java:196)
	at io.cdap.cdap.test.IntegrationTestBase.setUp(IntegrationTestBase.java:97)
	at sun.reflect.GeneratedMethodAccessor1.invoke(Unknown Source)
	at sun.reflect.DelegatingMethodAccessorImpl.invoke(DelegatingMethodAccessorImpl.java:43)
(32 more lines...)
Collapse Failed TPFSAvroSinkSourceTest testTPFSWithProjection History
Distro Tests - CDH 5.11 10 mins
java.util.concurrent.TimeoutException: Unable to connect to Authentication service to obtain access token, Connection info : CLIConnectionConfig{hostname=10.210.0.58, port=11015, sslEnabled=false}
	at io.cdap.cdap.test.IntegrationTestBase.checkServicesWithRetry(IntegrationTestBase.java:265)
	at io.cdap.cdap.test.IntegrationTestBase.fetchAccessToken(IntegrationTestBase.java:233)
	at io.cdap.cdap.test.IntegrationTestBase.fetchAccessToken(IntegrationTestBase.java:218)
	at io.cdap.cdap.test.IntegrationTestBase.checkSystemServices(IntegrationTestBase.java:196)
	at io.cdap.cdap.test.IntegrationTestBase.setUp(IntegrationTestBase.java:97)
	at sun.reflect.GeneratedMethodAccessor1.invoke(Unknown Source)
	at sun.reflect.DelegatingMethodAccessorImpl.invoke(DelegatingMethodAccessorImpl.java:43)
(32 more lines...)
Collapse Failed TPFSAvroSinkSourceTest initializationError History
Distro Tests - CDH 5.12 < 1 sec
java.lang.SecurityException: Invalid signature file digest for Manifest main attributes
	at sun.security.util.SignatureFileVerifier.processImpl(SignatureFileVerifier.java:284)
	at sun.security.util.SignatureFileVerifier.process(SignatureFileVerifier.java:238)
	at java.util.jar.JarVerifier.processEntry(JarVerifier.java:316)
	at java.util.jar.JarVerifier.update(JarVerifier.java:228)
	at java.util.jar.JarFile.initializeVerifier(JarFile.java:383)
	at java.util.jar.JarFile.getInputStream(JarFile.java:450)
	at sun.misc.URLClassPath$JarLoader$2.getInputStream(URLClassPath.java:940)
(42 more lines...)
Collapse Failed TPFSAvroSinkSourceTest testTPFSWithProjection History
Distro Tests - CDH 5.13 10 mins
java.util.concurrent.TimeoutException: Unable to connect to Authentication service to obtain access token, Connection info : CLIConnectionConfig{hostname=10.210.0.166, port=11015, sslEnabled=false}
	at io.cdap.cdap.test.IntegrationTestBase.checkServicesWithRetry(IntegrationTestBase.java:265)
	at io.cdap.cdap.test.IntegrationTestBase.fetchAccessToken(IntegrationTestBase.java:233)
	at io.cdap.cdap.test.IntegrationTestBase.fetchAccessToken(IntegrationTestBase.java:218)
	at io.cdap.cdap.test.IntegrationTestBase.checkSystemServices(IntegrationTestBase.java:196)
	at io.cdap.cdap.test.IntegrationTestBase.setUp(IntegrationTestBase.java:97)
	at sun.reflect.GeneratedMethodAccessor1.invoke(Unknown Source)
	at sun.reflect.DelegatingMethodAccessorImpl.invoke(DelegatingMethodAccessorImpl.java:43)
(32 more lines...)
Collapse Failed TPFSAvroSinkSourceTest testTPFSWithProjection History
Distro Tests - CDH 5.4 10 mins
java.util.concurrent.TimeoutException: Unable to connect to Authentication service to obtain access token, Connection info : CLIConnectionConfig{hostname=10.210.0.169, port=11015, sslEnabled=false}
	at io.cdap.cdap.test.IntegrationTestBase.checkServicesWithRetry(IntegrationTestBase.java:265)
	at io.cdap.cdap.test.IntegrationTestBase.fetchAccessToken(IntegrationTestBase.java:233)
	at io.cdap.cdap.test.IntegrationTestBase.fetchAccessToken(IntegrationTestBase.java:218)
	at io.cdap.cdap.test.IntegrationTestBase.checkSystemServices(IntegrationTestBase.java:196)
	at io.cdap.cdap.test.IntegrationTestBase.setUp(IntegrationTestBase.java:97)
	at sun.reflect.GeneratedMethodAccessor1.invoke(Unknown Source)
	at sun.reflect.DelegatingMethodAccessorImpl.invoke(DelegatingMethodAccessorImpl.java:43)
(40 more lines...)
Collapse Failed TPFSAvroSinkSourceTest testTPFSWithProjection History
Distro Tests - CDH 5.5 10 mins
java.util.concurrent.TimeoutException: Unable to connect to Authentication service to obtain access token, Connection info : CLIConnectionConfig{hostname=10.210.0.163, port=11015, sslEnabled=false}
	at io.cdap.cdap.test.IntegrationTestBase.checkServicesWithRetry(IntegrationTestBase.java:265)
	at io.cdap.cdap.test.IntegrationTestBase.fetchAccessToken(IntegrationTestBase.java:233)
	at io.cdap.cdap.test.IntegrationTestBase.fetchAccessToken(IntegrationTestBase.java:218)
	at io.cdap.cdap.test.IntegrationTestBase.checkSystemServices(IntegrationTestBase.java:196)
	at io.cdap.cdap.test.IntegrationTestBase.setUp(IntegrationTestBase.java:97)
	at sun.reflect.GeneratedMethodAccessor1.invoke(Unknown Source)
	at sun.reflect.DelegatingMethodAccessorImpl.invoke(DelegatingMethodAccessorImpl.java:43)
(40 more lines...)
Collapse Failed TPFSAvroSinkSourceTest testTPFSWithProjection History
Distro Tests - CDH 5.6 10 mins
java.util.concurrent.TimeoutException: Unable to connect to Authentication service to obtain access token, Connection info : CLIConnectionConfig{hostname=10.210.0.16, port=11015, sslEnabled=false}
	at io.cdap.cdap.test.IntegrationTestBase.checkServicesWithRetry(IntegrationTestBase.java:265)
	at io.cdap.cdap.test.IntegrationTestBase.fetchAccessToken(IntegrationTestBase.java:233)
	at io.cdap.cdap.test.IntegrationTestBase.fetchAccessToken(IntegrationTestBase.java:218)
	at io.cdap.cdap.test.IntegrationTestBase.checkSystemServices(IntegrationTestBase.java:196)
	at io.cdap.cdap.test.IntegrationTestBase.setUp(IntegrationTestBase.java:97)
	at sun.reflect.GeneratedMethodAccessor1.invoke(Unknown Source)
	at sun.reflect.DelegatingMethodAccessorImpl.invoke(DelegatingMethodAccessorImpl.java:43)
(40 more lines...)
Collapse Failed TPFSAvroSinkSourceTest testTPFSWithProjection History
Distro Tests - CDH 5.7 10 mins
java.util.concurrent.TimeoutException: Unable to connect to Authentication service to obtain access token, Connection info : CLIConnectionConfig{hostname=10.210.0.160, port=11015, sslEnabled=false}
	at io.cdap.cdap.test.IntegrationTestBase.checkServicesWithRetry(IntegrationTestBase.java:265)
	at io.cdap.cdap.test.IntegrationTestBase.fetchAccessToken(IntegrationTestBase.java:233)
	at io.cdap.cdap.test.IntegrationTestBase.fetchAccessToken(IntegrationTestBase.java:218)
	at io.cdap.cdap.test.IntegrationTestBase.checkSystemServices(IntegrationTestBase.java:196)
	at io.cdap.cdap.test.IntegrationTestBase.setUp(IntegrationTestBase.java:97)
	at sun.reflect.GeneratedMethodAccessor1.invoke(Unknown Source)
	at sun.reflect.DelegatingMethodAccessorImpl.invoke(DelegatingMethodAccessorImpl.java:43)
(32 more lines...)
Collapse Failed TPFSAvroSinkSourceTest testTPFSWithProjection History
Distro Tests - CDH 5.8 10 mins
java.util.concurrent.TimeoutException: Unable to connect to Authentication service to obtain access token, Connection info : CLIConnectionConfig{hostname=10.210.0.167, port=11015, sslEnabled=false}
	at io.cdap.cdap.test.IntegrationTestBase.checkServicesWithRetry(IntegrationTestBase.java:265)
	at io.cdap.cdap.test.IntegrationTestBase.fetchAccessToken(IntegrationTestBase.java:233)
	at io.cdap.cdap.test.IntegrationTestBase.fetchAccessToken(IntegrationTestBase.java:218)
	at io.cdap.cdap.test.IntegrationTestBase.checkSystemServices(IntegrationTestBase.java:196)
	at io.cdap.cdap.test.IntegrationTestBase.setUp(IntegrationTestBase.java:97)
	at sun.reflect.GeneratedMethodAccessor1.invoke(Unknown Source)
	at sun.reflect.DelegatingMethodAccessorImpl.invoke(DelegatingMethodAccessorImpl.java:43)
(32 more lines...)
Collapse Failed TPFSAvroSinkSourceTest testTPFSWithProjection History
Distro Tests - CDH 5.9 10 mins
java.util.concurrent.TimeoutException: Unable to connect to Authentication service to obtain access token, Connection info : CLIConnectionConfig{hostname=10.210.0.156, port=11015, sslEnabled=false}
	at io.cdap.cdap.test.IntegrationTestBase.checkServicesWithRetry(IntegrationTestBase.java:265)
	at io.cdap.cdap.test.IntegrationTestBase.fetchAccessToken(IntegrationTestBase.java:233)
	at io.cdap.cdap.test.IntegrationTestBase.fetchAccessToken(IntegrationTestBase.java:218)
	at io.cdap.cdap.test.IntegrationTestBase.checkSystemServices(IntegrationTestBase.java:196)
	at io.cdap.cdap.test.IntegrationTestBase.setUp(IntegrationTestBase.java:97)
	at sun.reflect.GeneratedMethodAccessor1.invoke(Unknown Source)
	at sun.reflect.DelegatingMethodAccessorImpl.invoke(DelegatingMethodAccessorImpl.java:43)
(32 more lines...)
Collapse Failed TPFSAvroSinkSourceTest testTPFSWithProjection History
Distro Tests - HDP 2.3 10 mins
java.util.concurrent.TimeoutException: Unable to connect to Authentication service to obtain access token, Connection info : CLIConnectionConfig{hostname=10.210.0.45, port=11015, sslEnabled=false}
	at io.cdap.cdap.test.IntegrationTestBase.checkServicesWithRetry(IntegrationTestBase.java:265)
	at io.cdap.cdap.test.IntegrationTestBase.fetchAccessToken(IntegrationTestBase.java:233)
	at io.cdap.cdap.test.IntegrationTestBase.fetchAccessToken(IntegrationTestBase.java:218)
	at io.cdap.cdap.test.IntegrationTestBase.checkSystemServices(IntegrationTestBase.java:196)
	at io.cdap.cdap.test.IntegrationTestBase.setUp(IntegrationTestBase.java:97)
	at sun.reflect.GeneratedMethodAccessor1.invoke(Unknown Source)
	at sun.reflect.DelegatingMethodAccessorImpl.invoke(DelegatingMethodAccessorImpl.java:43)
(40 more lines...)
Collapse Failed TPFSAvroSinkSourceTest initializationError History
Distro Tests - HDP 2.4 < 1 sec
java.lang.SecurityException: Invalid signature file digest for Manifest main attributes
	at sun.security.util.SignatureFileVerifier.processImpl(SignatureFileVerifier.java:284)
	at sun.security.util.SignatureFileVerifier.process(SignatureFileVerifier.java:238)
	at java.util.jar.JarVerifier.processEntry(JarVerifier.java:316)
	at java.util.jar.JarVerifier.update(JarVerifier.java:228)
	at java.util.jar.JarFile.initializeVerifier(JarFile.java:383)
	at java.util.jar.JarFile.getInputStream(JarFile.java:450)
	at sun.misc.URLClassPath$JarLoader$2.getInputStream(URLClassPath.java:940)
(42 more lines...)
Collapse Failed TPFSAvroSinkSourceTest initializationError History
Distro Tests - HDP 2.5 < 1 sec
java.lang.SecurityException: Invalid signature file digest for Manifest main attributes
	at sun.security.util.SignatureFileVerifier.processImpl(SignatureFileVerifier.java:284)
	at sun.security.util.SignatureFileVerifier.process(SignatureFileVerifier.java:238)
	at java.util.jar.JarVerifier.processEntry(JarVerifier.java:316)
	at java.util.jar.JarVerifier.update(JarVerifier.java:228)
	at java.util.jar.JarFile.initializeVerifier(JarFile.java:383)
	at java.util.jar.JarFile.getInputStream(JarFile.java:450)
	at sun.misc.URLClassPath$JarLoader$2.getInputStream(URLClassPath.java:940)
(42 more lines...)
Collapse Failed TPFSAvroSinkSourceTest initializationError History
Distro Tests - HDP 2.6 < 1 sec
java.lang.SecurityException: Invalid signature file digest for Manifest main attributes
	at sun.security.util.SignatureFileVerifier.processImpl(SignatureFileVerifier.java:284)
	at sun.security.util.SignatureFileVerifier.process(SignatureFileVerifier.java:238)
	at java.util.jar.JarVerifier.processEntry(JarVerifier.java:316)
	at java.util.jar.JarVerifier.update(JarVerifier.java:228)
	at java.util.jar.JarFile.initializeVerifier(JarFile.java:383)
	at java.util.jar.JarFile.getInputStream(JarFile.java:450)
	at sun.misc.URLClassPath$JarLoader$2.getInputStream(URLClassPath.java:940)
(42 more lines...)
Collapse Failed TPFSAvroSinkSourceTest initializationError History
Distro Tests - MapR 5.1 < 1 sec
java.lang.SecurityException: Invalid signature file digest for Manifest main attributes
	at sun.security.util.SignatureFileVerifier.processImpl(SignatureFileVerifier.java:284)
	at sun.security.util.SignatureFileVerifier.process(SignatureFileVerifier.java:238)
	at java.util.jar.JarVerifier.processEntry(JarVerifier.java:316)
	at java.util.jar.JarVerifier.update(JarVerifier.java:228)
	at java.util.jar.JarFile.initializeVerifier(JarFile.java:383)
	at java.util.jar.JarFile.getInputStream(JarFile.java:450)
	at sun.misc.URLClassPath$JarLoader$2.getInputStream(URLClassPath.java:940)
(56 more lines...)
Collapse Failed TPFSAvroSinkSourceTest testTPFSWithProjection History
Distro Tests - MapR 5.2 MEP 1.1 10 mins
java.util.concurrent.TimeoutException: Unable to connect to Authentication service to obtain access token, Connection info : CLIConnectionConfig{hostname=10.210.0.165, port=11015, sslEnabled=false}
	at io.cdap.cdap.test.IntegrationTestBase.checkServicesWithRetry(IntegrationTestBase.java:265)
	at io.cdap.cdap.test.IntegrationTestBase.fetchAccessToken(IntegrationTestBase.java:233)
	at io.cdap.cdap.test.IntegrationTestBase.fetchAccessToken(IntegrationTestBase.java:218)
	at io.cdap.cdap.test.IntegrationTestBase.checkSystemServices(IntegrationTestBase.java:196)
	at io.cdap.cdap.test.IntegrationTestBase.setUp(IntegrationTestBase.java:97)
	at sun.reflect.GeneratedMethodAccessor1.invoke(Unknown Source)
	at sun.reflect.DelegatingMethodAccessorImpl.invoke(DelegatingMethodAccessorImpl.java:43)
(40 more lines...)
Collapse Failed BatchAggregatorTest test History
Distro Tests - CDH 5.10 10 mins
java.util.concurrent.TimeoutException: Unable to connect to Authentication service to obtain access token, Connection info : CLIConnectionConfig{hostname=10.210.0.10, port=11015, sslEnabled=false}
	at io.cdap.cdap.test.IntegrationTestBase.checkServicesWithRetry(IntegrationTestBase.java:265)
	at io.cdap.cdap.test.IntegrationTestBase.fetchAccessToken(IntegrationTestBase.java:233)
	at io.cdap.cdap.test.IntegrationTestBase.fetchAccessToken(IntegrationTestBase.java:218)
	at io.cdap.cdap.test.IntegrationTestBase.checkSystemServices(IntegrationTestBase.java:196)
	at io.cdap.cdap.test.IntegrationTestBase.setUp(IntegrationTestBase.java:97)
	at sun.reflect.NativeMethodAccessorImpl.invoke0(Native Method)
	at sun.reflect.NativeMethodAccessorImpl.invoke(NativeMethodAccessorImpl.java:62)
(33 more lines...)
Collapse Failed BatchAggregatorTest test History
Distro Tests - CDH 5.11 10 mins
java.util.concurrent.TimeoutException: Unable to connect to Authentication service to obtain access token, Connection info : CLIConnectionConfig{hostname=10.210.0.58, port=11015, sslEnabled=false}
	at io.cdap.cdap.test.IntegrationTestBase.checkServicesWithRetry(IntegrationTestBase.java:265)
	at io.cdap.cdap.test.IntegrationTestBase.fetchAccessToken(IntegrationTestBase.java:233)
	at io.cdap.cdap.test.IntegrationTestBase.fetchAccessToken(IntegrationTestBase.java:218)
	at io.cdap.cdap.test.IntegrationTestBase.checkSystemServices(IntegrationTestBase.java:196)
	at io.cdap.cdap.test.IntegrationTestBase.setUp(IntegrationTestBase.java:97)
	at sun.reflect.NativeMethodAccessorImpl.invoke0(Native Method)
	at sun.reflect.NativeMethodAccessorImpl.invoke(NativeMethodAccessorImpl.java:62)
(33 more lines...)
Collapse Failed BatchAggregatorTest initializationError History
Distro Tests - CDH 5.12 < 1 sec
java.lang.SecurityException: Invalid signature file digest for Manifest main attributes
	at sun.security.util.SignatureFileVerifier.processImpl(SignatureFileVerifier.java:284)
	at sun.security.util.SignatureFileVerifier.process(SignatureFileVerifier.java:238)
	at java.util.jar.JarVerifier.processEntry(JarVerifier.java:316)
	at java.util.jar.JarVerifier.update(JarVerifier.java:228)
	at java.util.jar.JarFile.initializeVerifier(JarFile.java:383)
	at java.util.jar.JarFile.getInputStream(JarFile.java:450)
	at sun.misc.URLClassPath$JarLoader$2.getInputStream(URLClassPath.java:940)
(42 more lines...)
Collapse Failed BatchAggregatorTest test History
Distro Tests - CDH 5.13 10 mins
java.util.concurrent.TimeoutException: Unable to connect to Authentication service to obtain access token, Connection info : CLIConnectionConfig{hostname=10.210.0.166, port=11015, sslEnabled=false}
	at io.cdap.cdap.test.IntegrationTestBase.checkServicesWithRetry(IntegrationTestBase.java:265)
	at io.cdap.cdap.test.IntegrationTestBase.fetchAccessToken(IntegrationTestBase.java:233)
	at io.cdap.cdap.test.IntegrationTestBase.fetchAccessToken(IntegrationTestBase.java:218)
	at io.cdap.cdap.test.IntegrationTestBase.checkSystemServices(IntegrationTestBase.java:196)
	at io.cdap.cdap.test.IntegrationTestBase.setUp(IntegrationTestBase.java:97)
	at sun.reflect.NativeMethodAccessorImpl.invoke0(Native Method)
	at sun.reflect.NativeMethodAccessorImpl.invoke(NativeMethodAccessorImpl.java:62)
(33 more lines...)
Collapse Failed BatchAggregatorTest test History
Distro Tests - CDH 5.4 10 mins
java.util.concurrent.TimeoutException: Unable to connect to Authentication service to obtain access token, Connection info : CLIConnectionConfig{hostname=10.210.0.169, port=11015, sslEnabled=false}
	at io.cdap.cdap.test.IntegrationTestBase.checkServicesWithRetry(IntegrationTestBase.java:265)
	at io.cdap.cdap.test.IntegrationTestBase.fetchAccessToken(IntegrationTestBase.java:233)
	at io.cdap.cdap.test.IntegrationTestBase.fetchAccessToken(IntegrationTestBase.java:218)
	at io.cdap.cdap.test.IntegrationTestBase.checkSystemServices(IntegrationTestBase.java:196)
	at io.cdap.cdap.test.IntegrationTestBase.setUp(IntegrationTestBase.java:97)
	at sun.reflect.NativeMethodAccessorImpl.invoke0(Native Method)
	at sun.reflect.NativeMethodAccessorImpl.invoke(NativeMethodAccessorImpl.java:62)
(41 more lines...)
Collapse Failed BatchAggregatorTest test History
Distro Tests - CDH 5.5 10 mins
java.util.concurrent.TimeoutException: Unable to connect to Authentication service to obtain access token, Connection info : CLIConnectionConfig{hostname=10.210.0.163, port=11015, sslEnabled=false}
	at io.cdap.cdap.test.IntegrationTestBase.checkServicesWithRetry(IntegrationTestBase.java:265)
	at io.cdap.cdap.test.IntegrationTestBase.fetchAccessToken(IntegrationTestBase.java:233)
	at io.cdap.cdap.test.IntegrationTestBase.fetchAccessToken(IntegrationTestBase.java:218)
	at io.cdap.cdap.test.IntegrationTestBase.checkSystemServices(IntegrationTestBase.java:196)
	at io.cdap.cdap.test.IntegrationTestBase.setUp(IntegrationTestBase.java:97)
	at sun.reflect.NativeMethodAccessorImpl.invoke0(Native Method)
	at sun.reflect.NativeMethodAccessorImpl.invoke(NativeMethodAccessorImpl.java:62)
(41 more lines...)
Collapse Failed BatchAggregatorTest test History
Distro Tests - CDH 5.6 10 mins
java.util.concurrent.TimeoutException: Unable to connect to Authentication service to obtain access token, Connection info : CLIConnectionConfig{hostname=10.210.0.16, port=11015, sslEnabled=false}
	at io.cdap.cdap.test.IntegrationTestBase.checkServicesWithRetry(IntegrationTestBase.java:265)
	at io.cdap.cdap.test.IntegrationTestBase.fetchAccessToken(IntegrationTestBase.java:233)
	at io.cdap.cdap.test.IntegrationTestBase.fetchAccessToken(IntegrationTestBase.java:218)
	at io.cdap.cdap.test.IntegrationTestBase.checkSystemServices(IntegrationTestBase.java:196)
	at io.cdap.cdap.test.IntegrationTestBase.setUp(IntegrationTestBase.java:97)
	at sun.reflect.NativeMethodAccessorImpl.invoke0(Native Method)
	at sun.reflect.NativeMethodAccessorImpl.invoke(NativeMethodAccessorImpl.java:62)
(41 more lines...)
Collapse Failed BatchAggregatorTest test History
Distro Tests - CDH 5.7 10 mins
java.util.concurrent.TimeoutException: Unable to connect to Authentication service to obtain access token, Connection info : CLIConnectionConfig{hostname=10.210.0.160, port=11015, sslEnabled=false}
	at io.cdap.cdap.test.IntegrationTestBase.checkServicesWithRetry(IntegrationTestBase.java:265)
	at io.cdap.cdap.test.IntegrationTestBase.fetchAccessToken(IntegrationTestBase.java:233)
	at io.cdap.cdap.test.IntegrationTestBase.fetchAccessToken(IntegrationTestBase.java:218)
	at io.cdap.cdap.test.IntegrationTestBase.checkSystemServices(IntegrationTestBase.java:196)
	at io.cdap.cdap.test.IntegrationTestBase.setUp(IntegrationTestBase.java:97)
	at sun.reflect.NativeMethodAccessorImpl.invoke0(Native Method)
	at sun.reflect.NativeMethodAccessorImpl.invoke(NativeMethodAccessorImpl.java:62)
(33 more lines...)
Collapse Failed BatchAggregatorTest test History
Distro Tests - CDH 5.8 10 mins
java.util.concurrent.TimeoutException: Unable to connect to Authentication service to obtain access token, Connection info : CLIConnectionConfig{hostname=10.210.0.167, port=11015, sslEnabled=false}
	at io.cdap.cdap.test.IntegrationTestBase.checkServicesWithRetry(IntegrationTestBase.java:265)
	at io.cdap.cdap.test.IntegrationTestBase.fetchAccessToken(IntegrationTestBase.java:233)
	at io.cdap.cdap.test.IntegrationTestBase.fetchAccessToken(IntegrationTestBase.java:218)
	at io.cdap.cdap.test.IntegrationTestBase.checkSystemServices(IntegrationTestBase.java:196)
	at io.cdap.cdap.test.IntegrationTestBase.setUp(IntegrationTestBase.java:97)
	at sun.reflect.NativeMethodAccessorImpl.invoke0(Native Method)
	at sun.reflect.NativeMethodAccessorImpl.invoke(NativeMethodAccessorImpl.java:62)
(33 more lines...)
Collapse Failed BatchAggregatorTest test History
Distro Tests - CDH 5.9 10 mins
java.util.concurrent.TimeoutException: Unable to connect to Authentication service to obtain access token, Connection info : CLIConnectionConfig{hostname=10.210.0.156, port=11015, sslEnabled=false}
	at io.cdap.cdap.test.IntegrationTestBase.checkServicesWithRetry(IntegrationTestBase.java:265)
	at io.cdap.cdap.test.IntegrationTestBase.fetchAccessToken(IntegrationTestBase.java:233)
	at io.cdap.cdap.test.IntegrationTestBase.fetchAccessToken(IntegrationTestBase.java:218)
	at io.cdap.cdap.test.IntegrationTestBase.checkSystemServices(IntegrationTestBase.java:196)
	at io.cdap.cdap.test.IntegrationTestBase.setUp(IntegrationTestBase.java:97)
	at sun.reflect.NativeMethodAccessorImpl.invoke0(Native Method)
	at sun.reflect.NativeMethodAccessorImpl.invoke(NativeMethodAccessorImpl.java:62)
(33 more lines...)
Collapse Failed BatchAggregatorTest test History
Distro Tests - HDP 2.3 10 mins
java.util.concurrent.TimeoutException: Unable to connect to Authentication service to obtain access token, Connection info : CLIConnectionConfig{hostname=10.210.0.45, port=11015, sslEnabled=false}
	at io.cdap.cdap.test.IntegrationTestBase.checkServicesWithRetry(IntegrationTestBase.java:265)
	at io.cdap.cdap.test.IntegrationTestBase.fetchAccessToken(IntegrationTestBase.java:233)
	at io.cdap.cdap.test.IntegrationTestBase.fetchAccessToken(IntegrationTestBase.java:218)
	at io.cdap.cdap.test.IntegrationTestBase.checkSystemServices(IntegrationTestBase.java:196)
	at io.cdap.cdap.test.IntegrationTestBase.setUp(IntegrationTestBase.java:97)
	at sun.reflect.NativeMethodAccessorImpl.invoke0(Native Method)
	at sun.reflect.NativeMethodAccessorImpl.invoke(NativeMethodAccessorImpl.java:62)
(41 more lines...)
Collapse Failed BatchAggregatorTest initializationError History
Distro Tests - HDP 2.4 < 1 sec
java.lang.SecurityException: Invalid signature file digest for Manifest main attributes
	at sun.security.util.SignatureFileVerifier.processImpl(SignatureFileVerifier.java:284)
	at sun.security.util.SignatureFileVerifier.process(SignatureFileVerifier.java:238)
	at java.util.jar.JarVerifier.processEntry(JarVerifier.java:316)
	at java.util.jar.JarVerifier.update(JarVerifier.java:228)
	at java.util.jar.JarFile.initializeVerifier(JarFile.java:383)
	at java.util.jar.JarFile.getInputStream(JarFile.java:450)
	at sun.misc.URLClassPath$JarLoader$2.getInputStream(URLClassPath.java:940)
(42 more lines...)
Collapse Failed BatchAggregatorTest initializationError History
Distro Tests - HDP 2.5 < 1 sec
java.lang.SecurityException: Invalid signature file digest for Manifest main attributes
	at sun.security.util.SignatureFileVerifier.processImpl(SignatureFileVerifier.java:284)
	at sun.security.util.SignatureFileVerifier.process(SignatureFileVerifier.java:238)
	at java.util.jar.JarVerifier.processEntry(JarVerifier.java:316)
	at java.util.jar.JarVerifier.update(JarVerifier.java:228)
	at java.util.jar.JarFile.initializeVerifier(JarFile.java:383)
	at java.util.jar.JarFile.getInputStream(JarFile.java:450)
	at sun.misc.URLClassPath$JarLoader$2.getInputStream(URLClassPath.java:940)
(42 more lines...)
Collapse Failed BatchAggregatorTest initializationError History
Distro Tests - HDP 2.6 < 1 sec
java.lang.SecurityException: Invalid signature file digest for Manifest main attributes
	at sun.security.util.SignatureFileVerifier.processImpl(SignatureFileVerifier.java:284)
	at sun.security.util.SignatureFileVerifier.process(SignatureFileVerifier.java:238)
	at java.util.jar.JarVerifier.processEntry(JarVerifier.java:316)
	at java.util.jar.JarVerifier.update(JarVerifier.java:228)
	at java.util.jar.JarFile.initializeVerifier(JarFile.java:383)
	at java.util.jar.JarFile.getInputStream(JarFile.java:450)
	at sun.misc.URLClassPath$JarLoader$2.getInputStream(URLClassPath.java:940)
(42 more lines...)
Collapse Failed BatchAggregatorTest initializationError History
Distro Tests - MapR 5.1 < 1 sec
java.lang.SecurityException: Invalid signature file digest for Manifest main attributes
	at sun.security.util.SignatureFileVerifier.processImpl(SignatureFileVerifier.java:284)
	at sun.security.util.SignatureFileVerifier.process(SignatureFileVerifier.java:238)
	at java.util.jar.JarVerifier.processEntry(JarVerifier.java:316)
	at java.util.jar.JarVerifier.update(JarVerifier.java:228)
	at java.util.jar.JarFile.initializeVerifier(JarFile.java:383)
	at java.util.jar.JarFile.getInputStream(JarFile.java:450)
	at sun.misc.URLClassPath$JarLoader$2.getInputStream(URLClassPath.java:940)
(56 more lines...)
Collapse Failed BatchAggregatorTest test History
Distro Tests - MapR 5.2 MEP 1.1 10 mins
java.util.concurrent.TimeoutException: Unable to connect to Authentication service to obtain access token, Connection info : CLIConnectionConfig{hostname=10.210.0.165, port=11015, sslEnabled=false}
	at io.cdap.cdap.test.IntegrationTestBase.checkServicesWithRetry(IntegrationTestBase.java:265)
	at io.cdap.cdap.test.IntegrationTestBase.fetchAccessToken(IntegrationTestBase.java:233)
	at io.cdap.cdap.test.IntegrationTestBase.fetchAccessToken(IntegrationTestBase.java:218)
	at io.cdap.cdap.test.IntegrationTestBase.checkSystemServices(IntegrationTestBase.java:196)
	at io.cdap.cdap.test.IntegrationTestBase.setUp(IntegrationTestBase.java:97)
	at sun.reflect.NativeMethodAccessorImpl.invoke0(Native Method)
	at sun.reflect.NativeMethodAccessorImpl.invoke(NativeMethodAccessorImpl.java:62)
(41 more lines...)
Collapse Failed BatchCubeSinkTest test History
Distro Tests - CDH 5.10 10 mins
java.util.concurrent.TimeoutException: Unable to connect to Authentication service to obtain access token, Connection info : CLIConnectionConfig{hostname=10.210.0.10, port=11015, sslEnabled=false}
	at io.cdap.cdap.test.IntegrationTestBase.checkServicesWithRetry(IntegrationTestBase.java:265)
	at io.cdap.cdap.test.IntegrationTestBase.fetchAccessToken(IntegrationTestBase.java:233)
	at io.cdap.cdap.test.IntegrationTestBase.fetchAccessToken(IntegrationTestBase.java:218)
	at io.cdap.cdap.test.IntegrationTestBase.checkSystemServices(IntegrationTestBase.java:196)
	at io.cdap.cdap.test.IntegrationTestBase.setUp(IntegrationTestBase.java:97)
	at sun.reflect.NativeMethodAccessorImpl.invoke0(Native Method)
	at sun.reflect.NativeMethodAccessorImpl.invoke(NativeMethodAccessorImpl.java:62)
(33 more lines...)
Collapse Failed BatchCubeSinkTest test History
Distro Tests - CDH 5.11 10 mins
java.util.concurrent.TimeoutException: Unable to connect to Authentication service to obtain access token, Connection info : CLIConnectionConfig{hostname=10.210.0.58, port=11015, sslEnabled=false}
	at io.cdap.cdap.test.IntegrationTestBase.checkServicesWithRetry(IntegrationTestBase.java:265)
	at io.cdap.cdap.test.IntegrationTestBase.fetchAccessToken(IntegrationTestBase.java:233)
	at io.cdap.cdap.test.IntegrationTestBase.fetchAccessToken(IntegrationTestBase.java:218)
	at io.cdap.cdap.test.IntegrationTestBase.checkSystemServices(IntegrationTestBase.java:196)
	at io.cdap.cdap.test.IntegrationTestBase.setUp(IntegrationTestBase.java:97)
	at sun.reflect.NativeMethodAccessorImpl.invoke0(Native Method)
	at sun.reflect.NativeMethodAccessorImpl.invoke(NativeMethodAccessorImpl.java:62)
(33 more lines...)
Existing test failures 68
Status Test Failing since View job Duration
java.lang.SecurityException: Invalid signature file digest for Manifest main attributes
	at sun.security.util.SignatureFileVerifier.processImpl(SignatureFileVerifier.java:284)
	at sun.security.util.SignatureFileVerifier.process(SignatureFileVerifier.java:238)
	at java.util.jar.JarVerifier.processEntry(JarVerifier.java:316)
	at java.util.jar.JarVerifier.update(JarVerifier.java:228)
	at java.util.jar.JarFile.initializeVerifier(JarFile.java:383)
	at java.util.jar.JarFile.getInputStream(JarFile.java:450)
	at sun.misc.URLClassPath$JarLoader$2.getInputStream(URLClassPath.java:940)
(42 more lines...)
java.lang.SecurityException: Invalid signature file digest for Manifest main attributes
	at sun.security.util.SignatureFileVerifier.processImpl(SignatureFileVerifier.java:284)
	at sun.security.util.SignatureFileVerifier.process(SignatureFileVerifier.java:238)
	at java.util.jar.JarVerifier.processEntry(JarVerifier.java:316)
	at java.util.jar.JarVerifier.update(JarVerifier.java:228)
	at java.util.jar.JarFile.initializeVerifier(JarFile.java:383)
	at java.util.jar.JarFile.getInputStream(JarFile.java:450)
	at sun.misc.URLClassPath$JarLoader$2.getInputStream(URLClassPath.java:940)
(42 more lines...)
java.lang.SecurityException: Invalid signature file digest for Manifest main attributes
	at sun.security.util.SignatureFileVerifier.processImpl(SignatureFileVerifier.java:284)
	at sun.security.util.SignatureFileVerifier.process(SignatureFileVerifier.java:238)
	at java.util.jar.JarVerifier.processEntry(JarVerifier.java:316)
	at java.util.jar.JarVerifier.update(JarVerifier.java:228)
	at java.util.jar.JarFile.initializeVerifier(JarFile.java:383)
	at java.util.jar.JarFile.getInputStream(JarFile.java:450)
	at sun.misc.URLClassPath$JarLoader$2.getInputStream(URLClassPath.java:940)
(42 more lines...)
java.lang.SecurityException: Invalid signature file digest for Manifest main attributes
	at sun.security.util.SignatureFileVerifier.processImpl(SignatureFileVerifier.java:284)
	at sun.security.util.SignatureFileVerifier.process(SignatureFileVerifier.java:238)
	at java.util.jar.JarVerifier.processEntry(JarVerifier.java:316)
	at java.util.jar.JarVerifier.update(JarVerifier.java:228)
	at java.util.jar.JarFile.initializeVerifier(JarFile.java:383)
	at java.util.jar.JarFile.getInputStream(JarFile.java:450)
	at sun.misc.URLClassPath$JarLoader$2.getInputStream(URLClassPath.java:940)
(42 more lines...)
java.lang.SecurityException: Invalid signature file digest for Manifest main attributes
	at sun.security.util.SignatureFileVerifier.processImpl(SignatureFileVerifier.java:284)
	at sun.security.util.SignatureFileVerifier.process(SignatureFileVerifier.java:238)
	at java.util.jar.JarVerifier.processEntry(JarVerifier.java:316)
	at java.util.jar.JarVerifier.update(JarVerifier.java:228)
	at java.util.jar.JarFile.initializeVerifier(JarFile.java:383)
	at java.util.jar.JarFile.getInputStream(JarFile.java:450)
	at sun.misc.URLClassPath$JarLoader$2.getInputStream(URLClassPath.java:940)
(42 more lines...)
java.lang.SecurityException: Invalid signature file digest for Manifest main attributes
	at sun.security.util.SignatureFileVerifier.processImpl(SignatureFileVerifier.java:284)
	at sun.security.util.SignatureFileVerifier.process(SignatureFileVerifier.java:238)
	at java.util.jar.JarVerifier.processEntry(JarVerifier.java:316)
	at java.util.jar.JarVerifier.update(JarVerifier.java:228)
	at java.util.jar.JarFile.initializeVerifier(JarFile.java:383)
	at java.util.jar.JarFile.getInputStream(JarFile.java:450)
	at sun.misc.URLClassPath$JarLoader$2.getInputStream(URLClassPath.java:940)
(42 more lines...)
java.lang.SecurityException: Invalid signature file digest for Manifest main attributes
	at sun.security.util.SignatureFileVerifier.processImpl(SignatureFileVerifier.java:284)
	at sun.security.util.SignatureFileVerifier.process(SignatureFileVerifier.java:238)
	at java.util.jar.JarVerifier.processEntry(JarVerifier.java:316)
	at java.util.jar.JarVerifier.update(JarVerifier.java:228)
	at java.util.jar.JarFile.initializeVerifier(JarFile.java:383)
	at java.util.jar.JarFile.getInputStream(JarFile.java:450)
	at sun.misc.URLClassPath$JarLoader$2.getInputStream(URLClassPath.java:940)
(42 more lines...)
java.lang.SecurityException: Invalid signature file digest for Manifest main attributes
	at sun.security.util.SignatureFileVerifier.processImpl(SignatureFileVerifier.java:284)
	at sun.security.util.SignatureFileVerifier.process(SignatureFileVerifier.java:238)
	at java.util.jar.JarVerifier.processEntry(JarVerifier.java:316)
	at java.util.jar.JarVerifier.update(JarVerifier.java:228)
	at java.util.jar.JarFile.initializeVerifier(JarFile.java:383)
	at java.util.jar.JarFile.getInputStream(JarFile.java:450)
	at sun.misc.URLClassPath$JarLoader$2.getInputStream(URLClassPath.java:940)
(42 more lines...)
java.lang.SecurityException: Invalid signature file digest for Manifest main attributes
	at sun.security.util.SignatureFileVerifier.processImpl(SignatureFileVerifier.java:284)
	at sun.security.util.SignatureFileVerifier.process(SignatureFileVerifier.java:238)
	at java.util.jar.JarVerifier.processEntry(JarVerifier.java:316)
	at java.util.jar.JarVerifier.update(JarVerifier.java:228)
	at java.util.jar.JarFile.initializeVerifier(JarFile.java:383)
	at java.util.jar.JarFile.getInputStream(JarFile.java:450)
	at sun.misc.URLClassPath$JarLoader$2.getInputStream(URLClassPath.java:940)
(42 more lines...)
java.lang.SecurityException: Invalid signature file digest for Manifest main attributes
	at sun.security.util.SignatureFileVerifier.processImpl(SignatureFileVerifier.java:284)
	at sun.security.util.SignatureFileVerifier.process(SignatureFileVerifier.java:238)
	at java.util.jar.JarVerifier.processEntry(JarVerifier.java:316)
	at java.util.jar.JarVerifier.update(JarVerifier.java:228)
	at java.util.jar.JarFile.initializeVerifier(JarFile.java:383)
	at java.util.jar.JarFile.getInputStream(JarFile.java:450)
	at sun.misc.URLClassPath$JarLoader$2.getInputStream(URLClassPath.java:940)
(42 more lines...)
java.lang.SecurityException: Invalid signature file digest for Manifest main attributes
	at sun.security.util.SignatureFileVerifier.processImpl(SignatureFileVerifier.java:284)
	at sun.security.util.SignatureFileVerifier.process(SignatureFileVerifier.java:238)
	at java.util.jar.JarVerifier.processEntry(JarVerifier.java:316)
	at java.util.jar.JarVerifier.update(JarVerifier.java:228)
	at java.util.jar.JarFile.initializeVerifier(JarFile.java:383)
	at java.util.jar.JarFile.getInputStream(JarFile.java:450)
	at sun.misc.URLClassPath$JarLoader$2.getInputStream(URLClassPath.java:940)
(42 more lines...)
java.lang.SecurityException: Invalid signature file digest for Manifest main attributes
	at sun.security.util.SignatureFileVerifier.processImpl(SignatureFileVerifier.java:284)
	at sun.security.util.SignatureFileVerifier.process(SignatureFileVerifier.java:238)
	at java.util.jar.JarVerifier.processEntry(JarVerifier.java:316)
	at java.util.jar.JarVerifier.update(JarVerifier.java:228)
	at java.util.jar.JarFile.initializeVerifier(JarFile.java:383)
	at java.util.jar.JarFile.getInputStream(JarFile.java:450)
	at sun.misc.URLClassPath$JarLoader$2.getInputStream(URLClassPath.java:940)
(42 more lines...)
java.util.concurrent.TimeoutException: Unable to connect to Authentication service to obtain access token, Connection info : CLIConnectionConfig{hostname=10.210.0.165, port=11015, sslEnabled=false}
	at io.cdap.cdap.test.IntegrationTestBase.checkServicesWithRetry(IntegrationTestBase.java:265)
	at io.cdap.cdap.test.IntegrationTestBase.fetchAccessToken(IntegrationTestBase.java:233)
	at io.cdap.cdap.test.IntegrationTestBase.fetchAccessToken(IntegrationTestBase.java:218)
	at io.cdap.cdap.test.IntegrationTestBase.checkSystemServices(IntegrationTestBase.java:196)
	at io.cdap.cdap.test.IntegrationTestBase.setUp(IntegrationTestBase.java:97)
	at sun.reflect.NativeMethodAccessorImpl.invoke0(Native Method)
	at sun.reflect.NativeMethodAccessorImpl.invoke(NativeMethodAccessorImpl.java:62)
(41 more lines...)
java.lang.SecurityException: Invalid signature file digest for Manifest main attributes
	at sun.security.util.SignatureFileVerifier.processImpl(SignatureFileVerifier.java:284)
	at sun.security.util.SignatureFileVerifier.process(SignatureFileVerifier.java:238)
	at java.util.jar.JarVerifier.processEntry(JarVerifier.java:316)
	at java.util.jar.JarVerifier.update(JarVerifier.java:228)
	at java.util.jar.JarFile.initializeVerifier(JarFile.java:383)
	at java.util.jar.JarFile.getInputStream(JarFile.java:450)
	at sun.misc.URLClassPath$JarLoader$2.getInputStream(URLClassPath.java:940)
(42 more lines...)
java.lang.SecurityException: Invalid signature file digest for Manifest main attributes
	at sun.security.util.SignatureFileVerifier.processImpl(SignatureFileVerifier.java:284)
	at sun.security.util.SignatureFileVerifier.process(SignatureFileVerifier.java:238)
	at java.util.jar.JarVerifier.processEntry(JarVerifier.java:316)
	at java.util.jar.JarVerifier.update(JarVerifier.java:228)
	at java.util.jar.JarFile.initializeVerifier(JarFile.java:383)
	at java.util.jar.JarFile.getInputStream(JarFile.java:450)
	at sun.misc.URLClassPath$JarLoader$2.getInputStream(URLClassPath.java:940)
(42 more lines...)
java.lang.SecurityException: Invalid signature file digest for Manifest main attributes
	at sun.security.util.SignatureFileVerifier.processImpl(SignatureFileVerifier.java:284)
	at sun.security.util.SignatureFileVerifier.process(SignatureFileVerifier.java:238)
	at java.util.jar.JarVerifier.processEntry(JarVerifier.java:316)
	at java.util.jar.JarVerifier.update(JarVerifier.java:228)
	at java.util.jar.JarFile.initializeVerifier(JarFile.java:383)
	at java.util.jar.JarFile.getInputStream(JarFile.java:450)
	at sun.misc.URLClassPath$JarLoader$2.getInputStream(URLClassPath.java:940)
(42 more lines...)
java.lang.SecurityException: Invalid signature file digest for Manifest main attributes
	at sun.security.util.SignatureFileVerifier.processImpl(SignatureFileVerifier.java:284)
	at sun.security.util.SignatureFileVerifier.process(SignatureFileVerifier.java:238)
	at java.util.jar.JarVerifier.processEntry(JarVerifier.java:316)
	at java.util.jar.JarVerifier.update(JarVerifier.java:228)
	at java.util.jar.JarFile.initializeVerifier(JarFile.java:383)
	at java.util.jar.JarFile.getInputStream(JarFile.java:450)
	at sun.misc.URLClassPath$JarLoader$2.getInputStream(URLClassPath.java:940)
(42 more lines...)
java.lang.SecurityException: Invalid signature file digest for Manifest main attributes
	at sun.security.util.SignatureFileVerifier.processImpl(SignatureFileVerifier.java:284)
	at sun.security.util.SignatureFileVerifier.process(SignatureFileVerifier.java:238)
	at java.util.jar.JarVerifier.processEntry(JarVerifier.java:316)
	at java.util.jar.JarVerifier.update(JarVerifier.java:228)
	at java.util.jar.JarFile.initializeVerifier(JarFile.java:383)
	at java.util.jar.JarFile.getInputStream(JarFile.java:450)
	at sun.misc.URLClassPath$JarLoader$2.getInputStream(URLClassPath.java:940)
(42 more lines...)
java.lang.SecurityException: Invalid signature file digest for Manifest main attributes
	at sun.security.util.SignatureFileVerifier.processImpl(SignatureFileVerifier.java:284)
	at sun.security.util.SignatureFileVerifier.process(SignatureFileVerifier.java:238)
	at java.util.jar.JarVerifier.processEntry(JarVerifier.java:316)
	at java.util.jar.JarVerifier.update(JarVerifier.java:228)
	at java.util.jar.JarFile.initializeVerifier(JarFile.java:383)
	at java.util.jar.JarFile.getInputStream(JarFile.java:450)
	at sun.misc.URLClassPath$JarLoader$2.getInputStream(URLClassPath.java:940)
(42 more lines...)
java.lang.SecurityException: Invalid signature file digest for Manifest main attributes
	at sun.security.util.SignatureFileVerifier.processImpl(SignatureFileVerifier.java:284)
	at sun.security.util.SignatureFileVerifier.process(SignatureFileVerifier.java:238)
	at java.util.jar.JarVerifier.processEntry(JarVerifier.java:316)
	at java.util.jar.JarVerifier.update(JarVerifier.java:228)
	at java.util.jar.JarFile.initializeVerifier(JarFile.java:383)
	at java.util.jar.JarFile.getInputStream(JarFile.java:450)
	at sun.misc.URLClassPath$JarLoader$2.getInputStream(URLClassPath.java:940)
(42 more lines...)
java.lang.SecurityException: Invalid signature file digest for Manifest main attributes
	at sun.security.util.SignatureFileVerifier.processImpl(SignatureFileVerifier.java:284)
	at sun.security.util.SignatureFileVerifier.process(SignatureFileVerifier.java:238)
	at java.util.jar.JarVerifier.processEntry(JarVerifier.java:316)
	at java.util.jar.JarVerifier.update(JarVerifier.java:228)
	at java.util.jar.JarFile.initializeVerifier(JarFile.java:383)
	at java.util.jar.JarFile.getInputStream(JarFile.java:450)
	at sun.misc.URLClassPath$JarLoader$2.getInputStream(URLClassPath.java:940)
(42 more lines...)
java.lang.SecurityException: Invalid signature file digest for Manifest main attributes
	at sun.security.util.SignatureFileVerifier.processImpl(SignatureFileVerifier.java:284)
	at sun.security.util.SignatureFileVerifier.process(SignatureFileVerifier.java:238)
	at java.util.jar.JarVerifier.processEntry(JarVerifier.java:316)
	at java.util.jar.JarVerifier.update(JarVerifier.java:228)
	at java.util.jar.JarFile.initializeVerifier(JarFile.java:383)
	at java.util.jar.JarFile.getInputStream(JarFile.java:450)
	at sun.misc.URLClassPath$JarLoader$2.getInputStream(URLClassPath.java:940)
(42 more lines...)
java.lang.SecurityException: Invalid signature file digest for Manifest main attributes
	at sun.security.util.SignatureFileVerifier.processImpl(SignatureFileVerifier.java:284)
	at sun.security.util.SignatureFileVerifier.process(SignatureFileVerifier.java:238)
	at java.util.jar.JarVerifier.processEntry(JarVerifier.java:316)
	at java.util.jar.JarVerifier.update(JarVerifier.java:228)
	at java.util.jar.JarFile.initializeVerifier(JarFile.java:383)
	at java.util.jar.JarFile.getInputStream(JarFile.java:450)
	at sun.misc.URLClassPath$JarLoader$2.getInputStream(URLClassPath.java:940)
(42 more lines...)
java.lang.SecurityException: Invalid signature file digest for Manifest main attributes
	at sun.security.util.SignatureFileVerifier.processImpl(SignatureFileVerifier.java:284)
	at sun.security.util.SignatureFileVerifier.process(SignatureFileVerifier.java:238)
	at java.util.jar.JarVerifier.processEntry(JarVerifier.java:316)
	at java.util.jar.JarVerifier.update(JarVerifier.java:228)
	at java.util.jar.JarFile.initializeVerifier(JarFile.java:383)
	at java.util.jar.JarFile.getInputStream(JarFile.java:450)
	at sun.misc.URLClassPath$JarLoader$2.getInputStream(URLClassPath.java:940)
(42 more lines...)
java.lang.SecurityException: Invalid signature file digest for Manifest main attributes
	at sun.security.util.SignatureFileVerifier.processImpl(SignatureFileVerifier.java:284)
	at sun.security.util.SignatureFileVerifier.process(SignatureFileVerifier.java:238)
	at java.util.jar.JarVerifier.processEntry(JarVerifier.java:316)
	at java.util.jar.JarVerifier.update(JarVerifier.java:228)
	at java.util.jar.JarFile.initializeVerifier(JarFile.java:383)
	at java.util.jar.JarFile.getInputStream(JarFile.java:450)
	at sun.misc.URLClassPath$JarLoader$2.getInputStream(URLClassPath.java:940)
(42 more lines...)
java.lang.SecurityException: Invalid signature file digest for Manifest main attributes
	at sun.security.util.SignatureFileVerifier.processImpl(SignatureFileVerifier.java:284)
	at sun.security.util.SignatureFileVerifier.process(SignatureFileVerifier.java:238)
	at java.util.jar.JarVerifier.processEntry(JarVerifier.java:316)
	at java.util.jar.JarVerifier.update(JarVerifier.java:228)
	at java.util.jar.JarFile.initializeVerifier(JarFile.java:383)
	at java.util.jar.JarFile.getInputStream(JarFile.java:450)
	at sun.misc.URLClassPath$JarLoader$2.getInputStream(URLClassPath.java:940)
(42 more lines...)
java.lang.SecurityException: Invalid signature file digest for Manifest main attributes
	at sun.security.util.SignatureFileVerifier.processImpl(SignatureFileVerifier.java:284)
	at sun.security.util.SignatureFileVerifier.process(SignatureFileVerifier.java:238)
	at java.util.jar.JarVerifier.processEntry(JarVerifier.java:316)
	at java.util.jar.JarVerifier.update(JarVerifier.java:228)
	at java.util.jar.JarFile.initializeVerifier(JarFile.java:383)
	at java.util.jar.JarFile.getInputStream(JarFile.java:450)
	at sun.misc.URLClassPath$JarLoader$2.getInputStream(URLClassPath.java:940)
(42 more lines...)
java.util.concurrent.TimeoutException: Unable to connect to Authentication service to obtain access token, Connection info : CLIConnectionConfig{hostname=10.210.0.165, port=11015, sslEnabled=false}
	at io.cdap.cdap.test.IntegrationTestBase.checkServicesWithRetry(IntegrationTestBase.java:265)
	at io.cdap.cdap.test.IntegrationTestBase.fetchAccessToken(IntegrationTestBase.java:233)
	at io.cdap.cdap.test.IntegrationTestBase.fetchAccessToken(IntegrationTestBase.java:218)
	at io.cdap.cdap.test.IntegrationTestBase.checkSystemServices(IntegrationTestBase.java:196)
	at io.cdap.cdap.test.IntegrationTestBase.setUp(IntegrationTestBase.java:97)
	at sun.reflect.GeneratedMethodAccessor1.invoke(Unknown Source)
	at sun.reflect.DelegatingMethodAccessorImpl.invoke(DelegatingMethodAccessorImpl.java:43)
(40 more lines...)
java.util.concurrent.TimeoutException: Unable to connect to Authentication service to obtain access token, Connection info : CLIConnectionConfig{hostname=10.210.0.165, port=11015, sslEnabled=false}
	at io.cdap.cdap.test.IntegrationTestBase.checkServicesWithRetry(IntegrationTestBase.java:265)
	at io.cdap.cdap.test.IntegrationTestBase.fetchAccessToken(IntegrationTestBase.java:233)
	at io.cdap.cdap.test.IntegrationTestBase.fetchAccessToken(IntegrationTestBase.java:218)
	at io.cdap.cdap.test.IntegrationTestBase.checkSystemServices(IntegrationTestBase.java:196)
	at io.cdap.cdap.test.IntegrationTestBase.setUp(IntegrationTestBase.java:97)
	at sun.reflect.GeneratedMethodAccessor1.invoke(Unknown Source)
	at sun.reflect.DelegatingMethodAccessorImpl.invoke(DelegatingMethodAccessorImpl.java:43)
(40 more lines...)
java.lang.SecurityException: Invalid signature file digest for Manifest main attributes
	at sun.security.util.SignatureFileVerifier.processImpl(SignatureFileVerifier.java:284)
	at sun.security.util.SignatureFileVerifier.process(SignatureFileVerifier.java:238)
	at java.util.jar.JarVerifier.processEntry(JarVerifier.java:316)
	at java.util.jar.JarVerifier.update(JarVerifier.java:228)
	at java.util.jar.JarFile.initializeVerifier(JarFile.java:383)
	at java.util.jar.JarFile.getInputStream(JarFile.java:450)
	at sun.misc.URLClassPath$JarLoader$2.getInputStream(URLClassPath.java:940)
(42 more lines...)
java.lang.SecurityException: Invalid signature file digest for Manifest main attributes
	at sun.security.util.SignatureFileVerifier.processImpl(SignatureFileVerifier.java:284)
	at sun.security.util.SignatureFileVerifier.process(SignatureFileVerifier.java:238)
	at java.util.jar.JarVerifier.processEntry(JarVerifier.java:316)
	at java.util.jar.JarVerifier.update(JarVerifier.java:228)
	at java.util.jar.JarFile.initializeVerifier(JarFile.java:383)
	at java.util.jar.JarFile.getInputStream(JarFile.java:450)
	at sun.misc.URLClassPath$JarLoader$2.getInputStream(URLClassPath.java:940)
(42 more lines...)
java.lang.SecurityException: Invalid signature file digest for Manifest main attributes
	at sun.security.util.SignatureFileVerifier.processImpl(SignatureFileVerifier.java:284)
	at sun.security.util.SignatureFileVerifier.process(SignatureFileVerifier.java:238)
	at java.util.jar.JarVerifier.processEntry(JarVerifier.java:316)
	at java.util.jar.JarVerifier.update(JarVerifier.java:228)
	at java.util.jar.JarFile.initializeVerifier(JarFile.java:383)
	at java.util.jar.JarFile.getInputStream(JarFile.java:450)
	at sun.misc.URLClassPath$JarLoader$2.getInputStream(URLClassPath.java:940)
(42 more lines...)
java.lang.SecurityException: Invalid signature file digest for Manifest main attributes
	at sun.security.util.SignatureFileVerifier.processImpl(SignatureFileVerifier.java:284)
	at sun.security.util.SignatureFileVerifier.process(SignatureFileVerifier.java:238)
	at java.util.jar.JarVerifier.processEntry(JarVerifier.java:316)
	at java.util.jar.JarVerifier.update(JarVerifier.java:228)
	at java.util.jar.JarFile.initializeVerifier(JarFile.java:383)
	at java.util.jar.JarFile.getInputStream(JarFile.java:450)
	at sun.misc.URLClassPath$JarLoader$2.getInputStream(URLClassPath.java:940)
(42 more lines...)
java.lang.SecurityException: Invalid signature file digest for Manifest main attributes
	at sun.security.util.SignatureFileVerifier.processImpl(SignatureFileVerifier.java:284)
	at sun.security.util.SignatureFileVerifier.process(SignatureFileVerifier.java:238)
	at java.util.jar.JarVerifier.processEntry(JarVerifier.java:316)
	at java.util.jar.JarVerifier.update(JarVerifier.java:228)
	at java.util.jar.JarFile.initializeVerifier(JarFile.java:383)
	at java.util.jar.JarFile.getInputStream(JarFile.java:450)
	at sun.misc.URLClassPath$JarLoader$2.getInputStream(URLClassPath.java:940)
(42 more lines...)
java.lang.SecurityException: Invalid signature file digest for Manifest main attributes
	at sun.security.util.SignatureFileVerifier.processImpl(SignatureFileVerifier.java:284)
	at sun.security.util.SignatureFileVerifier.process(SignatureFileVerifier.java:238)
	at java.util.jar.JarVerifier.processEntry(JarVerifier.java:316)
	at java.util.jar.JarVerifier.update(JarVerifier.java:228)
	at java.util.jar.JarFile.initializeVerifier(JarFile.java:383)
	at java.util.jar.JarFile.getInputStream(JarFile.java:450)
	at sun.misc.URLClassPath$JarLoader$2.getInputStream(URLClassPath.java:940)
(42 more lines...)
java.lang.SecurityException: Invalid signature file digest for Manifest main attributes
	at sun.security.util.SignatureFileVerifier.processImpl(SignatureFileVerifier.java:284)
	at sun.security.util.SignatureFileVerifier.process(SignatureFileVerifier.java:238)
	at java.util.jar.JarVerifier.processEntry(JarVerifier.java:316)
	at java.util.jar.JarVerifier.update(JarVerifier.java:228)
	at java.util.jar.JarFile.initializeVerifier(JarFile.java:383)
	at java.util.jar.JarFile.getInputStream(JarFile.java:450)
	at sun.misc.URLClassPath$JarLoader$2.getInputStream(URLClassPath.java:940)
(42 more lines...)
java.lang.SecurityException: Invalid signature file digest for Manifest main attributes
	at sun.security.util.SignatureFileVerifier.processImpl(SignatureFileVerifier.java:284)
	at sun.security.util.SignatureFileVerifier.process(SignatureFileVerifier.java:238)
	at java.util.jar.JarVerifier.processEntry(JarVerifier.java:316)
	at java.util.jar.JarVerifier.update(JarVerifier.java:228)
	at java.util.jar.JarFile.initializeVerifier(JarFile.java:383)
	at java.util.jar.JarFile.getInputStream(JarFile.java:450)
	at sun.misc.URLClassPath$JarLoader$2.getInputStream(URLClassPath.java:940)
(42 more lines...)
java.lang.SecurityException: Invalid signature file digest for Manifest main attributes
	at sun.security.util.SignatureFileVerifier.processImpl(SignatureFileVerifier.java:284)
	at sun.security.util.SignatureFileVerifier.process(SignatureFileVerifier.java:238)
	at java.util.jar.JarVerifier.processEntry(JarVerifier.java:316)
	at java.util.jar.JarVerifier.update(JarVerifier.java:228)
	at java.util.jar.JarFile.initializeVerifier(JarFile.java:383)
	at java.util.jar.JarFile.getInputStream(JarFile.java:450)
	at sun.misc.URLClassPath$JarLoader$2.getInputStream(URLClassPath.java:940)
(42 more lines...)
java.lang.SecurityException: Invalid signature file digest for Manifest main attributes
	at sun.security.util.SignatureFileVerifier.processImpl(SignatureFileVerifier.java:284)
	at sun.security.util.SignatureFileVerifier.process(SignatureFileVerifier.java:238)
	at java.util.jar.JarVerifier.processEntry(JarVerifier.java:316)
	at java.util.jar.JarVerifier.update(JarVerifier.java:228)
	at java.util.jar.JarFile.initializeVerifier(JarFile.java:383)
	at java.util.jar.JarFile.getInputStream(JarFile.java:450)
	at sun.misc.URLClassPath$JarLoader$2.getInputStream(URLClassPath.java:940)
(42 more lines...)
java.lang.SecurityException: Invalid signature file digest for Manifest main attributes
	at sun.security.util.SignatureFileVerifier.processImpl(SignatureFileVerifier.java:284)
	at sun.security.util.SignatureFileVerifier.process(SignatureFileVerifier.java:238)
	at java.util.jar.JarVerifier.processEntry(JarVerifier.java:316)
	at java.util.jar.JarVerifier.update(JarVerifier.java:228)
	at java.util.jar.JarFile.initializeVerifier(JarFile.java:383)
	at java.util.jar.JarFile.getInputStream(JarFile.java:450)
	at sun.misc.URLClassPath$JarLoader$2.getInputStream(URLClassPath.java:940)
(42 more lines...)
java.lang.SecurityException: Invalid signature file digest for Manifest main attributes
	at sun.security.util.SignatureFileVerifier.processImpl(SignatureFileVerifier.java:284)
	at sun.security.util.SignatureFileVerifier.process(SignatureFileVerifier.java:238)
	at java.util.jar.JarVerifier.processEntry(JarVerifier.java:316)
	at java.util.jar.JarVerifier.update(JarVerifier.java:228)
	at java.util.jar.JarFile.initializeVerifier(JarFile.java:383)
	at java.util.jar.JarFile.getInputStream(JarFile.java:450)
	at sun.misc.URLClassPath$JarLoader$2.getInputStream(URLClassPath.java:940)
(42 more lines...)
java.lang.SecurityException: Invalid signature file digest for Manifest main attributes
	at sun.security.util.SignatureFileVerifier.processImpl(SignatureFileVerifier.java:284)
	at sun.security.util.SignatureFileVerifier.process(SignatureFileVerifier.java:238)
	at java.util.jar.JarVerifier.processEntry(JarVerifier.java:316)
	at java.util.jar.JarVerifier.update(JarVerifier.java:228)
	at java.util.jar.JarFile.initializeVerifier(JarFile.java:383)
	at java.util.jar.JarFile.getInputStream(JarFile.java:450)
	at sun.misc.URLClassPath$JarLoader$2.getInputStream(URLClassPath.java:940)
(42 more lines...)
java.lang.SecurityException: Invalid signature file digest for Manifest main attributes
	at sun.security.util.SignatureFileVerifier.processImpl(SignatureFileVerifier.java:284)
	at sun.security.util.SignatureFileVerifier.process(SignatureFileVerifier.java:238)
	at java.util.jar.JarVerifier.processEntry(JarVerifier.java:316)
	at java.util.jar.JarVerifier.update(JarVerifier.java:228)
	at java.util.jar.JarFile.initializeVerifier(JarFile.java:383)
	at java.util.jar.JarFile.getInputStream(JarFile.java:450)
	at sun.misc.URLClassPath$JarLoader$2.getInputStream(URLClassPath.java:940)
(42 more lines...)
java.lang.SecurityException: Invalid signature file digest for Manifest main attributes
	at sun.security.util.SignatureFileVerifier.processImpl(SignatureFileVerifier.java:284)
	at sun.security.util.SignatureFileVerifier.process(SignatureFileVerifier.java:238)
	at java.util.jar.JarVerifier.processEntry(JarVerifier.java:316)
	at java.util.jar.JarVerifier.update(JarVerifier.java:228)
	at java.util.jar.JarFile.initializeVerifier(JarFile.java:383)
	at java.util.jar.JarFile.getInputStream(JarFile.java:450)
	at sun.misc.URLClassPath$JarLoader$2.getInputStream(URLClassPath.java:940)
(42 more lines...)
java.lang.SecurityException: Invalid signature file digest for Manifest main attributes
	at sun.security.util.SignatureFileVerifier.processImpl(SignatureFileVerifier.java:284)
	at sun.security.util.SignatureFileVerifier.process(SignatureFileVerifier.java:238)
	at java.util.jar.JarVerifier.processEntry(JarVerifier.java:316)
	at java.util.jar.JarVerifier.update(JarVerifier.java:228)
	at java.util.jar.JarFile.initializeVerifier(JarFile.java:383)
	at java.util.jar.JarFile.getInputStream(JarFile.java:450)
	at sun.misc.URLClassPath$JarLoader$2.getInputStream(URLClassPath.java:940)
(42 more lines...)
java.lang.SecurityException: Invalid signature file digest for Manifest main attributes
	at sun.security.util.SignatureFileVerifier.processImpl(SignatureFileVerifier.java:284)
	at sun.security.util.SignatureFileVerifier.process(SignatureFileVerifier.java:238)
	at java.util.jar.JarVerifier.processEntry(JarVerifier.java:316)
	at java.util.jar.JarVerifier.update(JarVerifier.java:228)
	at java.util.jar.JarFile.initializeVerifier(JarFile.java:383)
	at java.util.jar.JarFile.getInputStream(JarFile.java:450)
	at sun.misc.URLClassPath$JarLoader$2.getInputStream(URLClassPath.java:940)
(42 more lines...)
java.lang.SecurityException: Invalid signature file digest for Manifest main attributes
	at sun.security.util.SignatureFileVerifier.processImpl(SignatureFileVerifier.java:284)
	at sun.security.util.SignatureFileVerifier.process(SignatureFileVerifier.java:238)
	at java.util.jar.JarVerifier.processEntry(JarVerifier.java:316)
	at java.util.jar.JarVerifier.update(JarVerifier.java:228)
	at java.util.jar.JarFile.initializeVerifier(JarFile.java:383)
	at java.util.jar.JarFile.getInputStream(JarFile.java:450)
	at sun.misc.URLClassPath$JarLoader$2.getInputStream(URLClassPath.java:940)
(42 more lines...)
java.lang.SecurityException: Invalid signature file digest for Manifest main attributes
	at sun.security.util.SignatureFileVerifier.processImpl(SignatureFileVerifier.java:284)
	at sun.security.util.SignatureFileVerifier.process(SignatureFileVerifier.java:238)
	at java.util.jar.JarVerifier.processEntry(JarVerifier.java:316)
	at java.util.jar.JarVerifier.update(JarVerifier.java:228)
	at java.util.jar.JarFile.initializeVerifier(JarFile.java:383)
	at java.util.jar.JarFile.getInputStream(JarFile.java:450)
	at sun.misc.URLClassPath$JarLoader$2.getInputStream(URLClassPath.java:940)
(42 more lines...)
java.lang.SecurityException: Invalid signature file digest for Manifest main attributes
	at sun.security.util.SignatureFileVerifier.processImpl(SignatureFileVerifier.java:284)
	at sun.security.util.SignatureFileVerifier.process(SignatureFileVerifier.java:238)
	at java.util.jar.JarVerifier.processEntry(JarVerifier.java:316)
	at java.util.jar.JarVerifier.update(JarVerifier.java:228)
	at java.util.jar.JarFile.initializeVerifier(JarFile.java:383)
	at java.util.jar.JarFile.getInputStream(JarFile.java:450)
	at sun.misc.URLClassPath$JarLoader$2.getInputStream(URLClassPath.java:940)
(42 more lines...)
java.lang.SecurityException: Invalid signature file digest for Manifest main attributes
	at sun.security.util.SignatureFileVerifier.processImpl(SignatureFileVerifier.java:284)
	at sun.security.util.SignatureFileVerifier.process(SignatureFileVerifier.java:238)
	at java.util.jar.JarVerifier.processEntry(JarVerifier.java:316)
	at java.util.jar.JarVerifier.update(JarVerifier.java:228)
	at java.util.jar.JarFile.initializeVerifier(JarFile.java:383)
	at java.util.jar.JarFile.getInputStream(JarFile.java:450)
	at sun.misc.URLClassPath$JarLoader$2.getInputStream(URLClassPath.java:940)
(42 more lines...)