Build #301

Build: #301 failed Scheduled with changes by 4 people

Test results

  • 900 tests in total
  • 20 tests failed
  • 20 failures are new
  • 2 tests were fixed
  • 3599 minutes taken in total.
New test failures 20
Status Test View job Duration
Collapse Failed HivePluginTest testHivePlugins History
Distro Tests - CDH 5.10 1 sec
java.io.IOException: 500: Unable to validate session
	at io.cdap.cdap.client.util.RESTClient.execute(RESTClient.java:132)
	at io.cdap.cdap.client.util.RESTClient.execute(RESTClient.java:82)
	at io.cdap.cdap.app.etl.ETLTestBase.installPluginFromMarket(ETLTestBase.java:193)
	at io.cdap.cdap.app.etl.batch.HivePluginTest.testHivePlugins(HivePluginTest.java:76)
Collapse Failed HivePluginTest testHivePlugins History
Distro Tests - CDH 5.11 1 sec
java.io.IOException: 500: Unable to validate session
	at io.cdap.cdap.client.util.RESTClient.execute(RESTClient.java:132)
	at io.cdap.cdap.client.util.RESTClient.execute(RESTClient.java:82)
	at io.cdap.cdap.app.etl.ETLTestBase.installPluginFromMarket(ETLTestBase.java:193)
	at io.cdap.cdap.app.etl.batch.HivePluginTest.testHivePlugins(HivePluginTest.java:76)
Collapse Failed HivePluginTest testHivePlugins History
Distro Tests - CDH 5.12 1 sec
java.io.IOException: 500: Unable to validate session
	at io.cdap.cdap.client.util.RESTClient.execute(RESTClient.java:132)
	at io.cdap.cdap.client.util.RESTClient.execute(RESTClient.java:82)
	at io.cdap.cdap.app.etl.ETLTestBase.installPluginFromMarket(ETLTestBase.java:193)
	at io.cdap.cdap.app.etl.batch.HivePluginTest.testHivePlugins(HivePluginTest.java:76)
Collapse Failed HivePluginTest testHivePlugins History
Distro Tests - CDH 5.13 1 sec
java.io.IOException: 500: Unable to validate session
	at io.cdap.cdap.client.util.RESTClient.execute(RESTClient.java:132)
	at io.cdap.cdap.client.util.RESTClient.execute(RESTClient.java:82)
	at io.cdap.cdap.app.etl.ETLTestBase.installPluginFromMarket(ETLTestBase.java:193)
	at io.cdap.cdap.app.etl.batch.HivePluginTest.testHivePlugins(HivePluginTest.java:76)
Collapse Failed HivePluginTest testHivePlugins History
Distro Tests - CDH 5.14 1 sec
java.io.IOException: 500: Unable to validate session
	at io.cdap.cdap.client.util.RESTClient.execute(RESTClient.java:132)
	at io.cdap.cdap.client.util.RESTClient.execute(RESTClient.java:82)
	at io.cdap.cdap.app.etl.ETLTestBase.installPluginFromMarket(ETLTestBase.java:193)
	at io.cdap.cdap.app.etl.batch.HivePluginTest.testHivePlugins(HivePluginTest.java:76)
Collapse Failed HivePluginTest testHivePlugins History
Distro Tests - CDH 5.15 1 sec
java.io.IOException: 500: Unable to validate session
	at io.cdap.cdap.client.util.RESTClient.execute(RESTClient.java:132)
	at io.cdap.cdap.client.util.RESTClient.execute(RESTClient.java:82)
	at io.cdap.cdap.app.etl.ETLTestBase.installPluginFromMarket(ETLTestBase.java:193)
	at io.cdap.cdap.app.etl.batch.HivePluginTest.testHivePlugins(HivePluginTest.java:76)
Collapse Failed HivePluginTest testHivePlugins History
Distro Tests - CDH 5.4 1 sec
java.io.IOException: 500: Unable to validate session
	at io.cdap.cdap.client.util.RESTClient.execute(RESTClient.java:132)
	at io.cdap.cdap.client.util.RESTClient.execute(RESTClient.java:82)
	at io.cdap.cdap.app.etl.ETLTestBase.installPluginFromMarket(ETLTestBase.java:193)
	at io.cdap.cdap.app.etl.batch.HivePluginTest.testHivePlugins(HivePluginTest.java:76)
Collapse Failed HivePluginTest testHivePlugins History
Distro Tests - CDH 5.5 1 sec
java.io.IOException: 500: Unable to validate session
	at io.cdap.cdap.client.util.RESTClient.execute(RESTClient.java:132)
	at io.cdap.cdap.client.util.RESTClient.execute(RESTClient.java:82)
	at io.cdap.cdap.app.etl.ETLTestBase.installPluginFromMarket(ETLTestBase.java:193)
	at io.cdap.cdap.app.etl.batch.HivePluginTest.testHivePlugins(HivePluginTest.java:76)
Collapse Failed HivePluginTest testHivePlugins History
Distro Tests - CDH 5.6 1 sec
java.io.IOException: 500: Unable to validate session
	at io.cdap.cdap.client.util.RESTClient.execute(RESTClient.java:132)
	at io.cdap.cdap.client.util.RESTClient.execute(RESTClient.java:82)
	at io.cdap.cdap.app.etl.ETLTestBase.installPluginFromMarket(ETLTestBase.java:193)
	at io.cdap.cdap.app.etl.batch.HivePluginTest.testHivePlugins(HivePluginTest.java:76)
Collapse Failed HivePluginTest testHivePlugins History
Distro Tests - CDH 5.7 1 sec
java.io.IOException: 500: Unable to validate session
	at io.cdap.cdap.client.util.RESTClient.execute(RESTClient.java:132)
	at io.cdap.cdap.client.util.RESTClient.execute(RESTClient.java:82)
	at io.cdap.cdap.app.etl.ETLTestBase.installPluginFromMarket(ETLTestBase.java:193)
	at io.cdap.cdap.app.etl.batch.HivePluginTest.testHivePlugins(HivePluginTest.java:76)
Collapse Failed HivePluginTest testHivePlugins History
Distro Tests - CDH 5.8 1 sec
java.io.IOException: 500: Unable to validate session
	at io.cdap.cdap.client.util.RESTClient.execute(RESTClient.java:132)
	at io.cdap.cdap.client.util.RESTClient.execute(RESTClient.java:82)
	at io.cdap.cdap.app.etl.ETLTestBase.installPluginFromMarket(ETLTestBase.java:193)
	at io.cdap.cdap.app.etl.batch.HivePluginTest.testHivePlugins(HivePluginTest.java:76)
Collapse Failed HivePluginTest testHivePlugins History
Distro Tests - CDH 5.9 1 sec
java.io.IOException: 500: Unable to validate session
	at io.cdap.cdap.client.util.RESTClient.execute(RESTClient.java:132)
	at io.cdap.cdap.client.util.RESTClient.execute(RESTClient.java:82)
	at io.cdap.cdap.app.etl.ETLTestBase.installPluginFromMarket(ETLTestBase.java:193)
	at io.cdap.cdap.app.etl.batch.HivePluginTest.testHivePlugins(HivePluginTest.java:76)
Collapse Failed HivePluginTest testHivePlugins History
Distro Tests - HDP 2.3 1 sec
java.io.IOException: 500: Unable to validate session
	at io.cdap.cdap.client.util.RESTClient.execute(RESTClient.java:132)
	at io.cdap.cdap.client.util.RESTClient.execute(RESTClient.java:82)
	at io.cdap.cdap.app.etl.ETLTestBase.installPluginFromMarket(ETLTestBase.java:193)
	at io.cdap.cdap.app.etl.batch.HivePluginTest.testHivePlugins(HivePluginTest.java:76)
Collapse Failed HivePluginTest testHivePlugins History
Distro Tests - HDP 2.4 1 sec
java.io.IOException: 500: Unable to validate session
	at io.cdap.cdap.client.util.RESTClient.execute(RESTClient.java:132)
	at io.cdap.cdap.client.util.RESTClient.execute(RESTClient.java:82)
	at io.cdap.cdap.app.etl.ETLTestBase.installPluginFromMarket(ETLTestBase.java:193)
	at io.cdap.cdap.app.etl.batch.HivePluginTest.testHivePlugins(HivePluginTest.java:76)
Collapse Failed HivePluginTest testHivePlugins History
Distro Tests - HDP 2.5 1 sec
java.io.IOException: 500: Unable to validate session
	at io.cdap.cdap.client.util.RESTClient.execute(RESTClient.java:132)
	at io.cdap.cdap.client.util.RESTClient.execute(RESTClient.java:82)
	at io.cdap.cdap.app.etl.ETLTestBase.installPluginFromMarket(ETLTestBase.java:193)
	at io.cdap.cdap.app.etl.batch.HivePluginTest.testHivePlugins(HivePluginTest.java:76)
Collapse Failed HivePluginTest testHivePlugins History
Distro Tests - HDP 2.6 1 sec
java.io.IOException: 500: Unable to validate session
	at io.cdap.cdap.client.util.RESTClient.execute(RESTClient.java:132)
	at io.cdap.cdap.client.util.RESTClient.execute(RESTClient.java:82)
	at io.cdap.cdap.app.etl.ETLTestBase.installPluginFromMarket(ETLTestBase.java:193)
	at io.cdap.cdap.app.etl.batch.HivePluginTest.testHivePlugins(HivePluginTest.java:76)
Collapse Failed HivePluginTest testHivePlugins History
Distro Tests - MapR 5.1 1 sec
java.io.IOException: 500: Unable to validate session
	at io.cdap.cdap.client.util.RESTClient.execute(RESTClient.java:132)
	at io.cdap.cdap.client.util.RESTClient.execute(RESTClient.java:82)
	at io.cdap.cdap.app.etl.ETLTestBase.installPluginFromMarket(ETLTestBase.java:193)
	at io.cdap.cdap.app.etl.batch.HivePluginTest.testHivePlugins(HivePluginTest.java:76)
Collapse Failed HivePluginTest testHivePlugins History
Distro Tests - MapR 5.2 MEP 1.1 1 sec
java.io.IOException: 500: Unable to validate session
	at io.cdap.cdap.client.util.RESTClient.execute(RESTClient.java:132)
	at io.cdap.cdap.client.util.RESTClient.execute(RESTClient.java:82)
	at io.cdap.cdap.app.etl.ETLTestBase.installPluginFromMarket(ETLTestBase.java:193)
	at io.cdap.cdap.app.etl.batch.HivePluginTest.testHivePlugins(HivePluginTest.java:76)
Fixed tests 2
Status Test Failing since View job Duration
Successful TPFSParquetSinkSourceTest testSpark History
Failing since build #300 (Scheduled with changes by albertshau <ashau@google.com>) Distro Tests - CDH 5.14 5 mins
Successful WorkflowTest test History
Failing since build #300 (Scheduled with changes by albertshau <ashau@google.com>) Distro Tests - CDH 5.12 2 mins