Build #301

Build: #301 failed Scheduled with changes by 4 people

Build result summary

Details

Completed
Duration
666 minutes
Labels
None
Revision
e53fac8e1947c40d5ddfbf815e247e88d2d867ef e53fac8e1947c40d5ddfbf815e247e88d2d867ef
Total tests
900
Failing since
#299 (Scheduled with changes by albertshau <ashau@google.com> and Vlad Hlinskiy <vglinskiy@cybervisiontech.com>)

Responsible

This build has been failing since #299
No one has taken responsibility

Code commits

Author Commit Message Commit date
albertshau <ashau@google.com> albertshau <ashau@google.com> e53fac8e1947c40d5ddfbf815e247e88d2d867ef e53fac8e1947c40d5ddfbf815e247e88d2d867ef Merge pull request #1021 from cdapio/revert-1020-feature/CDAP-15735_Added_tests_for_Array_in_Spanner_plugin
Revert "CDAP-15735 Support all data types in integration tests for Spanner"
albertshau <ashau@google.com> albertshau <ashau@google.com> 9bed0fc6d921b6b2ebd1ad6150d07cb047a0da6e 9bed0fc6d921b6b2ebd1ad6150d07cb047a0da6e Revert "CDAP-15735 Support all data types in integration tests for Spanner"
albertshau <ashau@google.com> albertshau <ashau@google.com> 1613b2626be0a90f53c09112f981216083d2dbbb 1613b2626be0a90f53c09112f981216083d2dbbb Merge pull request #1020 from vladhlinskiy/feature/CDAP-15735_Added_tests_for_Array_in_Spanner_plugin
CDAP-15735 Support all data types in integration tests for Spanner
Vlad Hlinskiy <vglinskiy@cybervisiontech.com> Vlad Hlinskiy <vglinskiy@cybervisiontech.com> 1a0178db3cd282d76d2b479fe13e6d33aeeb191a 1a0178db3cd282d76d2b479fe13e6d33aeeb191a CDAP-15735 Support all data types in integration tests for Spanner
albertshau <ashau@google.com> albertshau <ashau@google.com> 3327f829fe5e740dae1974ba15e73ffd71b219e8 3327f829fe5e740dae1974ba15e73ffd71b219e8 Merge pull request #1019 from vladhlinskiy/feature/CDAP-15731-GCS-Data-Types
CDAP-15731 Support all data types in integration tests for GCS

Tests

New test failures 20
Status Test View job Duration
Collapse Failed HivePluginTest testHivePlugins History
Distro Tests - CDH 5.10 1 sec
java.io.IOException: 500: Unable to validate session
	at io.cdap.cdap.client.util.RESTClient.execute(RESTClient.java:132)
	at io.cdap.cdap.client.util.RESTClient.execute(RESTClient.java:82)
	at io.cdap.cdap.app.etl.ETLTestBase.installPluginFromMarket(ETLTestBase.java:193)
	at io.cdap.cdap.app.etl.batch.HivePluginTest.testHivePlugins(HivePluginTest.java:76)
Collapse Failed HivePluginTest testHivePlugins History
Distro Tests - CDH 5.11 1 sec
java.io.IOException: 500: Unable to validate session
	at io.cdap.cdap.client.util.RESTClient.execute(RESTClient.java:132)
	at io.cdap.cdap.client.util.RESTClient.execute(RESTClient.java:82)
	at io.cdap.cdap.app.etl.ETLTestBase.installPluginFromMarket(ETLTestBase.java:193)
	at io.cdap.cdap.app.etl.batch.HivePluginTest.testHivePlugins(HivePluginTest.java:76)
Collapse Failed HivePluginTest testHivePlugins History
Distro Tests - CDH 5.12 1 sec
java.io.IOException: 500: Unable to validate session
	at io.cdap.cdap.client.util.RESTClient.execute(RESTClient.java:132)
	at io.cdap.cdap.client.util.RESTClient.execute(RESTClient.java:82)
	at io.cdap.cdap.app.etl.ETLTestBase.installPluginFromMarket(ETLTestBase.java:193)
	at io.cdap.cdap.app.etl.batch.HivePluginTest.testHivePlugins(HivePluginTest.java:76)
Collapse Failed HivePluginTest testHivePlugins History
Distro Tests - CDH 5.13 1 sec
java.io.IOException: 500: Unable to validate session
	at io.cdap.cdap.client.util.RESTClient.execute(RESTClient.java:132)
	at io.cdap.cdap.client.util.RESTClient.execute(RESTClient.java:82)
	at io.cdap.cdap.app.etl.ETLTestBase.installPluginFromMarket(ETLTestBase.java:193)
	at io.cdap.cdap.app.etl.batch.HivePluginTest.testHivePlugins(HivePluginTest.java:76)
Collapse Failed HivePluginTest testHivePlugins History
Distro Tests - CDH 5.14 1 sec
java.io.IOException: 500: Unable to validate session
	at io.cdap.cdap.client.util.RESTClient.execute(RESTClient.java:132)
	at io.cdap.cdap.client.util.RESTClient.execute(RESTClient.java:82)
	at io.cdap.cdap.app.etl.ETLTestBase.installPluginFromMarket(ETLTestBase.java:193)
	at io.cdap.cdap.app.etl.batch.HivePluginTest.testHivePlugins(HivePluginTest.java:76)
Collapse Failed HivePluginTest testHivePlugins History
Distro Tests - CDH 5.15 1 sec
java.io.IOException: 500: Unable to validate session
	at io.cdap.cdap.client.util.RESTClient.execute(RESTClient.java:132)
	at io.cdap.cdap.client.util.RESTClient.execute(RESTClient.java:82)
	at io.cdap.cdap.app.etl.ETLTestBase.installPluginFromMarket(ETLTestBase.java:193)
	at io.cdap.cdap.app.etl.batch.HivePluginTest.testHivePlugins(HivePluginTest.java:76)
Collapse Failed HivePluginTest testHivePlugins History
Distro Tests - CDH 5.4 1 sec
java.io.IOException: 500: Unable to validate session
	at io.cdap.cdap.client.util.RESTClient.execute(RESTClient.java:132)
	at io.cdap.cdap.client.util.RESTClient.execute(RESTClient.java:82)
	at io.cdap.cdap.app.etl.ETLTestBase.installPluginFromMarket(ETLTestBase.java:193)
	at io.cdap.cdap.app.etl.batch.HivePluginTest.testHivePlugins(HivePluginTest.java:76)
Collapse Failed HivePluginTest testHivePlugins History
Distro Tests - CDH 5.5 1 sec
java.io.IOException: 500: Unable to validate session
	at io.cdap.cdap.client.util.RESTClient.execute(RESTClient.java:132)
	at io.cdap.cdap.client.util.RESTClient.execute(RESTClient.java:82)
	at io.cdap.cdap.app.etl.ETLTestBase.installPluginFromMarket(ETLTestBase.java:193)
	at io.cdap.cdap.app.etl.batch.HivePluginTest.testHivePlugins(HivePluginTest.java:76)
Collapse Failed HivePluginTest testHivePlugins History
Distro Tests - CDH 5.6 1 sec
java.io.IOException: 500: Unable to validate session
	at io.cdap.cdap.client.util.RESTClient.execute(RESTClient.java:132)
	at io.cdap.cdap.client.util.RESTClient.execute(RESTClient.java:82)
	at io.cdap.cdap.app.etl.ETLTestBase.installPluginFromMarket(ETLTestBase.java:193)
	at io.cdap.cdap.app.etl.batch.HivePluginTest.testHivePlugins(HivePluginTest.java:76)
Collapse Failed HivePluginTest testHivePlugins History
Distro Tests - CDH 5.7 1 sec
java.io.IOException: 500: Unable to validate session
	at io.cdap.cdap.client.util.RESTClient.execute(RESTClient.java:132)
	at io.cdap.cdap.client.util.RESTClient.execute(RESTClient.java:82)
	at io.cdap.cdap.app.etl.ETLTestBase.installPluginFromMarket(ETLTestBase.java:193)
	at io.cdap.cdap.app.etl.batch.HivePluginTest.testHivePlugins(HivePluginTest.java:76)
Collapse Failed HivePluginTest testHivePlugins History
Distro Tests - CDH 5.8 1 sec
java.io.IOException: 500: Unable to validate session
	at io.cdap.cdap.client.util.RESTClient.execute(RESTClient.java:132)
	at io.cdap.cdap.client.util.RESTClient.execute(RESTClient.java:82)
	at io.cdap.cdap.app.etl.ETLTestBase.installPluginFromMarket(ETLTestBase.java:193)
	at io.cdap.cdap.app.etl.batch.HivePluginTest.testHivePlugins(HivePluginTest.java:76)
Collapse Failed HivePluginTest testHivePlugins History
Distro Tests - CDH 5.9 1 sec
java.io.IOException: 500: Unable to validate session
	at io.cdap.cdap.client.util.RESTClient.execute(RESTClient.java:132)
	at io.cdap.cdap.client.util.RESTClient.execute(RESTClient.java:82)
	at io.cdap.cdap.app.etl.ETLTestBase.installPluginFromMarket(ETLTestBase.java:193)
	at io.cdap.cdap.app.etl.batch.HivePluginTest.testHivePlugins(HivePluginTest.java:76)
Collapse Failed HivePluginTest testHivePlugins History
Distro Tests - HDP 2.3 1 sec
java.io.IOException: 500: Unable to validate session
	at io.cdap.cdap.client.util.RESTClient.execute(RESTClient.java:132)
	at io.cdap.cdap.client.util.RESTClient.execute(RESTClient.java:82)
	at io.cdap.cdap.app.etl.ETLTestBase.installPluginFromMarket(ETLTestBase.java:193)
	at io.cdap.cdap.app.etl.batch.HivePluginTest.testHivePlugins(HivePluginTest.java:76)
Collapse Failed HivePluginTest testHivePlugins History
Distro Tests - HDP 2.4 1 sec
java.io.IOException: 500: Unable to validate session
	at io.cdap.cdap.client.util.RESTClient.execute(RESTClient.java:132)
	at io.cdap.cdap.client.util.RESTClient.execute(RESTClient.java:82)
	at io.cdap.cdap.app.etl.ETLTestBase.installPluginFromMarket(ETLTestBase.java:193)
	at io.cdap.cdap.app.etl.batch.HivePluginTest.testHivePlugins(HivePluginTest.java:76)
Collapse Failed HivePluginTest testHivePlugins History
Distro Tests - HDP 2.5 1 sec
java.io.IOException: 500: Unable to validate session
	at io.cdap.cdap.client.util.RESTClient.execute(RESTClient.java:132)
	at io.cdap.cdap.client.util.RESTClient.execute(RESTClient.java:82)
	at io.cdap.cdap.app.etl.ETLTestBase.installPluginFromMarket(ETLTestBase.java:193)
	at io.cdap.cdap.app.etl.batch.HivePluginTest.testHivePlugins(HivePluginTest.java:76)
Collapse Failed HivePluginTest testHivePlugins History
Distro Tests - HDP 2.6 1 sec
java.io.IOException: 500: Unable to validate session
	at io.cdap.cdap.client.util.RESTClient.execute(RESTClient.java:132)
	at io.cdap.cdap.client.util.RESTClient.execute(RESTClient.java:82)
	at io.cdap.cdap.app.etl.ETLTestBase.installPluginFromMarket(ETLTestBase.java:193)
	at io.cdap.cdap.app.etl.batch.HivePluginTest.testHivePlugins(HivePluginTest.java:76)
Collapse Failed HivePluginTest testHivePlugins History
Distro Tests - MapR 5.1 1 sec
java.io.IOException: 500: Unable to validate session
	at io.cdap.cdap.client.util.RESTClient.execute(RESTClient.java:132)
	at io.cdap.cdap.client.util.RESTClient.execute(RESTClient.java:82)
	at io.cdap.cdap.app.etl.ETLTestBase.installPluginFromMarket(ETLTestBase.java:193)
	at io.cdap.cdap.app.etl.batch.HivePluginTest.testHivePlugins(HivePluginTest.java:76)
Collapse Failed HivePluginTest testHivePlugins History
Distro Tests - MapR 5.2 MEP 1.1 1 sec
java.io.IOException: 500: Unable to validate session
	at io.cdap.cdap.client.util.RESTClient.execute(RESTClient.java:132)
	at io.cdap.cdap.client.util.RESTClient.execute(RESTClient.java:82)
	at io.cdap.cdap.app.etl.ETLTestBase.installPluginFromMarket(ETLTestBase.java:193)
	at io.cdap.cdap.app.etl.batch.HivePluginTest.testHivePlugins(HivePluginTest.java:76)
Fixed tests 2
Status Test Failing since View job Duration
Successful TPFSParquetSinkSourceTest testSpark History
Failing since build #300 (Scheduled with changes by albertshau <ashau@google.com>) Distro Tests - CDH 5.14 5 mins
Successful WorkflowTest test History
Failing since build #300 (Scheduled with changes by albertshau <ashau@google.com>) Distro Tests - CDH 5.12 2 mins

JIRA issues

IssueDescriptionStatus
1 more issue…
Unknown Issue TypeCDAP-15643Could not obtain issue details from JIRA
Unknown Issue TypeCDAP-15644Could not obtain issue details from JIRA
Unknown Issue TypeCDAP-15731Could not obtain issue details from JIRA
Unknown Issue TypeCDAP-15734Could not obtain issue details from JIRA
Unknown Issue TypeCDAP-15735Could not obtain issue details from JIRA